{"text_format":"3","workbook":"xlsx","n_sheets":8,"sheets":["Cover Page","HRSA 100-1-A CHILDREN'S HOSP ID","HRSA 100-1-B CH GME PROG STATUS","HRSA 100-1-C NO. OF TRAINEES SI","HRSA 100-1-D NO OF TRAINEES ROT","HRSA 100-1-E LIST OF PROGRAMS",".",".."],"not_rendered":{"macros":1,"defined_names":12},"read":"whole","date_system":"1900"}

{"sheet":"Cover Page","index":0,"n_rows":23,"n_cols":7,"rows_kept":23,"merged":[[0,6,0,8],[1,6,1,8],[3,1,13,8],[19,1,21,8],[22,1,35,8]]}
["Department of Health and Human Services",{"$nulls":5},"OMB No. 0915-0313"]
["Health Resources and Services Administration",{"$nulls":5},"Expiration Date:  11/30/2013"]
[]
[null,"\n\n\nCHILDREN’S HOSPITALS GRADUATE MEDICAL EDUCATION PAYMENT PROGRAM\n\nANNUAL REPORT FORM HRSA 100-1\n"]
{"$rows_empty":15}
[null,"Public Burden Statement"]
[]
[]
[null,"An agency may not conduct or sponsor, and a person is not required to respond to, a collection of information unless it displays a currently valid OMB control number.  The OMB control number for this project is 0915-0313.  Public reporting burden for the applicant for this collection of information is estimated to average 9.2 hours per response, including the time for reviewing instructions, searching existing data sources, gathering and maintaining the data needed, and completing and reviewing the collection of information.  Send comments regarding this burden estimate or any other aspect of this collection of information, including suggestions for reducing this burden, to HRSA Reports Clearance Officer, 5600 Fishers Lane, Room 14 33, Rockville, Maryland, 20857."]

{"sheet":"HRSA 100-1-A CHILDREN'S HOSP ID","index":1,"n_rows":31,"n_cols":3,"rows_kept":31,"merged":[[3,0,3,1],[4,0,4,1],[15,0,15,1],[30,0,30,1]]}
["Department of Health and Human Services","OMB No.  0915-0313"]
["Health Resources and Services Administration","Expiration Date:  11/30/2013"]
["See detailed guidance for complete instructions."]
["Children's Hospitals Graduate Medical Education Payment Program"]
["HRSA 100-1-A:  Children's Hospital Identification Information"]
["Name of Children's Hospital"]
["Address"]
["City"]
["State"]
["Zip Code"]
["Medicare Provider Number",null," "]
["Relevant fiscal year for application","FY2013"]
["Relevant academic year for application ","July 1, 2011 - June 30, 2012"]
["Year your hospital first received CHGME funding"]
["Submission Date of Annual Report"]
["Indicate years in which hospital received any CHGME funding :"]
[null,false]
[null,false]
[null,false]
[null,false]
[null,false]
[null,false]
[null,false]
[null,false]
[null,false]
[null,false]
[null,false]
[null,false]
[null,false]
["Type of Application",1]
[false]

{"sheet":"HRSA 100-1-B CH GME PROG STATUS","index":2,"n_rows":119,"n_cols":8,"rows_kept":119,"merged":[[0,0,0,1],[1,0,1,1],[3,0,3,7],[4,1,4,7],[5,1,5,7],[6,1,6,7],[7,0,7,3],[7,5,7,7],[8,0,14,7],[15,0,16,0],[15,1,15,3],[15,5,15,7],[17,0,17,7],[20,0,20,7],[27,0,27,7],[47,0,47,7],[55,0,55,7],[64,0,64,7],[118,0,118,7]]}
["Department of Health and Human Services",{"$nulls":6},"OMB No. 0915-0313"]
["Health Resources and Services Administration",{"$nulls":6},"Expiration Date:  11/30/2013"]
["Children's Hospitals Graduate Medical Education Payment Program"]
["HRSA 100-1-B:  Children’s Hospital GME Training Program Status and Change"]
["Hospital Name:",{"$f":"'HRSA 100-1-A CHILDREN''S HOSP ID'!B6","v":0}]
["Medicare Provider Number:",{"$f":"+'HRSA 100-1-A CHILDREN''S HOSP ID'!B11","v":{"v":0,"d":"00-0000"}}]
["Date of Report:",{"$f":"+'HRSA 100-1-A CHILDREN''S HOSP ID'!B15","v":"00:00:00"}]
["How many outside institutions send residents to your hospital?"]
["The table below asks about the accreditation status of your GME programs and whether a  program has been added or dropped since the previous academic year.  There must be at least two check marks in each row that lists the name of a program. \n\nProgram Status: For each of the programs listed (and for any additional program in which training is offered), check the box indicating whether the program is sponsored by the hospital and/or whether the hospital serves as a major participating institution/rotation site for the program, including programs without residents actively rotating during the relevant academic year.  (Check all that apply.)  If your children’s hospital is not involved in a given program, check “not offered.”\n\nProgram Change: Also indicate whether each program was added or dropped since the previous academic year by checking the appropriate box.   Only indicate a program has been added if it has been newly accredited since the previous academic year.  Only indicate a program has been dropped if it has voluntarily or involuntarily lost accreditation since the previous academic year.  If a program was neither added nor dropped, check “no change.” \n\nIf you need to add additional programs, please use the “Other: Specify” option at the end of the table and follow the same directions as above.\n\nEach row of this table should have at least one check mark in the Program Status section and one check mark in the Program Change section. See detailed guidance for complete instructions and examples.\n"]
[]
[]
[]
[]
[]
[]
[null,"PROGRAM STATUS 2011-2012",{"$nulls":3},"PROGRAM CHANGE SINCE 2010-2011"]
[null,"Sponsoring Program","Major Participating Institution or Rotation Site/Other Participating Institution","Not Offered",null,"Program Added Since 2010-2011","Program Dropped Since 2010-2011","No Change"]
["Primary Care Programs"]
["Family Medicine"]
["Pediatrics"]
["Combined Programs"]
["Internal Medicine /Pediatrics"]
["Pediatrics/Dermatology"]
["Pediatrics/Emergency Medicine"]
["Pediatrics/Medical Genetics"]
["Pediatrics/Physical Medicine and Rehab"]
["Pediatrics/Psychiatry/Child & Adolescent Psych"]
["Pediatric Medical Subspecialties"]
["Adolescent Medicine Pediatrics"]
["Child Abuse Pediatrics"]
["Developmental Behavioral Pediatrics"]
["Hospice and Palliative Medicine"]
["Medical Toxicology"]
["Neonatal-Perinatal Medicine"]
["Neurodevelopmental Disabilities"]
["Pediatric Cardiology"]
["Pediatric Critical Care Medicine"]
["Pediatric Emergency Medicine"]
["Pediatric Endocrinology"]
["Pediatric Gastroenterology"]
{"$rows_left_out":80}
{"sheet":"HRSA 100-1-C NO. OF TRAINEES SI","index":3,"n_rows":112,"n_cols":5,"rows_kept":112,"merged":[[0,0,0,1],[1,0,1,1],[2,0,2,4],[3,0,3,4],[4,1,4,4],[5,1,5,4],[6,1,6,4],[7,0,7,4],[8,0,8,4],[10,0,10,4],[13,0,13,4],[20,0,20,4],[40,0,40,4],[48,0,48,4],[57,0,57,4],[111,0,111,4],[112,0,112,4],[115,0,115,3]]}
["Department of Health and Human Services",{"$nulls":3},"OMB No.  0915-0313"]
["Health Resources and Services Administration",{"$nulls":3},"Expiration Date:  11/30/2013"]
["Children's Hospitals Graduate Medical Education Payment Program"]
["HRSA 100-1-C:  Number of FTE Trainees - Sponsoring Institution"]
["Hospital Name:",{"$f":"+'HRSA 100-1-A CHILDREN''S HOSP ID'!B6","v":0}]
[{"$f":"+'HRSA 100-1-B CH GME PROG STATUS'!A6","v":"Medicare Provider Number:"},{"$f":"+'HRSA 100-1-A CHILDREN''S HOSP ID'!B11","v":{"v":0,"d":"00-0000"}}]
[{"$f":"+'HRSA 100-1-B CH GME PROG STATUS'!A7","v":"Date of Report:"},{"$f":"+'HRSA 100-1-A CHILDREN''S HOSP ID'!B15","v":"00:00:00"}]
["For each accredited GME program for which your children’s hospital is a  sponsoring institution, please indicate the number of approved FTE resident positions, the number of FTE resident positions recruited to fill, number of FTE resident positions filled, and number of residents in FTE training positions in your hospital. Only the programs that are checked on \"HRSA 100-1-B Children's Hospital Program Status\" appear and should be completed. Please report the total number across all PGY years. "]
["The number of approved (accredited) positions assigned to sponsoring institutions only should be entered in the first column.  The number of positions the program actively recruited to fill in the most recent academic year should be entered in the second column.  The third column is the total number of positions filled for all PGY years.  The fourth column is the number of residents (people) in FTE positions in the most recent academic year.  Please see guidance for detailed instructions and examples."]
[null,"Number of Approved  Positions                  (2011-2012)","Number of Recruited Positions    (2011-2012)","Number of  Positions Filled for the Total Program (2011-2012)","Number of Residents in FTE Training Positions (2011-2012)"]
["Primary Care Programs"]
[{"$f":"IF('HRSA 100-1-B CH GME PROG STATUS'!B19=\"a\",'HRSA 100-1-B CH GME PROG STATUS'!A19,\"N/A\")","v":"N/A"}]
[{"$f":"IF('HRSA 100-1-B CH GME PROG STATUS'!B20=\"a\",'HRSA 100-1-B CH GME PROG STATUS'!A20,\"N/A\")","v":"N/A"}]
["Combined Programs"]
[{"$f":"IF('HRSA 100-1-B CH GME PROG STATUS'!B22=\"a\",'HRSA 100-1-B CH GME PROG STATUS'!A22,\"N/A\")","v":"N/A"}]
[{"$f":"IF('HRSA 100-1-B CH GME PROG STATUS'!B23=\"a\",'HRSA 100-1-B CH GME PROG STATUS'!A23,\"N/A\")","v":"N/A"}]
[{"$f":"IF('HRSA 100-1-B CH GME PROG STATUS'!B24=\"a\",'HRSA 100-1-B CH GME PROG STATUS'!A24,\"N/A\")","v":"N/A"}]
[{"$f":"IF('HRSA 100-1-B CH GME PROG STATUS'!B25=\"a\",'HRSA 100-1-B CH GME PROG STATUS'!A25,\"N/A\")","v":"N/A"}]
[{"$f":"IF('HRSA 100-1-B CH GME PROG STATUS'!B26=\"a\",'HRSA 100-1-B CH GME PROG STATUS'!A26,\"N/A\")","v":"N/A"}]
[{"$f":"IF('HRSA 100-1-B CH GME PROG STATUS'!B27=\"a\",'HRSA 100-1-B CH GME PROG STATUS'!A27,\"N/A\")","v":"N/A"}]
["Pediatric Medical Subspecialties"]
[{"$f":"IF('HRSA 100-1-B CH GME PROG STATUS'!B29=\"a\",'HRSA 100-1-B CH GME PROG STATUS'!A29,\"N/A\")","v":"N/A"}]
[{"$f":"IF('HRSA 100-1-B CH GME PROG STATUS'!B30=\"a\",'HRSA 100-1-B CH GME PROG STATUS'!A30,\"N/A\")","v":"N/A"}]
[{"$f":"IF('HRSA 100-1-B CH GME PROG STATUS'!B31=\"a\",'HRSA 100-1-B CH GME PROG STATUS'!A31,\"N/A\")","v":"N/A"}]
[{"$f":"IF('HRSA 100-1-B CH GME PROG STATUS'!B32=\"a\",'HRSA 100-1-B CH GME PROG STATUS'!A32,\"N/A\")","v":"N/A"}]
[{"$f":"IF('HRSA 100-1-B CH GME PROG STATUS'!B33=\"a\",'HRSA 100-1-B CH GME PROG STATUS'!A33,\"N/A\")","v":"N/A"}]
[{"$f":"IF('HRSA 100-1-B CH GME PROG STATUS'!B34=\"a\",'HRSA 100-1-B CH GME PROG STATUS'!A34,\"N/A\")","v":"N/A"}]
[{"$f":"IF('HRSA 100-1-B CH GME PROG STATUS'!B35=\"a\",'HRSA 100-1-B CH GME PROG STATUS'!A35,\"N/A\")","v":"N/A"}]
[{"$f":"IF('HRSA 100-1-B CH GME PROG STATUS'!B36=\"a\",'HRSA 100-1-B CH GME PROG STATUS'!A36,\"N/A\")","v":"N/A"}]
[{"$f":"IF('HRSA 100-1-B CH GME PROG STATUS'!B37=\"a\",'HRSA 100-1-B CH GME PROG STATUS'!A37,\"N/A\")","v":"N/A"}]
[{"$f":"IF('HRSA 100-1-B CH GME PROG STATUS'!B38=\"a\",'HRSA 100-1-B CH GME PROG STATUS'!A38,\"N/A\")","v":"N/A"}]
[{"$f":"IF('HRSA 100-1-B CH GME PROG STATUS'!B39=\"a\",'HRSA 100-1-B CH GME PROG STATUS'!A39,\"N/A\")","v":"N/A"}]
[{"$f":"IF('HRSA 100-1-B CH GME PROG STATUS'!B40=\"a\",'HRSA 100-1-B CH GME PROG STATUS'!A40,\"N/A\")","v":"N/A"}]
[{"$f":"IF('HRSA 100-1-B CH GME PROG STATUS'!B41=\"a\",'HRSA 100-1-B CH GME PROG STATUS'!A41,\"N/A\")","v":"N/A"}]
[{"$f":"IF('HRSA 100-1-B CH GME PROG STATUS'!B42=\"a\",'HRSA 100-1-B CH GME PROG STATUS'!A42,\"N/A\")","v":"N/A"}]
[{"$f":"IF('HRSA 100-1-B CH GME PROG STATUS'!B43=\"a\",'HRSA 100-1-B CH GME PROG STATUS'!A43,\"N/A\")","v":"N/A"}]
[{"$f":"IF('HRSA 100-1-B CH GME PROG STATUS'!B44=\"a\",'HRSA 100-1-B CH GME PROG STATUS'!A44,\"N/A\")","v":"N/A"}]
[{"$f":"IF('HRSA 100-1-B CH GME PROG STATUS'!B45=\"a\",'HRSA 100-1-B CH GME PROG STATUS'!A45,\"N/A\")","v":"N/A"}]
[{"$f":"IF('HRSA 100-1-B CH GME PROG STATUS'!B46=\"a\",'HRSA 100-1-B CH GME PROG STATUS'!A46,\"N/A\")","v":"N/A"}]
[{"$f":"IF('HRSA 100-1-B CH GME PROG STATUS'!B47=\"a\",'HRSA 100-1-B CH GME PROG STATUS'!A47,\"N/A\")","v":"N/A"}]
{"$rows_left_out":73}
{"sheet":"HRSA 100-1-D NO OF TRAINEES ROT","index":4,"n_rows":117,"n_cols":6,"rows_kept":117,"merged":[[0,0,0,1],[1,0,1,1],[2,0,2,5],[3,0,3,5],[4,1,4,5],[5,1,5,5],[6,1,6,5],[8,0,8,5],[9,0,10,5],[12,0,12,5],[13,0,13,5],[15,0,15,5],[18,0,18,5],[25,0,25,5],[45,0,45,5],[53,0,53,5],[62,0,62,5],[116,0,116,5]]}
["Department of Health and Human Services",{"$nulls":4},"OMB No.  0915-0313"]
["Health Resources and Services Administration",{"$nulls":4},"Expiration Date:  11/30/2013"]
["Children's Hospitals Graduate Medical Education Payment Program"]
["HRSA 100-1-D  Major Participating Institutions and Rotation Sites - Number of FTE Trainees Meeting 75% Standard"]
["Hospital Name:",{"$f":"+'HRSA 100-1-A CHILDREN''S HOSP ID'!B6","v":0}]
[{"$f":"+'HRSA 100-1-C NO. OF TRAINEES SI'!A6","v":"Medicare Provider Number:"},{"$f":"+'HRSA 100-1-A CHILDREN''S HOSP ID'!B11","v":{"v":0,"d":"00-0000"}}]
[{"$f":"+'HRSA 100-1-C NO. OF TRAINEES SI'!A7","v":"Date of Report:"},{"$f":"+'HRSA 100-1-A CHILDREN''S HOSP ID'!B15","v":"00:00:00"}]
[]
["Complete the required row information for the highlighted GME program(s). If your hospital is  not a major participating institution or rotation site for any GME training programs, no GME training program(s) will be identified or highlighted and you should proceed to the next worksheet (HRSA 100-1-E).  For each GME program for which your children’s hospital is a major participating institution or a rotation site, please indicate the number of approved positions assigned to major participating institutions only, the number of  positions recruited to fill in the most recent academic year (2011-2012), the number of approved positions filled in the most recent academic year, the total number of residents rotating in the program for any length of time, and the number of FTEs for which the trainee spends more than 75 percent of their training time training under your hospital's supervision.  Do not submit the number of approved positions assigned to the resident's sponsoring institution. The first three column headings refer to approved, recruited, and filled positions only.  The last two (fourth and fifth) column headings refer to residents (people).  If you do not have any approved positions or you have not recruited for any positions, place a \"0\" in the first three columns.  Report on number of residents (people, not positions) in the last two columns.  See detailed guidance for complete instructions."]
[]
[]
[]
[]
[]
[null,"Number of Approved Positions   (2011-2012)","Number of Recruited Positions  (2011-2012)","Number of Approved Positions Filled         (2011-2012)","Number of Residents Rotating through Programs        (2011-2012)","Number of Trainees Spending ³ 75% under Children’s Hospital Supervision              (2011-2012)"]
["Primary Care Programs"]
[{"$f":"IF('HRSA 100-1-B CH GME PROG STATUS'!C19=\"a\",'HRSA 100-1-B CH GME PROG STATUS'!A19,\"N/A\")","v":"N/A"}]
[{"$f":"IF('HRSA 100-1-B CH GME PROG STATUS'!C20=\"a\",'HRSA 100-1-B CH GME PROG STATUS'!A20,\"N/A\")","v":"N/A"}]
["Combined Programs"]
[{"$f":"IF('HRSA 100-1-B CH GME PROG STATUS'!C22=\"a\",'HRSA 100-1-B CH GME PROG STATUS'!A22,\"N/A\")","v":"N/A"}]
[{"$f":"IF('HRSA 100-1-B CH GME PROG STATUS'!C23=\"a\",'HRSA 100-1-B CH GME PROG STATUS'!A23,\"N/A\")","v":"N/A"}]
[{"$f":"IF('HRSA 100-1-B CH GME PROG STATUS'!C24=\"a\",'HRSA 100-1-B CH GME PROG STATUS'!A24,\"N/A\")","v":"N/A"}]
[{"$f":"IF('HRSA 100-1-B CH GME PROG STATUS'!C25=\"a\",'HRSA 100-1-B CH GME PROG STATUS'!A25,\"N/A\")","v":"N/A"}]
[{"$f":"IF('HRSA 100-1-B CH GME PROG STATUS'!C26=\"a\",'HRSA 100-1-B CH GME PROG STATUS'!A26,\"N/A\")","v":"N/A"}]
[{"$f":"IF('HRSA 100-1-B CH GME PROG STATUS'!C27=\"a\",'HRSA 100-1-B CH GME PROG STATUS'!A27,\"N/A\")","v":"N/A"}]
["Pediatric Medical Subspecialties"]
[{"$f":"IF('HRSA 100-1-B CH GME PROG STATUS'!C29=\"a\",'HRSA 100-1-B CH GME PROG STATUS'!A29,\"N/A\")","v":"N/A"}]
[{"$f":"IF('HRSA 100-1-B CH GME PROG STATUS'!C30=\"a\",'HRSA 100-1-B CH GME PROG STATUS'!A30,\"N/A\")","v":"N/A"}]
[{"$f":"IF('HRSA 100-1-B CH GME PROG STATUS'!C31=\"a\",'HRSA 100-1-B CH GME PROG STATUS'!A31,\"N/A\")","v":"N/A"}]
[{"$f":"IF('HRSA 100-1-B CH GME PROG STATUS'!C32=\"a\",'HRSA 100-1-B CH GME PROG STATUS'!A32,\"N/A\")","v":"N/A"}]
[{"$f":"IF('HRSA 100-1-B CH GME PROG STATUS'!C33=\"a\",'HRSA 100-1-B CH GME PROG STATUS'!A33,\"N/A\")","v":"N/A"}]
[{"$f":"IF('HRSA 100-1-B CH GME PROG STATUS'!C34=\"a\",'HRSA 100-1-B CH GME PROG STATUS'!A34,\"N/A\")","v":"N/A"}]
[{"$f":"IF('HRSA 100-1-B CH GME PROG STATUS'!C35=\"a\",'HRSA 100-1-B CH GME PROG STATUS'!A35,\"N/A\")","v":"N/A"}]
[{"$f":"IF('HRSA 100-1-B CH GME PROG STATUS'!C36=\"a\",'HRSA 100-1-B CH GME PROG STATUS'!A36,\"N/A\")","v":"N/A"}]
[{"$f":"IF('HRSA 100-1-B CH GME PROG STATUS'!C37=\"a\",'HRSA 100-1-B CH GME PROG STATUS'!A37,\"N/A\")","v":"N/A"}]
[{"$f":"IF('HRSA 100-1-B CH GME PROG STATUS'!C38=\"a\",'HRSA 100-1-B CH GME PROG STATUS'!A38,\"N/A\")","v":"N/A"}]
[{"$f":"IF('HRSA 100-1-B CH GME PROG STATUS'!C39=\"a\",'HRSA 100-1-B CH GME PROG STATUS'!A39,\"N/A\")","v":"N/A"}]
[{"$f":"IF('HRSA 100-1-B CH GME PROG STATUS'!C40=\"a\",'HRSA 100-1-B CH GME PROG STATUS'!A40,\"N/A\")","v":"N/A"}]
[{"$f":"IF('HRSA 100-1-B CH GME PROG STATUS'!C41=\"a\",'HRSA 100-1-B CH GME PROG STATUS'!A41,\"N/A\")","v":"N/A"}]
[{"$f":"IF('HRSA 100-1-B CH GME PROG STATUS'!C42=\"a\",'HRSA 100-1-B CH GME PROG STATUS'!A42,\"N/A\")","v":"N/A"}]
{"$rows_left_out":78}
{"sheet":"HRSA 100-1-E LIST OF PROGRAMS","index":5,"n_rows":106,"n_cols":6,"rows_kept":106,"merged":[[0,1,0,2],[1,1,1,2],[2,1,2,5],[3,1,3,5],[4,2,4,5],[5,2,5,5],[6,2,6,5],[7,1,7,5]]}
[null,"Department of Health and Human Services",{"$nulls":3},"OMB No. 0915-0313"]
[null,"Health Resources and Services Administration",{"$nulls":3},"Expiration Date:  11/30/2013"]
[null,"Children's Hospitals Graduate Medical Education Payment Program"]
[null,"HRSA 100-1-E:  Programs for which an Annual Report is Required"]
[null,"Hospital Name:",{"$f":"+'HRSA 100-1-A CHILDREN''S HOSP ID'!B6","v":0}]
[null,{"$f":"+'HRSA 100-1-D NO OF TRAINEES ROT'!A6","v":"Medicare Provider Number:"},{"$f":"+'HRSA 100-1-A CHILDREN''S HOSP ID'!B11","v":{"v":0,"d":"00-0000"}}]
[null,{"$f":"+'HRSA 100-1-D NO OF TRAINEES ROT'!A7","v":"Date of Report:"},{"$f":"+'HRSA 100-1-A CHILDREN''S HOSP ID'!B15","v":"00:00:00"}]
[null,"For each program listed below, you must complete the HRSA 100-2 with hospital level data and one HRSA 100-3 for each program listed.  Be sure to scroll to the bottom of worksheet to see all highlighted programs.  See detailed guidance for complete instructions.  "]
[null," "]
[{"$f":"1","v":1},{"$f":"IF(C10,'HRSA 100-1-B CH GME PROG STATUS'!A19,\"N/A\")","v":"N/A"},{"$f":"OR('HRSA 100-1-C NO. OF TRAINEES SI'!E12>0,'HRSA 100-1-D NO OF TRAINEES ROT'!F17>0)","v":false}]
[{"$f":"1+A10","v":2},{"$f":"IF(C11,'HRSA 100-1-B CH GME PROG STATUS'!A20,\"N/A\")","v":"N/A"},{"$f":"OR('HRSA 100-1-C NO. OF TRAINEES SI'!E13>0,'HRSA 100-1-D NO OF TRAINEES ROT'!F18>0)","v":false}]
[{"$f":"1+A11","v":3},{"$f":"IF(C12,'HRSA 100-1-B CH GME PROG STATUS'!A22,\"N/A\")","v":"N/A"},{"$f":"OR('HRSA 100-1-C NO. OF TRAINEES SI'!E15>0,'HRSA 100-1-D NO OF TRAINEES ROT'!F20>0)","v":false}]
[4,{"$f":"IF(C13,'HRSA 100-1-B CH GME PROG STATUS'!A23,\"N/A\")","v":"N/A"},{"$f":"OR('HRSA 100-1-C NO. OF TRAINEES SI'!E16>0,'HRSA 100-1-D NO OF TRAINEES ROT'!F21>0)","v":false}]
[5,{"$f":"IF(C14,'HRSA 100-1-B CH GME PROG STATUS'!A24,\"N/A\")","v":"N/A"},{"$f":"OR('HRSA 100-1-C NO. OF TRAINEES SI'!E17>0,'HRSA 100-1-D NO OF TRAINEES ROT'!F22>0)","v":false}]
[6,{"$f":"IF(C15,'HRSA 100-1-B CH GME PROG STATUS'!A25,\"N/A\")","v":"N/A"},{"$f":"OR('HRSA 100-1-C NO. OF TRAINEES SI'!E18>0,'HRSA 100-1-D NO OF TRAINEES ROT'!F23>0)","v":false}]
[7,{"$f":"IF(C16,'HRSA 100-1-B CH GME PROG STATUS'!A26,\"N/A\")","v":"N/A"},{"$f":"OR('HRSA 100-1-C NO. OF TRAINEES SI'!E19>0,'HRSA 100-1-D NO OF TRAINEES ROT'!F24>0)","v":false}]
[8,{"$f":"IF(C17,'HRSA 100-1-B CH GME PROG STATUS'!A27,\"N/A\")","v":"N/A"},{"$f":"OR('HRSA 100-1-C NO. OF TRAINEES SI'!E20>0,'HRSA 100-1-D NO OF TRAINEES ROT'!F25>0)","v":false}]
[9,{"$f":"IF(C18,'HRSA 100-1-B CH GME PROG STATUS'!A29,\"N/A\")","v":"N/A"},{"$f":"OR('HRSA 100-1-C NO. OF TRAINEES SI'!E22>0,'HRSA 100-1-D NO OF TRAINEES ROT'!F27>0)","v":false}]
[10,{"$f":"IF(C19,'HRSA 100-1-B CH GME PROG STATUS'!A30,\"N/A\")","v":"N/A"},{"$f":"OR('HRSA 100-1-C NO. OF TRAINEES SI'!E23>0,'HRSA 100-1-D NO OF TRAINEES ROT'!F28>0)","v":false}]
[11,{"$f":"IF(C20,'HRSA 100-1-B CH GME PROG STATUS'!A31,\"N/A\")","v":"N/A"},{"$f":"OR('HRSA 100-1-C NO. OF TRAINEES SI'!E24>0,'HRSA 100-1-D NO OF TRAINEES ROT'!F29>0)","v":false}]
[12,{"$f":"IF(C21,'HRSA 100-1-B CH GME PROG STATUS'!A32,\"N/A\")","v":"N/A"},{"$f":"OR('HRSA 100-1-C NO. OF TRAINEES SI'!E25>0,'HRSA 100-1-D NO OF TRAINEES ROT'!F30>0)","v":false}]
[13,{"$f":"IF(C22,'HRSA 100-1-B CH GME PROG STATUS'!A33,\"N/A\")","v":"N/A"},{"$f":"OR('HRSA 100-1-C NO. OF TRAINEES SI'!E26>0,'HRSA 100-1-D NO OF TRAINEES ROT'!F31>0)","v":false}]
[14,{"$f":"IF(C23,'HRSA 100-1-B CH GME PROG STATUS'!A34,\"N/A\")","v":"N/A"},{"$f":"OR('HRSA 100-1-C NO. OF TRAINEES SI'!E27>0,'HRSA 100-1-D NO OF TRAINEES ROT'!F32>0)","v":false}]
[15,{"$f":"IF(C24,'HRSA 100-1-B CH GME PROG STATUS'!A35,\"N/A\")","v":"N/A"},{"$f":"OR('HRSA 100-1-C NO. OF TRAINEES SI'!E28>0,'HRSA 100-1-D NO OF TRAINEES ROT'!F33>0)","v":false}]
[16,{"$f":"IF(C25,'HRSA 100-1-B CH GME PROG STATUS'!A36,\"N/A\")","v":"N/A"},{"$f":"OR('HRSA 100-1-C NO. OF TRAINEES SI'!E29>0,'HRSA 100-1-D NO OF TRAINEES ROT'!F34>0)","v":false}]
[17,{"$f":"IF(C26,'HRSA 100-1-B CH GME PROG STATUS'!A37,\"N/A\")","v":"N/A"},{"$f":"OR('HRSA 100-1-C NO. OF TRAINEES SI'!E30>0,'HRSA 100-1-D NO OF TRAINEES ROT'!F35>0)","v":false}]
[18,{"$f":"IF(C27,'HRSA 100-1-B CH GME PROG STATUS'!A38,\"N/A\")","v":"N/A"},{"$f":"OR('HRSA 100-1-C NO. OF TRAINEES SI'!E31>0,'HRSA 100-1-D NO OF TRAINEES ROT'!F36>0)","v":false}]
[19,{"$f":"IF(C28,'HRSA 100-1-B CH GME PROG STATUS'!A39,\"N/A\")","v":"N/A"},{"$f":"OR('HRSA 100-1-C NO. OF TRAINEES SI'!E32>0,'HRSA 100-1-D NO OF TRAINEES ROT'!F37>0)","v":false}]
[20,null,{"$f":"OR('HRSA 100-1-C NO. OF TRAINEES SI'!E33>0,'HRSA 100-1-D NO OF TRAINEES ROT'!F38>0)","v":false}]
[21,{"$f":"IF(C30,'HRSA 100-1-B CH GME PROG STATUS'!A41,\"N/A\")","v":"N/A"},{"$f":"OR('HRSA 100-1-C NO. OF TRAINEES SI'!E34>0,'HRSA 100-1-D NO OF TRAINEES ROT'!F39>0)","v":false}]
[22,{"$f":"IF(C31,'HRSA 100-1-B CH GME PROG STATUS'!A42,\"N/A\")","v":"N/A"},{"$f":"OR('HRSA 100-1-C NO. OF TRAINEES SI'!E35>0,'HRSA 100-1-D NO OF TRAINEES ROT'!F40>0)","v":false}]
[23,{"$f":"IF(C32,'HRSA 100-1-B CH GME PROG STATUS'!A43,\"N/A\")","v":"N/A"},{"$f":"OR('HRSA 100-1-C NO. OF TRAINEES SI'!E36>0,'HRSA 100-1-D NO OF TRAINEES ROT'!F41>0)","v":false}]
[24,{"$f":"IF(C33,'HRSA 100-1-B CH GME PROG STATUS'!A44,\"N/A\")","v":"N/A"},{"$f":"OR('HRSA 100-1-C NO. OF TRAINEES SI'!E37>0,'HRSA 100-1-D NO OF TRAINEES ROT'!F42>0)","v":false}]
[25,{"$f":"IF(C34,'HRSA 100-1-B CH GME PROG STATUS'!A45,\"N/A\")","v":"N/A"},{"$f":"OR('HRSA 100-1-C NO. OF TRAINEES SI'!E38>0,'HRSA 100-1-D NO OF TRAINEES ROT'!F43>0)","v":false}]
[26,{"$f":"IF(C35,'HRSA 100-1-B CH GME PROG STATUS'!A46,\"N/A\")","v":"N/A"},{"$f":"OR('HRSA 100-1-C NO. OF TRAINEES SI'!E39>0,'HRSA 100-1-D NO OF TRAINEES ROT'!F44>0)","v":false}]
[27,{"$f":"IF(C36,'HRSA 100-1-B CH GME PROG STATUS'!A47,\"N/A\")","v":"N/A"},{"$f":"OR('HRSA 100-1-C NO. OF TRAINEES SI'!E40>0,'HRSA 100-1-D NO OF TRAINEES ROT'!F45>0)","v":false}]
[28,{"$f":"IF(C37,'HRSA 100-1-B CH GME PROG STATUS'!A49,\"N/A\")","v":"N/A"},{"$f":"OR('HRSA 100-1-C NO. OF TRAINEES SI'!E42>0,'HRSA 100-1-D NO OF TRAINEES ROT'!F47>0)","v":false}]
[29,{"$f":"IF(C38,'HRSA 100-1-B CH GME PROG STATUS'!A50,\"N/A\")","v":"N/A"},{"$f":"OR('HRSA 100-1-C NO. OF TRAINEES SI'!E43>0,'HRSA 100-1-D NO OF TRAINEES ROT'!F48>0)","v":false}]
[30,{"$f":"IF(C39,'HRSA 100-1-B CH GME PROG STATUS'!A51,\"N/A\")","v":"N/A"},{"$f":"OR('HRSA 100-1-C NO. OF TRAINEES SI'!E44>0,'HRSA 100-1-D NO OF TRAINEES ROT'!F49>0)","v":false}]
[31,{"$f":"IF(C40,'HRSA 100-1-B CH GME PROG STATUS'!A52,\"N/A\")","v":"N/A"},{"$f":"OR('HRSA 100-1-C NO. OF TRAINEES SI'!E45>0,'HRSA 100-1-D NO OF TRAINEES ROT'!F50>0)","v":false}]
{"$rows_left_out":67}
{"sheet":".","index":6,"n_rows":2,"n_cols":1,"rows_kept":2}
["Initial completion of annual report "]
["Data missing from initial application"]

{"sheet":"..","index":7,"n_rows":145,"n_cols":3,"rows_kept":145}
[null,"Program Number","Program Label"]
[null,1,"Other (specify):"]
[null,{"$f":"B2+1","v":2},"Other:  ABA Alternative Pathway (Anesthesia)"]
[null,{"$f":"B3+1","v":3},"Other:  Addiction Psychiatry"]
[null,4,"Other:  Adolescent Bariatric Surgery"]
[null,5,"Other:  Adolescent Medicine"]
[null,6,"Other:  Adult Cardiothoracic Anesthesiology"]
[null,7,"Other:  Adult Congenital Heart Disease"]
[null,8,"Other:  Adult Transplant Hepatology"]
[null,9,"Other:  Advanced General Dentistry"]
[null,10,"Other:  Advanced Pediatric Hematology/ Oncology Neurooncology"]
[null,11,"Other:  Advanced Pediatric Hematology/ Oncology Stem Cell Transplantation"]
[null,12,"Other:  Anesthesia/Pain Medicine"]
[null,13,"Other:  Anesthesiology/ Critical Care Medicine"]
[null,14,"Other:  Body MRI"]
[null,15,"Other:  Bone & Marrow Transplantation"]
[null,16,"Other:  Cardio DS"]
[null,17,"Other:  Cardiology"]
[null,18,"Other:  Child Psychology"]
[null,19,"Other:  Clinical Cardiac Electrophysiology"]
[null,20,"Other:  Clinical Cardiac Electrophysiology (Adult)"]
[null,21,"Other:  Clinical Immunodeficiency  "]
[null,22,"Other:  Clinical Neurophysiology"]
[null,23,"Other:  Clinical Pharmacology and Toxicology"]
[null,24,"Other:  Congenital Cardiac Surgery"]
[null,25,"Other:  Craniofacial Surgery"]
[null,26,"Other:  Critical Care Anesthesiology"]
[null,27,"Other:  Critical Care Medicine"]
[null,28,"Other:  Dentistry"]
[null,29,"Other:  Dermapathology"]
[null,30,"Other:  Emergency Medicine/ Family Medicine"]
[null,31,"Other:  Endocrinology, Diabetes and Metabolism"]
[null,32,"Other:  Endodontics"]
[null,33,"Other:  Endovascular Surgical Neuroradiology"]
[null,34,"Other:  Epilepsy"]
[null,35,"Other:  Family Medicine/ Psychiatry"]
[null,36,"Other:  Family Medicine/ Sports Medicine"]
[null,37,"Other:  Female Pelvic Medicine and Reconstructive Surgery"]
[null,38,"Other:  Fetal Cardiology"]
[null,39,"Other:  Fetal Surgery"]
{"$rows_left_out":105}