{"text_format":"3","workbook":"xlsx","n_sheets":10,"sheets":["Cover Page","HRSA 100-3-A DIFF POP TYPES TRN","HRSA 100-3-B DIFF POPS TRN CONT","HRSA 100-3-C CHANGES IN CURRIC","HRSA 100-3-D CHNG IN TRNG QUAL","HRSA 100-3-E CHNG IN NO. OF RES","HRSA 100-3-F PRAC LOC GRAD RES",".","...","Sheet4"],"not_rendered":{"macros":1,"external_links":1,"defined_names":55},"read":"whole","date_system":"1900"}

{"sheet":"Cover Page","index":0,"n_rows":24,"n_cols":7,"rows_kept":24,"merged":[[0,6,0,8],[1,6,1,8],[3,1,13,8],[20,1,22,8],[23,1,36,8]]}
["Department of Health and Human Services",{"$nulls":5},"OMB No. 0915-0313"]
["Health Resources and Services Administration",{"$nulls":5},"Expiration Date:  11/30/2013"]
[]
[null,"\n\n\nCHILDREN’S HOSPITALS GRADUATE MEDICAL EDUCATION PAYMENT PROGRAM\n\nANNUAL REPORT FORM HRSA 100-3\n"]
{"$rows_empty":16}
[null,"Public Burden Statement"]
[]
[]
[null,"An agency may not conduct or sponsor, and a person is not required to respond to, a collection of information unless it displays a currently valid OMB control number.  The OMB control number for this project is 0915-0313.  Public reporting burden for the applicant for this collection of informtain is estimated to average 39.4 hours per response, including the time for reviewing instrucitons, searching existing data sources, gathering and maintaining the data needed, and completing and reviewing the collection of information.  Send comments regarding this burden estimate or any other aspect of this collection of information, including suggetions for redcing this burden, to HRSA Reports Clearance Officer, 5600 Fishers Lane, Room 14-33, Rockville, Maryland, 20857."]

{"sheet":"HRSA 100-3-A DIFF POP TYPES TRN","index":1,"n_rows":51,"n_cols":3,"rows_kept":51,"merged":[[2,0,2,2],[3,0,3,2],[4,1,4,2],[5,1,5,2],[6,1,6,2],[7,0,7,2],[8,0,9,2],[11,0,11,2],[19,0,19,2],[29,0,29,2],[47,0,47,2]]}
["Department of Health and Human Services",null,"OMB No.  0915-0313"]
["Health Resources and Services Administration",null,"Expiration Date:  11/30/2013"]
["Children's Hospitals Graduate Medical Education Payment Program"]
["HRSA 100-3-A:  Training in the Health Care Needs of Different Populations"]
["Residency Program Name:"]
["Medicare Provider Number:"]
["Date of Report:","2012-12-31"]
["Types of Training"]
["For each of the following types of training, use the drop down boxes to indicate whether the training is required, elective, or not currently used in your program and, if currently used, whether the training applies to those who are underserved due to financial, sociocultural, geographic or medical reasons or combinations of these reasons.  If not currently used, select none of the above or N/A for underserved population.  Please complete both columns.  There should be no columns left blank. See detailed guidance for complete instructions."]
[]
["Type of Training","Required/Elective/Not Currently Used","Underserved Population"]
["Didactic Approaches"]
["Formal courses"]
["Lectures"]
["Workshops"]
["Standardized patients"]
["Case-based experiential learning (e.g., morning report, noon case presentation, morbidity & mortality)"]
["Grand Rounds"]
["Medical simulations"]
["Clinical Experiences",3]
["Bedside Training"]
["Patient Rounds"]
["Identify/mobilize medical home"]
["Coordination of health care and community resources"]
["Coordination of mental health care services"]
["Interdisciplinary patient care conferences"]
["Assist families with transition of children into child care and educational settings"]
["Pediatric Palliative Care/ Pediatric Hospice"]
["Transition to adult care"]
["Community-based Experiences",3]
["Community health center"]
["Public health department"]
["Drug rehabilitation program"]
["Homeless shelter"]
["Day care settings, including Head Start"]
["Home visits to patients"]
["Mobile health van"]
["School health"]
["Juvenile detention facilities"]
["Migrant Health Center"]
["Indian Health Center Sites"]
["National Health Service Corps sites"]
["Area Health Education Center (AHEC) sites"]
["Rural health centers"]
["Cultural immersion experiences"]
["Other, specify"]
["Research"]
["Other Training"]
["Advocacy Training"]
["Language Training"]
["Cultural Efficacy Training"]

{"sheet":"HRSA 100-3-B DIFF POPS TRN CONT","index":2,"n_rows":48,"n_cols":5,"rows_kept":48,"merged":[[0,3,0,4],[1,3,1,4],[2,0,2,4],[3,0,3,4],[4,1,4,4],[5,1,5,4],[6,1,6,4],[8,0,8,4],[10,0,10,4],[22,0,22,4],[28,0,28,4],[33,0,33,4],[40,0,40,4],[41,0,41,4]]}
["Department of Health and Human Services",null,null,"OMB No. 0915-0313"]
["Health Resources and Services Administration",null,null,"Expiration Date: 11/30/2013"]
["Children's Hospitals Graduate Medical Education Payment Program"]
["HRSA 100-3-B:  Training Related to Underserved Populations:  Training Content and Types of Training"]
["Residency Program Name:",{"$f":"VLOOKUP('HRSA 100-3-A DIFF POP TYPES TRN'!B5:C5,Program_Number,2,FALSE)","v":{"$error":"#N/A"}}]
[{"$f":"+'HRSA 100-3-A DIFF POP TYPES TRN'!A6","v":"Medicare Provider Number:"},{"$f":"'HRSA 100-3-A DIFF POP TYPES TRN'!B6","v":{"v":0,"d":"00-0000"}}]
[{"$f":"+'HRSA 100-3-A DIFF POP TYPES TRN'!A7","v":"Date of Report:"},{"$f":"'HRSA 100-3-A DIFF POP TYPES TRN'!B7","v":"2012-12-31"}]
[]
["For each of the following topic areas, please use the check boxes to indicate the types of training used to address the topic in the training program in the most recent academic year (2011-2012).  Check all that apply.  For example, if your program offers a lecture on homelessness as well as a community rotation in a homeless shelter, check both didactic and clinical experiences.  There must be at least one check in each row.  See detailed guidance for complete instructions."]
[null,"Didactic","Clinical Experiences/ Patient Care","   Research","Not Currently in the Curriculum"]
["Underserved for Financial Reasons"]
["Poverty, including causes, consequences, & implications for child health "]
["Uninsured and Underinsured"]
["Medicaid and SCHIP and related programs such as EPSDT"]
["Public sources of care (e.g., community health centers, public health departments)"]
["Other social services, such as WIC"]
["Homelessness"]
["Migrant worker families and children"]
["Community-based medicine"]
["Advocacy Training"]
["Substance Abuse"]
["Domestic violence/child abuse"]
["Underserved for Socio-cultural Reasons"]
["Foreign language instruction"]
["Issues related to use of interpreter services (both professional and ad hoc)"]
["Cultural beliefs and attitudes"]
["Availability of community based programs such as cultural centers"]
["Immigration/Deportation issues"]
["Underserved for Geographic Reasons"]
["Telemedicine"]
["Transportation and travel barriers"]
["Availability of allied health providers (PT/OT/Speech Pathology, etc.)"]
["Public sources of care in rural areas"]
["Underserved for Medical Reasons"]
["Medical Home"]
["Care coordination with other health care providers"]
["Interfacing with community organizations (such as schools and day cares)"]
["Palliative care for terminally ill children / Pediatric hospice"]
["Individualized education plans (IEPs)"]
["Americans with Disabilities Act"]
[]
["Dental Care"]
["Oral health screening"]
["Counseling for oral hygiene, diet (e.g., baby bottle use), and fluoride use"]
["Fluoride guidelines"]
["Referral for dental care"]
["Access to dental health services"]
["Availability of public sources of dental services"]

{"sheet":"HRSA 100-3-C CHANGES IN CURRIC","index":3,"n_rows":108,"n_cols":6,"rows_kept":108,"merged":[[0,4,0,5],[1,4,1,5],[2,0,2,5],[3,0,3,5],[4,0,4,5],[5,0,5,2],[5,3,5,5],[6,0,6,2],[6,3,6,5],[7,0,7,2],[7,3,7,5],[8,0,8,5],[9,0,9,5],[10,0,10,5],[11,0,11,2],[12,0,13,0],[12,2,13,2],[12,3,13,3],[12,4,13,4],[12,5,13,5],[14,0,14,5],[15,0,15,5],[23,0,23,5],[24,0,24,5],[25,0,25,5],[34,0,34,5],[35,0,35,5],[36,0,36,5],[48,0,48,5],[49,0,49,5],[50,0,50,5],[57,0,57,5],[58,0,58,5],[59,0,59,5],[71,0,71,5],[72,0,72,5],[73,0,73,5],[74,0,74,5],[87,0,87,5],[88,0,88,5],[89,0,89,5],[93,0,93,5],[94,0,94,5],[95,0,95,5],[107,0,107,5],[108,0,108,5]]}
["Department of Health and Human Services ",{"$nulls":3},"OMB No.  0915-0313"]
["Health Resources and Services Administration",{"$nulls":3}," Expiration Date:  11/30/2013"]
["Children's Hospitals Graduate Medical Education Payment Program"]
["HRSA 100-3-C:  Residency Training Topics, Changes in Residency Training"]
["Training Experiences and Resulting Benefits"]
["Residency Program Name:",null,null,{"$f":"'HRSA 100-3-B DIFF POPS TRN CONT'!$B$5","v":{"$error":"#N/A"}}]
["Medicare provider number:",null,null,{"$f":"'HRSA 100-3-A DIFF POP TYPES TRN'!$B$6","v":{"v":0,"d":"00-0000"}}]
["Date of Report:",null,null,{"$f":"'HRSA 100-3-A DIFF POP TYPES TRN'!B7","v":"2012-12-31"}]
["Please indicate whether each topic listed in this worksheet was part of the program's training/curriculum in the most recent academic year (2011-2012) and, if so,  whether the topic was newly offered since the previous year (2010-2011) or expanded or improved since the previous academic year .  Also, please briefly describe resulting benefits from any change(s) in the space provided following each broad subheading.  If you wish to provide greater detail about the benefits resulting from changes in the curricula, you may do so by adding a sheet to the Excel workbook or attaching a separate document.  "]
["[Benefits may include, for example, increases in medical knowledge; improvements in clinical competence;  increased awareness of psychosocial and behavioral aspects of health and illness; increased awareness of the availability of community resources; increased ability to function as a medical home provider; improvements in patient care and outcomes and promotion of leadership skills.] "]
["If no changes have occurred, you need not complete the rationale and \"benefits\" sections.  See detailed guidance for complete instructions."]
[" ",{"$nulls":3},"If Yes ","If Yes "]
["       TRAINING TOPIC",null,"No, Not Part of Training in Most Recent Academic Year (2011-2012)            ","Yes, Part of Training in Most Recent Academic Year (2011-2012)","Is this Newly Offered since the Previous Academic Year? (2010-2011)? ","Has this Training Expanded or Improved since previous year (2010-2011)?"]
[]
["Didactic Training"]
["Basic Science "]
["Genomics/Proteomics"]
["Neuroscience"]
["Developmental biology"]
["Translational Research"]
["Effects of physical environment (toxins, etc)"]
["Effects of social environment (crime, etc)"]
["Tailoring therapy to the individual"]
[{"$f":"IF(COUNTIF(E17:F23,\"a\"),\"What are the reasons for the change(s), if any, made and the benefits resulting from the changes noted above in the didactic training in basic science?  Please respond in the space below.\",\"\")","v":""}]
[]
["Health Promotion"]
["Promoting positive health behaviors"]
["Health promotion/ Illness Prevention"]
["Screening/referral for maternal depression"]
["Screening/referral for parental substance abuse"]
["Screening/referral for domestic violence"]
["Tobacco prevention and control"]
["Obesity-directed care"]
["Anticipatory guidance"]
[{"$f":"IF(COUNTIF(E27:F34,\"a\"),\"What are the reasons for the change(s), if any, made and the benefits resulting from the changes noted above in the didactic training in basic science?  Please respond in the space below.\",\"\")","v":""}]
[]
["Other Topics in Didactic Training"]
["Family-centered pediatrics"]
["Interdisciplinary care"]
["Medical Home model"]
["Cultural competency"]
["Competency-based training"]
["Physician-patient communication"]
["Patient advocacy "]
["Leadership training (conflict resolution, self-awareness, vision-entrepreneurship, etc)"]
["Interpretation of research"]
["Care of domestically adopted children"]
["Care of internationally adopted children"]
[{"$f":"IF(COUNTIF(E38:F48,\"a\"),\"What are the reasons for the change(s), if any, made and the benefits resulting from the changes noted above in the didactic training in basic science?  Please respond in the space below.\",\"\")","v":""}]
[]
["Dental Care"]
["Oral health screening"]
["Counseling for oral hygiene, diet (e.g., baby bottle use), and fluoride use"]
["Fluoride guidelines"]
["Referral for dental care"]
["Access to dental health services"]
["Availability of public sources of dental services"]
[{"$f":"IF(COUNTIF(E52:F57,\"a\"),\"What are the reasons for the change(s), if any, made and the benefits resulting from the changes noted above in the didactic training in basic science?  Please respond in the space below.\",\"\")","v":""}]
[]
["Community Health System Topics"]
{"$rows_left_out":49}
{"sheet":"HRSA 100-3-D CHNG IN TRNG QUAL","index":4,"n_rows":48,"n_cols":6,"rows_kept":48,"merged":[[2,0,2,5],[3,0,3,5],[4,0,4,2],[4,3,4,5],[5,0,5,2],[5,3,5,5],[6,0,6,2],[6,3,6,5],[7,0,7,5],[8,0,8,5],[9,0,9,5],[10,0,11,0],[12,0,12,5],[21,0,21,5],[22,0,22,5],[23,0,23,5],[34,0,34,5],[35,0,35,5],[36,0,36,5],[47,0,47,5],[50,0,50,5],[51,0,51,5]]}
["Department of Health and Human Services",{"$nulls":4},"OMB No.  0915-0313 "]
["Health Resources and Services Administration",{"$nulls":4},"Expiration Date: 11/30/2013"]
["Children's Hospitals Medical Education Payment Program"]
["HRSA 100-3-D:   Training Related to Measurement and Improvement in Quality, Changes in Training and Resulting Benefits of Change"]
["Residency Program Name:",null,null,{"$f":"'HRSA 100-3-B DIFF POPS TRN CONT'!$B$5","v":{"$error":"#N/A"}}]
["Medicare Provider Number:",null,null,{"$f":"'HRSA 100-3-A DIFF POP TYPES TRN'!B6","v":{"v":0,"d":"00-0000"}}]
["Date of Report:",null,null,{"$f":"'HRSA 100-3-A DIFF POP TYPES TRN'!B7","v":"2012-12-31"}]
["Please indicate whether each topic listed in this worksheet was part of the program's training/curriculum in the most recent academic year (2011-2012) and, if so,  whether the topic was newly offered since the previous year or expanded or improved since the previous academic year (2010-2011). There must be at least one check mark in each row.  Also, please briefly describe the reasons for and resulting benefits from any change(s) in the space provided following each broad subheading.  If you wish to provide greater detail about the benefits resulting from changes in the curricula, you may do so by adding a sheet to the Excel workbook or attaching a separate document.  "]
["[Benefits may include, for example, increases in medical knowledge; improvements in clinical competence;  increased awareness of psychosocial and behavioral aspects of health and illness; increased awareness of the availability of community resources; increased ability to function as a medical home provider; improvements in patient care and outcomes and promotion of leadership skills.] "]
["If no changes have occurred, you need not complete the rationale and \"benefits\" section.  See detailed guidance for complete instructions."]
["        TRAINING TOPIC",{"$nulls":3},"If Yes ","If Yes"]
[null,null,"No, Not Part of Training in Most Recent Academic Year (2011-2012)","Yes, Part of Training in Most Recent Academic Year      (2011-2012)","Is this Training Newly Offered since the Previous Academic Year (2010-2011)? ","Has this Training been Expanded or Improved since the Previous Academic Year (2010-2011)?"]
["Health Care Quality"]
["Quality characteristics"]
["Evidence-based medicine"]
["Ambulatory care sensitive conditions"]
["Volume-outcomes"]
["Small area variation"]
["Health care disparities"]
["Systematic literature reviews/meta-analysis"]
["Practice guidelines"]
[{"$f":"IF(COUNTIF(E14:F21,\"a\"),\"What are the reasons for the change(s), if any, made and the benefits resulting from the changes noted above in the didactic training in basic science?  Please respond in the space below.\",\"\")","v":""}]
[]
["Quality Measurement"]
["Benchmarking"]
["Consumer Assessments of Health Plans (CAHPS)"]
["Health Plan Employer Data and Information Set (HEDIS)"]
["Agency for Health Care Research and Quality (AHRQ) Pediatric Quality Indicators"]
["AHRQ Clinical Performance Measures for Ambulatory Care"]
["Structure/Process/Outcomes Measures"]
["Performance measurement and indicators"]
["Severity/risk adjustment"]
["Sentinel event"]
["Interdisciplinary care"]
[{"$f":"IF(COUNTIF(E25:F34,\"a\"),\"What are the reasons for the change(s), if any, made and the benefits resulting from the changes noted above in the didactic training in basic science?  Please respond in the space below.\",\"\")","v":""}]
[]
["Quality Improvement"]
["Physician reminder systems (e.g., prompts in paper charts or computer-based reminders)"]
["Facilitated relay of clinical data to providers (e.g., use of faxes to send information between PCP and specialists)"]
["Audit and feedback approaches (e.g., performance review, report cards, benchmarking)"]
["Physician education (e.g., conferences, etc.)"]
["Patient education (e.g., pamphlets, classes, self-care instruction, etc.)"]
["Promotion of disease self management (e.g., workshops, monitoring devices, etc)"]
["Patient reminder systems (e.g., telephone or postcard reminder systems)"]
["Organizational changes (e.g., total quality management, continuous quality improvement, etc.)"]
["Financial incentives (e.g., pay for performance)"]
["Use of practice guidelines"]
[{"$f":"IF(COUNTIF(E38:F47,\"a\"),\"What are the reasons for the change(s), if any, made and the benefits resulting from the changes noted above in the didactic training in basic science?  Please respond in the space below.\",\"\")","v":""}]

{"sheet":"HRSA 100-3-E CHNG IN NO. OF RES","index":5,"n_rows":17,"n_cols":4,"rows_kept":17,"merged":[[2,0,2,3],[3,0,4,3],[5,0,5,1],[5,2,5,3],[6,0,6,1],[6,2,6,3],[7,0,7,1],[7,2,7,3],[9,0,9,1],[9,2,9,3],[10,0,10,3],[11,0,11,3],[12,0,12,1],[12,2,12,3],[15,0,15,3],[16,0,16,3],[17,0,17,3]]}
["Department of Health And Human Services",null,null,"OMB No.  0915-0313"]
["Health Resources and Services Administration",null,null,"  Expiration Date: 11/30/2013"]
["Children's Hospitals Graduate Medical Education Payment Program"]
["HRSA 100-3-E: Changes in the Numbers of Residents and Faculty Members and Resulting Benefits"]
[]
["Residency Program Name:",null,{"$f":"'HRSA 100-3-B DIFF POPS TRN CONT'!$B$5","v":{"$error":"#N/A"}}]
["Medicare Provider Number:",null,{"$f":"'HRSA 100-3-A DIFF POP TYPES TRN'!B6","v":{"v":0,"d":"00-0000"}}]
["Date of Report:",null,{"$f":"'HRSA 100-3-A DIFF POP TYPES TRN'!B7","v":"2012-12-31"}]
["For your training program answer the following questions.  See detailed guidance for complete instructions."]
["In which year was this training program first offered?"]
[]
["In the following table, please indicate the total number of trainees (which is the sum of the number of residents documented in the last column(s) of 100-1-C plus 100-1-D of each specified program) and faculty involved in your program in the previous academic year (2010-2011) and in the most recent year of funding (2011-2012):"]
["Previous Academic Year (2010-2011)",null,"Most Recent Year (2011-2012)"]
["Number of Residents","Number of Faculty","Number of Residents","Number of Faculty"]
[]
["How have the changes in the number of residents and/or the number of faculty in your program yielded benefits to your residents, institution, or patients?"]
["[Benefits may include, for example, increases in medical knowledge; improvements in clinical competence;  increased awareness of psychosocial and behavioral aspects of health and illness; increased awareness of the availability of community resources; increased ability to function as a medical home provider; improvements in patient care and outcomes and promotion of leadership skills.]  Please respond in the space below."]

{"sheet":"HRSA 100-3-F PRAC LOC GRAD RES","index":6,"n_rows":56,"n_cols":5,"rows_kept":56,"merged":[[0,0,0,1],[1,0,1,2],[2,0,2,4],[3,0,3,4],[4,0,4,3],[5,0,5,3],[6,0,6,3],[7,0,7,4],[8,0,8,3]]}
["Department of Health and Human Services",{"$nulls":3},"OMB No.  0915-0313"]
["Health Resources and Services Administration",{"$nulls":3},"Expiration Date:  11/30/2013"]
["Children's Hospitals Graduate Medical Education Payment Program"]
["HRSA 100-3-F:  Practice Locations of Residents Completing Training"]
["Residency Program Name:",{"$nulls":3},{"$f":"'HRSA 100-3-B DIFF POPS TRN CONT'!$B$5","v":{"$error":"#N/A"}}]
["Medicare Provider Number:",{"$nulls":3},{"$f":"'HRSA 100-3-A DIFF POP TYPES TRN'!B6","v":{"v":0,"d":"00-0000"}}]
["Date of Report:",{"$nulls":3},{"$f":"'HRSA 100-3-A DIFF POP TYPES TRN'!B7","v":"2012-12-31"}]
["Public Law 109-307 requires that you report for each resident (who was in a hospital-sponsored program or who spent 75% of his/her training time in your hospital in the last academic year) who completed training in the academic year (2011-2012), his or her first place of employment lasting at least 6 months: city, state, zip code, and type of employment for their current position.   Do not include names or SSN's--just resident # 1; resident #2, etc., as indicated in the table.  If no residents completed training in the academic year (2011-2012) indicate by selecting the \"No\" response in the question immediately following these instructions. See detailed guidance for complete instructions."]
["Did one or more resident(s) complete training in the academic year (2011-2012)?"]
[]
["Resident No.","City","State","Zip Code","Type of Employment"]
[1]
[2]
[3]
[4]
[5]
[6]
[7]
[8]
[9]
[10]
[11]
[12]
[13]
[14]
[15]
[16]
[17]
[18]
[19]
[20]
[21]
[22]
[23]
[24]
[25]
[26]
[27]
[28]
[29]
[30]
[31]
[32]
[33]
[34]
[35]
[36]
[37]
[38]
[39]
[40]
[41]
[42]
[43]
[44]
[45]

{"sheet":".","index":7,"n_rows":41,"n_cols":3,"rows_kept":41}
[null,null,"None"]
["Required",null,"Less than 25%"]
["Elective",null,"26-50%"]
["Not Currently Used",null,"51-75%"]
[null,null,"76% or more"]
[null,null,"Not Applicable"]
[]
["The annual number of trainees increased"]
["The annual number of trainees decreased"]
["The annual number of trainees stayed the same"]
[]
["The number of faculty increased"]
["The number of faculty decreased"]
["The number of faculty stayed the same"]
[]
["N/A"]
["Private Practice "]
["Non-academic medical center"]
["Non-academic medical center - Hospitalist "]
["Non-academic medical center - Outpatient clinic "]
["Academic medical center - Additional training (fellowships, etc.)"]
["Academic medical center - Hospitalist"]
["Academic medical center - Staff Physician"]
["Academic medical center - Faculty Physician"]
["Academic medical center - Other academia"]
["Public setting - Community/rural/migrant health center"]
["Public setting - Health department"]
["Government - Federal (CDC, FDA, NCHS, etc)"]
["Government - State government"]
["Government - National Health Service Corps"]
["Government - Military"]
["Private industry - Pharmaceuticals/Biotechnology/Software"]
["Other"]
["Not currently employed"]
["Financial"]
["Sociocultural"]
["Geographic"]
["Medical"]
["2 or 3 Populations"]
["All of the above "]
["None of the above or N/A"]

{"sheet":"...","index":8,"n_rows":209,"n_cols":3,"rows_kept":209}
["No","No","Yes"]
[1,"Adolescent Medicine Pediatrics","No"]
[{"$f":"1+A2","v":2},"Allergy Immunology"]
[3,"Anesthesiology"]
[4,"Child Abuse Pediatrics"]
[5,"Child and Adolescent Psychiatry"]
[6,"Child Neurology"]
[7,"Colon & Rectal Surgery"]
[8,"Dermatology"]
[9,"Developmental Behavioral Pediatrics"]
[10,"Emergency Medicine"]
[11,"Emergency Medicine (Pediatric)a "]
[12,"Family Medicine"]
[13,"Hospice and Palliative Medicine"]
[14,"Internal Medicine /Pediatrics"]
[15,"Medical Genetics"]
[16,"Medical Toxicology"]
[17,"Neonatal-Perinatal Medicine"]
[18,"Neurodevelopmental Disabilities"]
[19,"Neurological Surgery"]
[20,"Neurology"]
[21,"Nuclear Medicine"]
[22,"Obstetrics and Gynecology"]
[23,"Ophthalmology"]
[24,"Orthopedic Surgery"]
[25,"Otolaryngology"]
[26,"Pathology"]
[27,"Pediatric Anesthesiology"]
[28,"Pediatric Cardiology"]
[29,"Pediatric Cardiothoracic Surgery"]
[30,"Pediatric Critical Care Medicine"]
[31,"Pediatric Dermatology"]
[32,"Pediatric Emergency Medicine"]
[33,"Pediatric Endocrinology"]
[34,"Pediatric Gastroenterology"]
[35,"Pediatric Hematology/Oncology"]
[36,"Pediatric Infectious Disease"]
[37,"Pediatric Nephrology"]
[38,"Pediatric Neurosurgery"]
[39,"Pediatric Ophthalmology"]
[40,"Pediatric Orthopedics"]
[41,"Pediatric Otolaryngology"]
[42,"Pediatric Pathology"]
[43,"Pediatric Pulmonology"]
[44,"Pediatric Radiology"]
[45,"Pediatric Rehabilitation Medicine"]
[46,"Pediatric Rheumatology"]
[47,"Pediatric Sleep Medicine"]
[48,"Pediatric Sports Medicine"]
[49,"Pediatric Surgery"]
[50,"Pediatric Transplant Hepatology"]
[51,"Pediatric Urology"]
[52,"Pediatrics"]
[53,"Pediatrics/Dermatology"]
[54,"Pediatrics/Emergency Medicine"]
[55,"Pediatrics/Medical Genetics"]
[56,"Pediatrics/Physical Medicine and Rehab"]
[57,"Pediatrics/Psychiatry/Child & Adolescent Psych"]
[58,"Physical Medicine & Rehabilitation"]
[59,"Plastic Surgery"]
{"$rows_left_out":150}
{"sheet":"Sheet4","index":9,"n_rows":0,"n_cols":0,"rows_kept":0}