{"text_format":"3","workbook":"xlsx","n_sheets":3,"sheets":["Section 1","Section 2","Lists"],"not_rendered":{"macros":1,"defined_names":3},"read":"whole","date_system":"1900"}

{"sheet":"Section 1","index":0,"n_rows":29,"n_cols":5,"rows_kept":29,"merged":[[7,2,8,4],[9,2,9,4],[15,3,15,4],[16,3,16,4],[17,3,17,4],[18,3,18,4],[19,3,19,4],[21,3,21,4],[22,3,22,4],[23,3,23,4],[24,3,24,4],[26,2,26,4],[27,2,27,4]]}
[]
[]
[null,null,"U.S. Environmental Protection Agency",null,"OMB Control Number: 2060-0256"]
[null,null,"Stratospheric Protection Division",null,"Expiration Date: MM/DD/YYYY"]
[null,null,"Reclamation Annual Report (Sec 82.166)"]
[]
[null,null,"Instructions"]
[null,null,"Complete this form by filling in the data fields that are highlighted in blue. Use the arrows to navigate between the tabs."]
[]
[null,null,"To submit, please send your completed report to: 608reports@epa.gov."]
[]
[null,null,"Section 1: Report Identification Information "]
[null,null,"Date of Submission:"]
[null,null,"Reporting Year: "]
[]
[null,null,"Company Name: "]
[null,null,"Street Address:"]
[null,null,"City:"]
[null,null,"State:"]
[null,null,"ZIP code:"]
[]
[null,null,"Contact Person Name:"]
[null,null,"Email Address:"]
[null,null,"Phone Number:"]
[null,null,"Fax Number:"]
[]
[null,null,"All information submitted to EPA will be treated as confidential in accordance with 40 CFR Part 2, Subpart B, and will only be disclosed by the means set forth in the subpart. "]
[null,null,"The public reporting and recordkeeping burden for this collection of information is estimated to average 9.4 hours per year.  Send comments on the Agency's need for this information, the accuracy of the provided burden estimates, and any suggested methods for minimizing respondent burden, including through the use of automated collection techniques to the Director, Collection Strategies Division, U.S. Environmental Protection Agency (2822T), 1200 Pennsylvania Avenue NW, Washington, D.C. 20460.  Include the OMB control number in any correspondence.  Do not send the completed form to this address."]
[null,null,"EPA Form #5900-404"]

{"sheet":"Section 2","index":1,"n_rows":38,"n_cols":5,"rows_kept":38,"merged":[[38,2,38,4]]}
[" ",{"$nulls":3},"ImporterCol"]
[{"$nulls":4},{"$f":"IF('Section 1'!D25=0,\"\",'Section 1'!D25)","v":""}]
[]
[]
[null,null,"U.S. Environmental Protection Agency"]
[null,null,"Stratospheric Protection Division"]
[null,null,"Reclamation Annual Report (Sec 82.166)"]
[]
[null,null,"Company Name:",{"$f":"IF('Section 1'!D16:E16=0,\"\",'Section 1'!D16:E16)","v":""}]
[null,null,"Reporting Year:",{"$f":"IF('Section 1'!D14=0,\"\",'Section 1'!D14)","v":""}]
[]
[null,null,"Section 2: Reclamation Data"]
[null,null,"Mass of Waste Products (kg)"]
[]
[null,null,"Name of the Refrigerant Reclaimed","Mass of Material Received (kg)","Mass of Refrigerant Reclaimed (kg) "]
[null,null,"TOTAL",{"$f":"SUM(D17:D36)","v":{"v":0,"d":"0.00"}},{"$f":"SUM(E17:E36)","v":{"v":0,"d":"0.00"}}]
{"$rows_empty":21}
[null,null,"If \"Other\" is selected in the table above, please specify the refrigerant type below:"]

{"sheet":"Lists","index":2,"n_rows":122,"n_cols":2,"rows_kept":122,"hidden":true}
[]
[null,"Refrigerant List"]
[null,"CFC-11"]
[null,"CFC-113"]
[null,"CFC-114"]
[null,"CFC-115"]
[null,"CFC-12"]
[null,"CFC-13"]
[null,"HCFC-123"]
[null,"HCFC-124"]
[null,"HCFC-142b"]
[null,"HCFC-22"]
[null,"HFC-125"]
[null,"HFC-134a"]
[null,"HFC-143a"]
[null,"HFC-152a"]
[null,"HFC-227ea"]
[null,"HFC-23"]
[null,"HFC-236fa"]
[null,"HFC-245fa"]
[null,"HFC-32"]
[null,"HFC-41"]
[null,"R-116"]
[null,"R-14"]
[null,"R-218"]
[null,"R-401A"]
[null,"R-401B"]
[null,"R-401C"]
[null,"R-402A"]
[null,"R-402B"]
[null,"R-403A"]
[null,"R-403B"]
[null,"R-404A"]
[null,"R-405A"]
[null,"R-406A"]
[null,"R-407A"]
[null,"R-407B"]
[null,"R-407C"]
[null,"R-407D"]
[null,"R-407E"]
[null,"R-407F"]
[null,"R-408A"]
[null,"R-409A"]
[null,"R-409B"]
[null,"R-410A"]
[null,"R-410B"]
[null,"R-411A"]
[null,"R-411B"]
[null,"R-412A"]
[null,"R-413A"]
[null,"R-414A"]
[null,"R-414B"]
[null,"R-415A"]
[null,"R-415B"]
[null,"R-416A"]
[null,"R-417A"]
[null,"R-417B"]
[null,"R-417C"]
[null,"R-418A"]
[null,"R-419A"]
[null,"R-419B"]
[null,"R-420A"]
[null,"R-421A"]
[null,"R-421B"]
[null,"R-422A"]
[null,"R-422B"]
[null,"R-422C"]
[null,"R-422D"]
[null,"R-422E"]
[null,"R-423A"]
[null,"R-424A"]
[null,"R-425A"]
[null,"R-426A"]
[null,"R-427A"]
[null,"R-428A"]
[null,"R-429A"]
[null,"R-430A"]
[null,"R-431A"]
[null,"R-432A"]
[null,"R-433A"]
[null,"R-433B"]
[null,"R-433C"]
[null,"R-434A"]
[null,"R-435A"]
[null,"R-436A"]
[null,"R-436B"]
[null,"R-437A"]
[null,"R-438A"]
[null,"R-439A"]
[null,"R-440A"]
[null,"R-441A"]
[null,"R-442A"]
[null,"R-443A"]
[null,"R-444A"]
[null,"R-444B"]
[null,"R-445A"]
[null,"R-446A"]
[null,"R-447A"]
[null,"R-448A"]
[null,"R-449A"]
[null,"R-450A"]
[null,"R-451A"]
[null,"R-451B"]
[null,"R-452A"]
[null,"R-500"]
[null,"R-501"]
[null,"R-502"]
[null,"R-503"]
[null,"R-504"]
[null,"R-505"]
[null,"R-506"]
[null,"R-507"]
[null,"R-507A"]
[null,"R-508A"]
[null,"R-508B"]
[null,"R-509"]
[null,"R-509A"]
[null,"R-510A"]
[null,"R-511A"]
[null,"R-512A"]
[null,"R-513A"]
[null,"Other"]