{"text_format":"3","workbook":"xlsx","n_sheets":6,"sheets":["Instructions","Participant  Information","Project Information","Project Tracking","Lists","21CSC-Members"],"not_rendered":{"images":2,"macros":1,"external_links":1,"defined_names":30},"read":"whole","date_system":"1900"}

{"sheet":"Instructions","index":0,"n_rows":17,"n_cols":2,"rows_kept":17}
[]
[]
[null,"Public Lands Corps Tracking Form"]
[]
[null,"Please complete requested information on all three tabs of this spreadsheet."]
[null,"In the \"Participant Information\" tab, please provide information for each Public Lands Corps participant you’ve engaged."]
[null,"In the \"Project Information\" tab, please provide information on each of the projects in which you’ve engaged Public Lands Corps participants."]
[null,"In the \"Project Tracking\" tab, please track the number of hours each participant has worked on each of the projects tracked."]
[null,"Tracking sheet should be completed quarterly and sent via secure email to: WOVolServ@fs.fed.us"]
[]
[null,"Incomplete provision of the information requested in this form may result in in participants not being able to gain the privileges offered by completion of the program."]
[]
[null,"Burden Statement"]
[null,"According to the Paperwork Reduction Act of 1995, an agency may not conduct or sponsor, and a person is not required to respond to a collection of information unless it displays a valid OMB control number.  The valid OMB control number for this information collection is 0596-New.  The time required to complete this information collection is estimated to average six hours, including the time for reviewing instructions, searching existing data sources, gathering and maintaining the data needed, and completing and reviewing the collection of information.  The U.S. Department of Agriculture (USDA) and U.S. Department of the Interior prohibit discrimination in all programs and activities on the basis of race, color, national origin, gender, religion, age, disability, political beliefs, sexual orientation, and marital or family status.  (Not all prohibited bases apply to all programs.)  Persons with disabilities who require alternative means for communication of program information (Braille, large print, audiotape, etc.) should contact USDA’s TARGET Center at 202-720-2600 (voice and TDD). To file a complaint of discrimination, write USDA, Director, Office of Civil Rights, 1400 Independence Avenue, SW, Washington, DC 20250-9410 or call (800) 795-3272 (voice) or (202) 720-6382 (TDD).  USDA and USDI are equal opportunity providers and employers."]
[]
[null,"Privacy Act Statement"]
[null,"The data collected for the PLC spreadsheet would fall under the Forest Service’ End-User Computer Environment (or EUCE) information system.  EUCE is an accredited system with a corresponding, signed and approved Privacy Impact Assessment (PIA).  The EUCE PIA is required by OMB Memorandum 03-22, which provides guidance for implementing the privacy provisions of the E-Government Act of 2002. The password protected file will be stored on a fully encrypted laptop, only being accessed by authorized Forest Service employees working as part of the administration of the Volunteer and Service program in the Forest Service’s Washington Office. "]

{"sheet":"Participant  Information","index":1,"n_rows":198,"n_cols":18,"rows_kept":198}
["PUBLIC LANDS CORPS PARTICIPANT INFORMATION FORM"]
["  Partner:    ",{"$nulls":3},"Submission Date:  ",{"$nulls":3},"Name, Title,                                      Contact Information:"]
[]
["Participant"]
["Last Name","First Name","Middle Initial","Permanent Residence \nZip code","Email Address","Date of Birth MM/DD/YYYY","Gender","Ethnicity","Race - 1","Race - 2","Education Level Completed","College/University Name","Major","Military/Veteran Status"," Career Goals","Skills and abilities","Total Hours Worked","Full Name"]
[]
[{"$nulls":9},"Black or African American"]
[{"$nulls":16},{"$f":"SUMIF('Project Tracking'!$A$8:$A$208,'Participant  Information'!R8,'Project Tracking'!$F$8:$F$200)","v":{"v":0,"d":"0.00"}},{"$f":"CONCATENATE(B8,\" \",C8,\" \",A8)","v":"  "}]
[{"$nulls":16},{"$f":"SUMIF('Project Tracking'!$A$8:$A$208,'Participant  Information'!R9,'Project Tracking'!$F$8:$F$200)","v":{"v":0,"d":"0.00"}},"  "]
[{"$nulls":16},{"$f":"SUMIF('Project Tracking'!$A$8:$A$208,'Participant  Information'!R10,'Project Tracking'!$F$8:$F$200)","v":{"v":0,"d":"0.00"}},"  "]
[{"$nulls":16},{"$f":"SUMIF('Project Tracking'!$A$8:$A$208,'Participant  Information'!R11,'Project Tracking'!$F$8:$F$200)","v":{"v":0,"d":"0.00"}},"  "]
[{"$nulls":16},{"$f":"SUMIF('Project Tracking'!$A$8:$A$208,'Participant  Information'!R12,'Project Tracking'!$F$8:$F$200)","v":{"v":0,"d":"0.00"}},"  "]
[{"$nulls":16},{"$f":"SUMIF('Project Tracking'!$A$8:$A$208,'Participant  Information'!R13,'Project Tracking'!$F$8:$F$200)","v":{"v":0,"d":"0.00"}},"  "]
[{"$nulls":16},{"$f":"SUMIF('Project Tracking'!$A$8:$A$208,'Participant  Information'!R14,'Project Tracking'!$F$8:$F$200)","v":{"v":0,"d":"0.00"}},"  "]
[{"$nulls":16},{"$f":"SUMIF('Project Tracking'!$A$8:$A$208,'Participant  Information'!R15,'Project Tracking'!$F$8:$F$200)","v":{"v":0,"d":"0.00"}},"  "]
[{"$nulls":16},{"$f":"SUMIF('Project Tracking'!$A$8:$A$208,'Participant  Information'!R16,'Project Tracking'!$F$8:$F$200)","v":{"v":0,"d":"0.00"}},"  "]
[{"$nulls":16},{"$f":"SUMIF('Project Tracking'!$A$8:$A$208,'Participant  Information'!R17,'Project Tracking'!$F$8:$F$200)","v":{"v":0,"d":"0.00"}},"  "]
[{"$nulls":16},{"$f":"SUMIF('Project Tracking'!$A$8:$A$208,'Participant  Information'!R18,'Project Tracking'!$F$8:$F$200)","v":{"v":0,"d":"0.00"}},"  "]
[{"$nulls":16},{"$f":"SUMIF('Project Tracking'!$A$8:$A$208,'Participant  Information'!R19,'Project Tracking'!$F$8:$F$200)","v":{"v":0,"d":"0.00"}},"  "]
[{"$nulls":16},{"$f":"SUMIF('Project Tracking'!$A$8:$A$208,'Participant  Information'!R20,'Project Tracking'!$F$8:$F$200)","v":{"v":0,"d":"0.00"}},"  "]
[{"$nulls":16},{"$f":"SUMIF('Project Tracking'!$A$8:$A$208,'Participant  Information'!R21,'Project Tracking'!$F$8:$F$200)","v":{"v":0,"d":"0.00"}},"  "]
[{"$nulls":16},{"$f":"SUMIF('Project Tracking'!$A$8:$A$208,'Participant  Information'!R22,'Project Tracking'!$F$8:$F$200)","v":{"v":0,"d":"0.00"}},"  "]
[{"$nulls":16},{"$f":"SUMIF('Project Tracking'!$A$8:$A$208,'Participant  Information'!R23,'Project Tracking'!$F$8:$F$200)","v":{"v":0,"d":"0.00"}},"  "]
[{"$nulls":16},{"$f":"SUMIF('Project Tracking'!$A$8:$A$208,'Participant  Information'!R24,'Project Tracking'!$F$8:$F$200)","v":{"v":0,"d":"0.00"}},"  "]
[{"$nulls":16},{"$f":"SUMIF('Project Tracking'!$A$8:$A$208,'Participant  Information'!R25,'Project Tracking'!$F$8:$F$200)","v":{"v":0,"d":"0.00"}},"  "]
[{"$nulls":16},{"$f":"SUMIF('Project Tracking'!$A$8:$A$208,'Participant  Information'!R26,'Project Tracking'!$F$8:$F$200)","v":{"v":0,"d":"0.00"}},"  "]
[{"$nulls":16},{"$f":"SUMIF('Project Tracking'!$A$8:$A$208,'Participant  Information'!R27,'Project Tracking'!$F$8:$F$200)","v":{"v":0,"d":"0.00"}},"  "]
[{"$nulls":16},{"$f":"SUMIF('Project Tracking'!$A$8:$A$208,'Participant  Information'!R28,'Project Tracking'!$F$8:$F$200)","v":{"v":0,"d":"0.00"}},"  "]
[{"$nulls":16},{"$f":"SUMIF('Project Tracking'!$A$8:$A$208,'Participant  Information'!R29,'Project Tracking'!$F$8:$F$200)","v":{"v":0,"d":"0.00"}},"  "]
[{"$nulls":16},{"$f":"SUMIF('Project Tracking'!$A$8:$A$208,'Participant  Information'!R30,'Project Tracking'!$F$8:$F$200)","v":{"v":0,"d":"0.00"}},"  "]
[{"$nulls":16},{"$f":"SUMIF('Project Tracking'!$A$8:$A$208,'Participant  Information'!R31,'Project Tracking'!$F$8:$F$200)","v":{"v":0,"d":"0.00"}},"  "]
[{"$nulls":16},{"$f":"SUMIF('Project Tracking'!$A$8:$A$208,'Participant  Information'!R32,'Project Tracking'!$F$8:$F$200)","v":{"v":0,"d":"0.00"}},"  "]
[{"$nulls":16},{"$f":"SUMIF('Project Tracking'!$A$8:$A$208,'Participant  Information'!R33,'Project Tracking'!$F$8:$F$200)","v":{"v":0,"d":"0.00"}},"  "]
[{"$nulls":16},{"$f":"SUMIF('Project Tracking'!$A$8:$A$208,'Participant  Information'!R34,'Project Tracking'!$F$8:$F$200)","v":{"v":0,"d":"0.00"}},"  "]
[{"$nulls":16},{"$f":"SUMIF('Project Tracking'!$A$8:$A$208,'Participant  Information'!R35,'Project Tracking'!$F$8:$F$200)","v":{"v":0,"d":"0.00"}},"  "]
[{"$nulls":16},{"$f":"SUMIF('Project Tracking'!$A$8:$A$208,'Participant  Information'!R36,'Project Tracking'!$F$8:$F$200)","v":{"v":0,"d":"0.00"}},"  "]
[{"$nulls":16},{"$f":"SUMIF('Project Tracking'!$A$8:$A$208,'Participant  Information'!R37,'Project Tracking'!$F$8:$F$200)","v":{"v":0,"d":"0.00"}},"  "]
[{"$nulls":16},{"$f":"SUMIF('Project Tracking'!$A$8:$A$208,'Participant  Information'!R38,'Project Tracking'!$F$8:$F$200)","v":{"v":0,"d":"0.00"}},"  "]
[{"$nulls":16},{"$f":"SUMIF('Project Tracking'!$A$8:$A$208,'Participant  Information'!R39,'Project Tracking'!$F$8:$F$200)","v":{"v":0,"d":"0.00"}},"  "]
[{"$nulls":16},{"$f":"SUMIF('Project Tracking'!$A$8:$A$208,'Participant  Information'!R40,'Project Tracking'!$F$8:$F$200)","v":{"v":0,"d":"0.00"}},"  "]
{"$rows_left_out":159}
{"sheet":"Project Information","index":2,"n_rows":200,"n_cols":14,"rows_kept":200}
["PUBLIC LANDS CORPS PROJECT INFORMATION FORM"]
[]
[]
[]
[]
["Partner ","Project"]
["Partner Name","Agreement Number","Deputy Area/Office","FS Unit\n(Location)","Start Date  MM/DD/YYYY","End Date MM/DD/YYYY","Project Title","FS Supervisor Last Name","FS Supervisor First Name","FS Supervisor Email Address","Certificate Status ","Certificate \nDate of Completion \nMM/DD/YYYY","Project Total Hours","Narrrative/Comments"]
[{"$nulls":12},{"$f":"IF(SUMIF('Project Tracking'!$C$8:$C$200,'Project Information'!G8,'Project Tracking'!$F$8:$F$200)=0,\"\",SUMIF('Project Tracking'!$C$8:$C$200,'Project Information'!G8,'Project Tracking'!$F$8:$F$200))","v":""}]
[{"$nulls":12},{"$f":"IF(SUMIF('Project Tracking'!$C$8:$C$200,'Project Information'!G9,'Project Tracking'!$F$8:$F$200)=0,\"\",SUMIF('Project Tracking'!$C$8:$C$200,'Project Information'!G9,'Project Tracking'!$F$8:$F$200))","v":""}]
[{"$nulls":12},{"$f":"IF(SUMIF('Project Tracking'!$C$8:$C$200,'Project Information'!G10,'Project Tracking'!$F$8:$F$200)=0,\"\",SUMIF('Project Tracking'!$C$8:$C$200,'Project Information'!G10,'Project Tracking'!$F$8:$F$200))","v":""}]
[{"$nulls":12},{"$f":"IF(SUMIF('Project Tracking'!$C$8:$C$200,'Project Information'!G11,'Project Tracking'!$F$8:$F$200)=0,\"\",SUMIF('Project Tracking'!$C$8:$C$200,'Project Information'!G11,'Project Tracking'!$F$8:$F$200))","v":""}]
[{"$nulls":12},{"$f":"IF(SUMIF('Project Tracking'!$C$8:$C$200,'Project Information'!G12,'Project Tracking'!$F$8:$F$200)=0,\"\",SUMIF('Project Tracking'!$C$8:$C$200,'Project Information'!G12,'Project Tracking'!$F$8:$F$200))","v":""}]
[{"$nulls":12},{"$f":"IF(SUMIF('Project Tracking'!$C$8:$C$200,'Project Information'!G13,'Project Tracking'!$F$8:$F$200)=0,\"\",SUMIF('Project Tracking'!$C$8:$C$200,'Project Information'!G13,'Project Tracking'!$F$8:$F$200))","v":""}]
[{"$nulls":12},{"$f":"IF(SUMIF('Project Tracking'!$C$8:$C$200,'Project Information'!G14,'Project Tracking'!$F$8:$F$200)=0,\"\",SUMIF('Project Tracking'!$C$8:$C$200,'Project Information'!G14,'Project Tracking'!$F$8:$F$200))","v":""}]
[{"$nulls":12},{"$f":"IF(SUMIF('Project Tracking'!$C$8:$C$200,'Project Information'!G15,'Project Tracking'!$F$8:$F$200)=0,\"\",SUMIF('Project Tracking'!$C$8:$C$200,'Project Information'!G15,'Project Tracking'!$F$8:$F$200))","v":""}]
[{"$nulls":12},{"$f":"IF(SUMIF('Project Tracking'!$C$8:$C$200,'Project Information'!G16,'Project Tracking'!$F$8:$F$200)=0,\"\",SUMIF('Project Tracking'!$C$8:$C$200,'Project Information'!G16,'Project Tracking'!$F$8:$F$200))","v":""}]
[{"$nulls":12},{"$f":"IF(SUMIF('Project Tracking'!$C$8:$C$200,'Project Information'!G17,'Project Tracking'!$F$8:$F$200)=0,\"\",SUMIF('Project Tracking'!$C$8:$C$200,'Project Information'!G17,'Project Tracking'!$F$8:$F$200))","v":""}]
[{"$nulls":12},{"$f":"IF(SUMIF('Project Tracking'!$C$8:$C$200,'Project Information'!G18,'Project Tracking'!$F$8:$F$200)=0,\"\",SUMIF('Project Tracking'!$C$8:$C$200,'Project Information'!G18,'Project Tracking'!$F$8:$F$200))","v":""}]
[{"$nulls":12},{"$f":"IF(SUMIF('Project Tracking'!$C$8:$C$200,'Project Information'!G19,'Project Tracking'!$F$8:$F$200)=0,\"\",SUMIF('Project Tracking'!$C$8:$C$200,'Project Information'!G19,'Project Tracking'!$F$8:$F$200))","v":""}]
[{"$nulls":12},{"$f":"IF(SUMIF('Project Tracking'!$C$8:$C$200,'Project Information'!G20,'Project Tracking'!$F$8:$F$200)=0,\"\",SUMIF('Project Tracking'!$C$8:$C$200,'Project Information'!G20,'Project Tracking'!$F$8:$F$200))","v":""}]
[{"$nulls":12},{"$f":"IF(SUMIF('Project Tracking'!$C$8:$C$200,'Project Information'!G21,'Project Tracking'!$F$8:$F$200)=0,\"\",SUMIF('Project Tracking'!$C$8:$C$200,'Project Information'!G21,'Project Tracking'!$F$8:$F$200))","v":""}]
[{"$nulls":12},{"$f":"IF(SUMIF('Project Tracking'!$C$8:$C$200,'Project Information'!G22,'Project Tracking'!$F$8:$F$200)=0,\"\",SUMIF('Project Tracking'!$C$8:$C$200,'Project Information'!G22,'Project Tracking'!$F$8:$F$200))","v":""}]
[{"$nulls":12},{"$f":"IF(SUMIF('Project Tracking'!$C$8:$C$200,'Project Information'!G23,'Project Tracking'!$F$8:$F$200)=0,\"\",SUMIF('Project Tracking'!$C$8:$C$200,'Project Information'!G23,'Project Tracking'!$F$8:$F$200))","v":""}]
[{"$nulls":12},{"$f":"IF(SUMIF('Project Tracking'!$C$8:$C$200,'Project Information'!G24,'Project Tracking'!$F$8:$F$200)=0,\"\",SUMIF('Project Tracking'!$C$8:$C$200,'Project Information'!G24,'Project Tracking'!$F$8:$F$200))","v":""}]
[{"$nulls":12},{"$f":"IF(SUMIF('Project Tracking'!$C$8:$C$200,'Project Information'!G25,'Project Tracking'!$F$8:$F$200)=0,\"\",SUMIF('Project Tracking'!$C$8:$C$200,'Project Information'!G25,'Project Tracking'!$F$8:$F$200))","v":""}]
[{"$nulls":12},{"$f":"IF(SUMIF('Project Tracking'!$C$8:$C$200,'Project Information'!G26,'Project Tracking'!$F$8:$F$200)=0,\"\",SUMIF('Project Tracking'!$C$8:$C$200,'Project Information'!G26,'Project Tracking'!$F$8:$F$200))","v":""}]
[{"$nulls":12},{"$f":"IF(SUMIF('Project Tracking'!$C$8:$C$200,'Project Information'!G27,'Project Tracking'!$F$8:$F$200)=0,\"\",SUMIF('Project Tracking'!$C$8:$C$200,'Project Information'!G27,'Project Tracking'!$F$8:$F$200))","v":""}]
[{"$nulls":12},{"$f":"IF(SUMIF('Project Tracking'!$C$8:$C$200,'Project Information'!G28,'Project Tracking'!$F$8:$F$200)=0,\"\",SUMIF('Project Tracking'!$C$8:$C$200,'Project Information'!G28,'Project Tracking'!$F$8:$F$200))","v":""}]
[{"$nulls":12},{"$f":"IF(SUMIF('Project Tracking'!$C$8:$C$200,'Project Information'!G29,'Project Tracking'!$F$8:$F$200)=0,\"\",SUMIF('Project Tracking'!$C$8:$C$200,'Project Information'!G29,'Project Tracking'!$F$8:$F$200))","v":""}]
[{"$nulls":12},{"$f":"IF(SUMIF('Project Tracking'!$C$8:$C$200,'Project Information'!G30,'Project Tracking'!$F$8:$F$200)=0,\"\",SUMIF('Project Tracking'!$C$8:$C$200,'Project Information'!G30,'Project Tracking'!$F$8:$F$200))","v":""}]
[{"$nulls":12},{"$f":"IF(SUMIF('Project Tracking'!$C$8:$C$200,'Project Information'!G31,'Project Tracking'!$F$8:$F$200)=0,\"\",SUMIF('Project Tracking'!$C$8:$C$200,'Project Information'!G31,'Project Tracking'!$F$8:$F$200))","v":""}]
[{"$nulls":12},{"$f":"IF(SUMIF('Project Tracking'!$C$8:$C$200,'Project Information'!G32,'Project Tracking'!$F$8:$F$200)=0,\"\",SUMIF('Project Tracking'!$C$8:$C$200,'Project Information'!G32,'Project Tracking'!$F$8:$F$200))","v":""}]
[{"$nulls":12},{"$f":"IF(SUMIF('Project Tracking'!$C$8:$C$200,'Project Information'!G33,'Project Tracking'!$F$8:$F$200)=0,\"\",SUMIF('Project Tracking'!$C$8:$C$200,'Project Information'!G33,'Project Tracking'!$F$8:$F$200))","v":""}]
[{"$nulls":12},{"$f":"IF(SUMIF('Project Tracking'!$C$8:$C$200,'Project Information'!G34,'Project Tracking'!$F$8:$F$200)=0,\"\",SUMIF('Project Tracking'!$C$8:$C$200,'Project Information'!G34,'Project Tracking'!$F$8:$F$200))","v":""}]
[{"$nulls":12},{"$f":"IF(SUMIF('Project Tracking'!$C$8:$C$200,'Project Information'!G35,'Project Tracking'!$F$8:$F$200)=0,\"\",SUMIF('Project Tracking'!$C$8:$C$200,'Project Information'!G35,'Project Tracking'!$F$8:$F$200))","v":""}]
[{"$nulls":12},{"$f":"IF(SUMIF('Project Tracking'!$C$8:$C$200,'Project Information'!G36,'Project Tracking'!$F$8:$F$200)=0,\"\",SUMIF('Project Tracking'!$C$8:$C$200,'Project Information'!G36,'Project Tracking'!$F$8:$F$200))","v":""}]
[{"$nulls":12},{"$f":"IF(SUMIF('Project Tracking'!$C$8:$C$200,'Project Information'!G37,'Project Tracking'!$F$8:$F$200)=0,\"\",SUMIF('Project Tracking'!$C$8:$C$200,'Project Information'!G37,'Project Tracking'!$F$8:$F$200))","v":""}]
[{"$nulls":12},{"$f":"IF(SUMIF('Project Tracking'!$C$8:$C$200,'Project Information'!G38,'Project Tracking'!$F$8:$F$200)=0,\"\",SUMIF('Project Tracking'!$C$8:$C$200,'Project Information'!G38,'Project Tracking'!$F$8:$F$200))","v":""}]
[{"$nulls":12},{"$f":"IF(SUMIF('Project Tracking'!$C$8:$C$200,'Project Information'!G39,'Project Tracking'!$F$8:$F$200)=0,\"\",SUMIF('Project Tracking'!$C$8:$C$200,'Project Information'!G39,'Project Tracking'!$F$8:$F$200))","v":""}]
[{"$nulls":12},{"$f":"IF(SUMIF('Project Tracking'!$C$8:$C$200,'Project Information'!G40,'Project Tracking'!$F$8:$F$200)=0,\"\",SUMIF('Project Tracking'!$C$8:$C$200,'Project Information'!G40,'Project Tracking'!$F$8:$F$200))","v":""}]
{"$rows_left_out":161}
{"sheet":"Project Tracking","index":3,"n_rows":7,"n_cols":9,"rows_kept":7}
["PUBLIC LANDS CORPS PROJECT TRACKING FORM"]
[]
[]
[]
[]
["Participant","Project"]
["First, Last Name","Position Type","Project Title","Project Description","Type of Work","Project Hours Worked","Certificate Status ","Certificate \nDate of Completion \nMM/DD/YYYY","Narrrative/Comments"]

{"sheet":"Lists","index":4,"n_rows":352,"n_cols":12,"rows_kept":352,"hidden":true}
[]
[]
["Drop Down Menus - List of Values"]
[]
[]
["Participant",{"$nulls":5},"Project"]
["Gender","Ethnicity","Race - 1","Race - 2","Education Level Completed","Military/Veteran Status","Partner Organization","Program Type","Deputy Area/Office","Type of Work","FS Unit\n(Location)","Certificate Status "]
["Male ","Hispanic or Latino ","American Indian or Alaskan Native","American Indian or Alaskan Native","Some High School","Currently serving ","* No partner","Partnerships and volunteer management","Business Operations","Project Management","Allegheny National Forest","Complete"]
["Female","Not Hispanic or Latino ","Asian","Asian","High School Diploma/GED","Reservist","* Other – Add Partner Name to Comments ","Visitor services and site operations","National Forest System ","Surveying","Anaconda Job Corps","In progress"]
["Other Identity/No Identity",null,"Black or African American","Black or African American","Some College","Veteran","Absentee Shawnee Tribe of Oklahoma","Education and interpretation","Office of Finance","Cleanup","Angeles National Forest","Did not complete"]
[null,null,"White","White","Associates Degree","No military service","Absorka-Beartooth Wilderness Foundation","Natural resources management","Office of the Chief","Remediation","Angell Job Corps","N/A"]
[null,null,"Native Hawaiian","Native Hawaiian","BA/BS Degree",null,"Agencia Municipal de Oportunidades de Empleo","Recreation management","Research & Development",null,"Apache-Sitgreaves National Forest"]
[null,null,"Other Pacific Islander","Other Pacific Islander","Professional/Graduate Degree",null,"Alabama A&M University","Cultural and historical resource management","State & Private Forestry",null,"Arapaho-Roosevelt National Forest"]
[null,null,"Other Race","Other Race",null,null,"Alaska Geographic","Geographic information systems (GIS / GPS)","International Programs",null,"Ashley National Forest"]
[{"$nulls":3},"N/A",null,null,"Aldo Leopold High School","Sustainability","Law Enforcement & Investigations",null,"Beaverhead-Deerlodge National Forest"]
[{"$nulls":6},"American Conservation Corps","Backcountry and trail work","Office of Communication",null,"Bighorn National Forest"]
[{"$nulls":6},"American Conservation Experience","program development","Legislative Affairs",null,"Bitterroot National Forest"]
[{"$nulls":6},"American Fisheries Society","Business operations/Information Technology",null,null,"Black Hills National Forest"]
[{"$nulls":6},"American Youth Works","Other ",null,null,"Blackwell Job Corps"]
[{"$nulls":6},"AmeriCorps ",{"$nulls":3},"Boise National Forest"]
[{"$nulls":6},"AmeriCorps National Civilian Conservation Corps",{"$nulls":3},"Boxelder Job Corps"]
[{"$nulls":6},"Anaconda Job Corps",{"$nulls":3},"Bridger-Teton National Forest"]
[{"$nulls":6},"Angell Job Corps",{"$nulls":3},"Caribou-Targhee National Forest"]
[{"$nulls":6},"Angoon Community Association",{"$nulls":3},"Carson National Forest"]
[{"$nulls":6},"Animas High School",{"$nulls":3},"Cass Job Corps"]
[{"$nulls":6},"Anthony Community Service Program",{"$nulls":3},"Centennial Job Corps"]
[{"$nulls":6},"Appalachian Forest Heritage Area",{"$nulls":3},"Chattahoochee-Oconee National Forest"]
[{"$nulls":6},"Appalachian Mountain Club",{"$nulls":3},"Chequamegon-Nicolet National Forest"]
[{"$nulls":6},"Appalachian Trail Conservancy",{"$nulls":3},"Cherokee National Forest"]
[{"$nulls":6},"Arizona Conservation Corps",{"$nulls":3},"Chippewa National Forest"]
[{"$nulls":6},"Arizona Conservation Experience",{"$nulls":3},"Chugach National Forest"]
[{"$nulls":6},"Arizona Corporation Commission ",{"$nulls":3},"Cibola National Forest"]
[{"$nulls":6},"Arizona Game & Fish Department",{"$nulls":3},"Clearwater National Forest"]
[{"$nulls":6},"Arizona Workforce Connections",{"$nulls":3},"Cleveland National Forest"]
[{"$nulls":6},"Arrupe Jesuit High School",{"$nulls":3},"Coconino National Forest"]
[{"$nulls":6},"Arts Alliance of Northern New Hampshire ",{"$nulls":3},"Collbran Job Corps"]
[{"$nulls":6},"Aspen Environment Foundation",{"$nulls":3},"Columbia Basin Job Corps"]
[{"$nulls":6},"Associated Colleges of Illinois",{"$nulls":3},"Columbia River Gorge National Scenic Area"]
[{"$nulls":6},"Awendaw Regional Outreach Center",{"$nulls":3},"Colville National Forest"]
[{"$nulls":6},"Backcountry Horseman of America",{"$nulls":3},"Coronado National Forest"]
{"$rows_left_out":313}
{"sheet":"21CSC-Members","index":5,"n_rows":181,"n_cols":4,"rows_kept":181,"hidden":true,"merged":[[2,1,2,3]]}
[]
[]
[null,"21CSC MEMBERS"]
[]
[]
[]
[null,"Organization Name","City","State"]
[null,"Mobile Works, Inc. ","Mobile","Alabama"]
[null,"West-Mid Alabama Community Development Corporation, Inc. ","Emelle","Alabama "]
[null,"Alaska Geographic","Anchorage","Alaska "]
[null,"Anchorage Park Foundation ","Anchorage","Alaska "]
[null,"Southeast Alaska Guidance Association (SAGA)","Juneau ","Alaska "]
[null,"Angoon Community Association","Angoon","Alaska "]
[null,"American Conservation Experience","Flagstaff","Arizona"]
[null,"Arizona Conservation Corps ","Flagstaff","Arizona"]
[null,"White Mountain Youth Corps (WMYC)","Lakeside","Arizona"]
[null,"California Conservation Corps","Sacramento","California"]
[null,"Civic Assets","Berkeley","California"]
[null,"Civicorps Corpsmember Academy","Oakland","California"]
[null,"Conservation Corps North Bay","San Rafael","California"]
[null,"Conservation Corps of Long Beach","Long Beach","California"]
[null,"FIELD- Kern Service and Conservation Corps","Tehachapi","California"]
[null,"Fresno Economic Opportunities Commission","Fresno","California"]
[null,"Los Angeles Conservation Corps ","Los Angeles","California"]
[null,"Orange County Conservation Corps","Anaheim","California"]
[null,"Outward Bound Adventures","Pasadena","California"]
[null,"Oxnard City Corps ","Oxnard","California"]
[null,"Sacramento Regional Conservation Corps ","Sacramento","California"]
[null,"San Francisco Conservation Corps","San Francisco","California"]
[null,"San Gabriel Valley Conservation & Service Corps","El Monte","California"]
[null,"San Joaquin Regional Conservation Corps ","Stockton","California"]
[null,"San Jose Conservation Corps and Charter School","San Jose","California"]
[null,"Sequoia Community Corps","Visalia","California"]
[null,"Sonoma County Youth Ecology Corps","Santa Rosa","California"]
[null,"Urban Conservation Corps of the Inland Empire","Riverside","California"]
[null,"Urban Corps of San Diego County","San Diego","California"]
[null,"Colorado Youth Corps Association ","Denver","Colorado"]
[null,"Conservation Legacy","Durango","Colorado"]
[null,"Environment for the Americas","Boulder","Colorado"]
[null,"Geological Society of America","Boulder","Colorado"]
{"$rows_left_out":141}