{"text_format":"3","workbook":"xlsx","n_sheets":7,"sheets":["January Restatement","February Restatement","March Restatement","April Restatement","May Template","Template Instructions","Reference Data"],"not_rendered":{"images":2,"macros":1,"external_links":7,"defined_names":19},"read":"whole","date_system":"1900"}

{"sheet":"January Restatement","index":0,"n_rows":301,"n_cols":16,"rows_kept":301}
[{"$nulls":5},"Enrollment and Payment Data Template"]
["Submission Date:",null,"Change in Enrollment from Prior January Submission? (Y/N)","Yes (populate this sheet with updated enrollment data)","Enrollment Month:","2014-01-01","Submission Status","Initial Submission"]
["State","9 Digit Issuer TIN","5 Digit HIOS Issuer ID","16 Digit QHP ID","Total Premium amount by QHP ID for effectuated enrollments","Total APTC amount by QHP ID for effectuated enrollments","Total CSR amount by QHP ID for effectuated enrollments","Total User Fee amount by QHP ID","Total # of effectuated enrollment groups by QHP ID","Total # of effectuated enrollment groups receiving APTC by QHP ID","Total # of effectuated enrollment groups receiving CSR by QHP ID","Total # of effectuated members by QHP ID","Total # of effectuated members receiving APTC by QHP ID","Total # of effectuated members receiving CSR by QHP ID",null,"Reasons for Validation Failures"]
[{"$nulls":7},{"$f":"ROUND(IF(OR(COUNTIF('Reference Data'!$G$1:$G$17,A4), COUNTIF('Reference Data'!$H$1:$H$100,D4)),0,E4*0.035),2)","v":0}]
[{"$nulls":7},{"$f":"ROUND(IF(OR(COUNTIF('Reference Data'!$G$1:$G$17,A5), COUNTIF('Reference Data'!$H$1:$H$100,D5)),0,E5*0.035),2)","v":0}]
[{"$nulls":7},{"$f":"ROUND(IF(OR(COUNTIF('Reference Data'!$G$1:$G$17,A6), COUNTIF('Reference Data'!$H$1:$H$100,D6)),0,E6*0.035),2)","v":0}]
[{"$nulls":7},{"$f":"ROUND(IF(OR(COUNTIF('Reference Data'!$G$1:$G$17,A7), COUNTIF('Reference Data'!$H$1:$H$100,D7)),0,E7*0.035),2)","v":0}]
[{"$nulls":7},{"$f":"ROUND(IF(OR(COUNTIF('Reference Data'!$G$1:$G$17,A8), COUNTIF('Reference Data'!$H$1:$H$100,D8)),0,E8*0.035),2)","v":0}]
[{"$nulls":7},{"$f":"ROUND(IF(OR(COUNTIF('Reference Data'!$G$1:$G$17,A9), COUNTIF('Reference Data'!$H$1:$H$100,D9)),0,E9*0.035),2)","v":0}]
[{"$nulls":7},{"$f":"ROUND(IF(OR(COUNTIF('Reference Data'!$G$1:$G$17,A10), COUNTIF('Reference Data'!$H$1:$H$100,D10)),0,E10*0.035),2)","v":0}]
[{"$nulls":7},{"$f":"ROUND(IF(OR(COUNTIF('Reference Data'!$G$1:$G$17,A11), COUNTIF('Reference Data'!$H$1:$H$100,D11)),0,E11*0.035),2)","v":0}]
[{"$nulls":7},{"$f":"ROUND(IF(OR(COUNTIF('Reference Data'!$G$1:$G$17,A12), COUNTIF('Reference Data'!$H$1:$H$100,D12)),0,E12*0.035),2)","v":0}]
[{"$nulls":7},{"$f":"ROUND(IF(OR(COUNTIF('Reference Data'!$G$1:$G$17,A13), COUNTIF('Reference Data'!$H$1:$H$100,D13)),0,E13*0.035),2)","v":0}]
[{"$nulls":7},{"$f":"ROUND(IF(OR(COUNTIF('Reference Data'!$G$1:$G$17,A14), COUNTIF('Reference Data'!$H$1:$H$100,D14)),0,E14*0.035),2)","v":0}]
[{"$nulls":7},{"$f":"ROUND(IF(OR(COUNTIF('Reference Data'!$G$1:$G$17,A15), COUNTIF('Reference Data'!$H$1:$H$100,D15)),0,E15*0.035),2)","v":0}]
[{"$nulls":7},{"$f":"ROUND(IF(OR(COUNTIF('Reference Data'!$G$1:$G$17,A16), COUNTIF('Reference Data'!$H$1:$H$100,D16)),0,E16*0.035),2)","v":0}]
[{"$nulls":7},{"$f":"ROUND(IF(OR(COUNTIF('Reference Data'!$G$1:$G$17,A17), COUNTIF('Reference Data'!$H$1:$H$100,D17)),0,E17*0.035),2)","v":0}]
[{"$nulls":7},{"$f":"ROUND(IF(OR(COUNTIF('Reference Data'!$G$1:$G$17,A18), COUNTIF('Reference Data'!$H$1:$H$100,D18)),0,E18*0.035),2)","v":0}]
[{"$nulls":7},{"$f":"ROUND(IF(OR(COUNTIF('Reference Data'!$G$1:$G$17,A19), COUNTIF('Reference Data'!$H$1:$H$100,D19)),0,E19*0.035),2)","v":0}]
[{"$nulls":7},{"$f":"ROUND(IF(OR(COUNTIF('Reference Data'!$G$1:$G$17,A20), COUNTIF('Reference Data'!$H$1:$H$100,D20)),0,E20*0.035),2)","v":0}]
{"$rows_left_out":282}
{"sheet":"February Restatement","index":1,"n_rows":300,"n_cols":16,"rows_kept":300}
[{"$nulls":5},"Enrollment and Payment Data Template"]
["Submission Date:",null,"Change in Enrollment from Prior February Submission? (Y/N)","Yes (populate this sheet with updated enrollment data)","Enrollment Month:","2014-02-01","Submission Status","Initial Submission"]
["State","9 Digit Issuer TIN","5 Digit HIOS Issuer ID","16 Digit QHP ID","Total Premium amount by QHP ID for effectuated enrollments","Total APTC amount by QHP ID for effectuated enrollments","Total CSR amount by QHP ID for effectuated enrollments","Total User Fee amount by QHP ID","Total # of effectuated enrollment groups by QHP ID","Total # of effectuated enrollment groups receiving APTC by QHP ID","Total # of effectuated enrollment groups receiving CSR by QHP ID","Total # of effectuated members by QHP ID","Total # of effectuated members receiving APTC by QHP ID","Total # of effectuated members receiving CSR by QHP ID",null,"Reasons for Validation Failures"]
[{"$nulls":7},{"$f":"ROUND(IF(OR(COUNTIF('Reference Data'!$G$1:$G$17,A4), COUNTIF('Reference Data'!$H$1:$H$100,D4)),0,E4*0.035),2)","v":0}]
[{"$nulls":7},{"$f":"ROUND(IF(OR(COUNTIF('Reference Data'!$G$1:$G$17,A5), COUNTIF('Reference Data'!$H$1:$H$100,D5)),0,E5*0.035),2)","v":0}]
[{"$nulls":7},{"$f":"ROUND(IF(OR(COUNTIF('Reference Data'!$G$1:$G$17,A6), COUNTIF('Reference Data'!$H$1:$H$100,D6)),0,E6*0.035),2)","v":0}]
[{"$nulls":7},{"$f":"ROUND(IF(OR(COUNTIF('Reference Data'!$G$1:$G$17,A7), COUNTIF('Reference Data'!$H$1:$H$100,D7)),0,E7*0.035),2)","v":0}]
[{"$nulls":7},{"$f":"ROUND(IF(OR(COUNTIF('Reference Data'!$G$1:$G$17,A8), COUNTIF('Reference Data'!$H$1:$H$100,D8)),0,E8*0.035),2)","v":0}]
[{"$nulls":7},{"$f":"ROUND(IF(OR(COUNTIF('Reference Data'!$G$1:$G$17,A9), COUNTIF('Reference Data'!$H$1:$H$100,D9)),0,E9*0.035),2)","v":0}]
[{"$nulls":7},{"$f":"ROUND(IF(OR(COUNTIF('Reference Data'!$G$1:$G$17,A10), COUNTIF('Reference Data'!$H$1:$H$100,D10)),0,E10*0.035),2)","v":0}]
[{"$nulls":7},{"$f":"ROUND(IF(OR(COUNTIF('Reference Data'!$G$1:$G$17,A11), COUNTIF('Reference Data'!$H$1:$H$100,D11)),0,E11*0.035),2)","v":0}]
[{"$nulls":7},{"$f":"ROUND(IF(OR(COUNTIF('Reference Data'!$G$1:$G$17,A12), COUNTIF('Reference Data'!$H$1:$H$100,D12)),0,E12*0.035),2)","v":0}]
[{"$nulls":7},{"$f":"ROUND(IF(OR(COUNTIF('Reference Data'!$G$1:$G$17,A13), COUNTIF('Reference Data'!$H$1:$H$100,D13)),0,E13*0.035),2)","v":0}]
[{"$nulls":7},{"$f":"ROUND(IF(OR(COUNTIF('Reference Data'!$G$1:$G$17,A14), COUNTIF('Reference Data'!$H$1:$H$100,D14)),0,E14*0.035),2)","v":0}]
[{"$nulls":7},{"$f":"ROUND(IF(OR(COUNTIF('Reference Data'!$G$1:$G$17,A15), COUNTIF('Reference Data'!$H$1:$H$100,D15)),0,E15*0.035),2)","v":0}]
[{"$nulls":7},{"$f":"ROUND(IF(OR(COUNTIF('Reference Data'!$G$1:$G$17,A16), COUNTIF('Reference Data'!$H$1:$H$100,D16)),0,E16*0.035),2)","v":0}]
[{"$nulls":7},{"$f":"ROUND(IF(OR(COUNTIF('Reference Data'!$G$1:$G$17,A17), COUNTIF('Reference Data'!$H$1:$H$100,D17)),0,E17*0.035),2)","v":0}]
[{"$nulls":7},{"$f":"ROUND(IF(OR(COUNTIF('Reference Data'!$G$1:$G$17,A18), COUNTIF('Reference Data'!$H$1:$H$100,D18)),0,E18*0.035),2)","v":0}]
[{"$nulls":7},{"$f":"ROUND(IF(OR(COUNTIF('Reference Data'!$G$1:$G$17,A19), COUNTIF('Reference Data'!$H$1:$H$100,D19)),0,E19*0.035),2)","v":0}]
[{"$nulls":7},{"$f":"ROUND(IF(OR(COUNTIF('Reference Data'!$G$1:$G$17,A20), COUNTIF('Reference Data'!$H$1:$H$100,D20)),0,E20*0.035),2)","v":0}]
{"$rows_left_out":281}
{"sheet":"March Restatement","index":2,"n_rows":301,"n_cols":16,"rows_kept":301}
[{"$nulls":5},"Enrollment and Payment Data Template"]
["Submission Date:",null,"Change in Enrollment from Prior March Submission? (Y/N)","Yes (populate this sheet with updated enrollment data)","Enrollment Month:","2014-03-01","Submission Status","Initial Submission"]
["State","9 Digit Issuer TIN","5 Digit HIOS Issuer ID","16 Digit QHP ID","Total Premium amount by QHP ID for effectuated enrollments","Total APTC amount by QHP ID for effectuated enrollments","Total CSR amount by QHP ID for effectuated enrollments","Total User Fee amount by QHP ID","Total # of effectuated enrollment groups by QHP ID","Total # of effectuated enrollment groups receiving APTC by QHP ID","Total # of effectuated enrollment groups receiving CSR by QHP ID","Total # of effectuated members by QHP ID","Total # of effectuated members receiving APTC by QHP ID","Total # of effectuated members receiving CSR by QHP ID",null,"Reasons for Validation Failures"]
[{"$nulls":7},{"$f":"ROUND(IF(OR(COUNTIF('Reference Data'!$G$1:$G$17,A4), COUNTIF('Reference Data'!$H$1:$H$100,D4)),0,E4*0.035),2)","v":0}]
[{"$nulls":7},{"$f":"ROUND(IF(OR(COUNTIF('Reference Data'!$G$1:$G$17,A5), COUNTIF('Reference Data'!$H$1:$H$100,D5)),0,E5*0.035),2)","v":0}]
[{"$nulls":7},{"$f":"ROUND(IF(OR(COUNTIF('Reference Data'!$G$1:$G$17,A6), COUNTIF('Reference Data'!$H$1:$H$100,D6)),0,E6*0.035),2)","v":0}]
[{"$nulls":7},{"$f":"ROUND(IF(OR(COUNTIF('Reference Data'!$G$1:$G$17,A7), COUNTIF('Reference Data'!$H$1:$H$100,D7)),0,E7*0.035),2)","v":0}]
[{"$nulls":7},{"$f":"ROUND(IF(OR(COUNTIF('Reference Data'!$G$1:$G$17,A8), COUNTIF('Reference Data'!$H$1:$H$100,D8)),0,E8*0.035),2)","v":0}]
[{"$nulls":7},{"$f":"ROUND(IF(OR(COUNTIF('Reference Data'!$G$1:$G$17,A9), COUNTIF('Reference Data'!$H$1:$H$100,D9)),0,E9*0.035),2)","v":0}]
[{"$nulls":7},{"$f":"ROUND(IF(OR(COUNTIF('Reference Data'!$G$1:$G$17,A10), COUNTIF('Reference Data'!$H$1:$H$100,D10)),0,E10*0.035),2)","v":0}]
[{"$nulls":7},{"$f":"ROUND(IF(OR(COUNTIF('Reference Data'!$G$1:$G$17,A11), COUNTIF('Reference Data'!$H$1:$H$100,D11)),0,E11*0.035),2)","v":0}]
[{"$nulls":7},{"$f":"ROUND(IF(OR(COUNTIF('Reference Data'!$G$1:$G$17,A12), COUNTIF('Reference Data'!$H$1:$H$100,D12)),0,E12*0.035),2)","v":0}]
[{"$nulls":7},{"$f":"ROUND(IF(OR(COUNTIF('Reference Data'!$G$1:$G$17,A13), COUNTIF('Reference Data'!$H$1:$H$100,D13)),0,E13*0.035),2)","v":0}]
[{"$nulls":7},{"$f":"ROUND(IF(OR(COUNTIF('Reference Data'!$G$1:$G$17,A14), COUNTIF('Reference Data'!$H$1:$H$100,D14)),0,E14*0.035),2)","v":0}]
[{"$nulls":7},{"$f":"ROUND(IF(OR(COUNTIF('Reference Data'!$G$1:$G$17,A15), COUNTIF('Reference Data'!$H$1:$H$100,D15)),0,E15*0.035),2)","v":0}]
[{"$nulls":7},{"$f":"ROUND(IF(OR(COUNTIF('Reference Data'!$G$1:$G$17,A16), COUNTIF('Reference Data'!$H$1:$H$100,D16)),0,E16*0.035),2)","v":0}]
[{"$nulls":7},{"$f":"ROUND(IF(OR(COUNTIF('Reference Data'!$G$1:$G$17,A17), COUNTIF('Reference Data'!$H$1:$H$100,D17)),0,E17*0.035),2)","v":0}]
[{"$nulls":7},{"$f":"ROUND(IF(OR(COUNTIF('Reference Data'!$G$1:$G$17,A18), COUNTIF('Reference Data'!$H$1:$H$100,D18)),0,E18*0.035),2)","v":0}]
[{"$nulls":7},{"$f":"ROUND(IF(OR(COUNTIF('Reference Data'!$G$1:$G$17,A19), COUNTIF('Reference Data'!$H$1:$H$100,D19)),0,E19*0.035),2)","v":0}]
[{"$nulls":7},{"$f":"ROUND(IF(OR(COUNTIF('Reference Data'!$G$1:$G$17,A20), COUNTIF('Reference Data'!$H$1:$H$100,D20)),0,E20*0.035),2)","v":0}]
{"$rows_left_out":282}
{"sheet":"April Restatement","index":3,"n_rows":301,"n_cols":16,"rows_kept":301}
[{"$nulls":5},"Enrollment and Payment Data Template"]
["Submission Date:",null,"Change in Enrollment from Prior March Submission? (Y/N)","Yes (populate this sheet with updated enrollment data)","Enrollment Month:","2014-04-01","Submission Status","Initial Submission"]
["State","9 Digit Issuer TIN","5 Digit HIOS Issuer ID","16 Digit QHP ID","Total Premium amount by QHP ID for effectuated enrollments","Total APTC amount by QHP ID for effectuated enrollments","Total CSR amount by QHP ID for effectuated enrollments","Total User Fee amount by QHP ID","Total # of effectuated enrollment groups by QHP ID","Total # of effectuated enrollment groups receiving APTC by QHP ID","Total # of effectuated enrollment groups receiving CSR by QHP ID","Total # of effectuated members by QHP ID","Total # of effectuated members receiving APTC by QHP ID","Total # of effectuated members receiving CSR by QHP ID",null,"Reasons for Validation Failures"]
[{"$nulls":7},{"$f":"ROUND(IF(OR(COUNTIF('Reference Data'!$G$1:$G$17,A4), COUNTIF('Reference Data'!$H$1:$H$100,D4)),0,E4*0.035),2)","v":0}]
[{"$nulls":7},{"$f":"ROUND(IF(OR(COUNTIF('Reference Data'!$G$1:$G$17,A5), COUNTIF('Reference Data'!$H$1:$H$100,D5)),0,E5*0.035),2)","v":0}]
[{"$nulls":7},{"$f":"ROUND(IF(OR(COUNTIF('Reference Data'!$G$1:$G$17,A6), COUNTIF('Reference Data'!$H$1:$H$100,D6)),0,E6*0.035),2)","v":0}]
[{"$nulls":7},{"$f":"ROUND(IF(OR(COUNTIF('Reference Data'!$G$1:$G$17,A7), COUNTIF('Reference Data'!$H$1:$H$100,D7)),0,E7*0.035),2)","v":0}]
[{"$nulls":7},{"$f":"ROUND(IF(OR(COUNTIF('Reference Data'!$G$1:$G$17,A8), COUNTIF('Reference Data'!$H$1:$H$100,D8)),0,E8*0.035),2)","v":0}]
[{"$nulls":7},{"$f":"ROUND(IF(OR(COUNTIF('Reference Data'!$G$1:$G$17,A9), COUNTIF('Reference Data'!$H$1:$H$100,D9)),0,E9*0.035),2)","v":0}]
[{"$nulls":7},{"$f":"ROUND(IF(OR(COUNTIF('Reference Data'!$G$1:$G$17,A10), COUNTIF('Reference Data'!$H$1:$H$100,D10)),0,E10*0.035),2)","v":0}]
[{"$nulls":7},{"$f":"ROUND(IF(OR(COUNTIF('Reference Data'!$G$1:$G$17,A11), COUNTIF('Reference Data'!$H$1:$H$100,D11)),0,E11*0.035),2)","v":0}]
[{"$nulls":7},{"$f":"ROUND(IF(OR(COUNTIF('Reference Data'!$G$1:$G$17,A12), COUNTIF('Reference Data'!$H$1:$H$100,D12)),0,E12*0.035),2)","v":0}]
[{"$nulls":7},{"$f":"ROUND(IF(OR(COUNTIF('Reference Data'!$G$1:$G$17,A13), COUNTIF('Reference Data'!$H$1:$H$100,D13)),0,E13*0.035),2)","v":0}]
[{"$nulls":7},{"$f":"ROUND(IF(OR(COUNTIF('Reference Data'!$G$1:$G$17,A14), COUNTIF('Reference Data'!$H$1:$H$100,D14)),0,E14*0.035),2)","v":0}]
[{"$nulls":7},{"$f":"ROUND(IF(OR(COUNTIF('Reference Data'!$G$1:$G$17,A15), COUNTIF('Reference Data'!$H$1:$H$100,D15)),0,E15*0.035),2)","v":0}]
[{"$nulls":7},{"$f":"ROUND(IF(OR(COUNTIF('Reference Data'!$G$1:$G$17,A16), COUNTIF('Reference Data'!$H$1:$H$100,D16)),0,E16*0.035),2)","v":0}]
[{"$nulls":7},{"$f":"ROUND(IF(OR(COUNTIF('Reference Data'!$G$1:$G$17,A17), COUNTIF('Reference Data'!$H$1:$H$100,D17)),0,E17*0.035),2)","v":0}]
[{"$nulls":7},{"$f":"ROUND(IF(OR(COUNTIF('Reference Data'!$G$1:$G$17,A18), COUNTIF('Reference Data'!$H$1:$H$100,D18)),0,E18*0.035),2)","v":0}]
[{"$nulls":7},{"$f":"ROUND(IF(OR(COUNTIF('Reference Data'!$G$1:$G$17,A19), COUNTIF('Reference Data'!$H$1:$H$100,D19)),0,E19*0.035),2)","v":0}]
[{"$nulls":7},{"$f":"ROUND(IF(OR(COUNTIF('Reference Data'!$G$1:$G$17,A20), COUNTIF('Reference Data'!$H$1:$H$100,D20)),0,E20*0.035),2)","v":0}]
{"$rows_left_out":282}
{"sheet":"May Template","index":4,"n_rows":301,"n_cols":16,"rows_kept":301}
[{"$nulls":5},"Enrollment and Payment Data Template"]
["Submission Date:",{"$nulls":3},"Enrollment Month:","2014-05-01","Submission Status","Initial Submission"]
["State","9 Digit Issuer TIN","5 Digit HIOS Issuer ID","16 Digit QHP ID","Total Premium amount by QHP ID for effectuated enrollments","Total APTC amount by QHP ID for effectuated enrollments","Total CSR amount by QHP ID for effectuated enrollments","Total User Fee amount by QHP ID","Total # of effectuated enrollment groups by QHP ID","Total # of effectuated enrollment groups receiving APTC by QHP ID","Total # of effectuated enrollment groups receiving CSR by QHP ID","Total # of effectuated members by QHP ID","Total # of effectuated members receiving APTC by QHP ID","Total # of effectuated members receiving CSR by QHP ID",null,"Reasons for Validation Failures"]
[{"$nulls":7},{"$f":"ROUND(IF(OR(COUNTIF('Reference Data'!$G$1:$G$17,A4), COUNTIF('Reference Data'!$H$1:$H$100,D4)),0,E4*0.035),2)","v":0}]
[{"$nulls":7},{"$f":"ROUND(IF(OR(COUNTIF('Reference Data'!$G$1:$G$17,A5), COUNTIF('Reference Data'!$H$1:$H$100,D5)),0,E5*0.035),2)","v":0}]
[{"$nulls":7},{"$f":"ROUND(IF(OR(COUNTIF('Reference Data'!$G$1:$G$17,A6), COUNTIF('Reference Data'!$H$1:$H$100,D6)),0,E6*0.035),2)","v":0}]
[{"$nulls":7},{"$f":"ROUND(IF(OR(COUNTIF('Reference Data'!$G$1:$G$17,A7), COUNTIF('Reference Data'!$H$1:$H$100,D7)),0,E7*0.035),2)","v":0}]
[{"$nulls":7},{"$f":"ROUND(IF(OR(COUNTIF('Reference Data'!$G$1:$G$17,A8), COUNTIF('Reference Data'!$H$1:$H$100,D8)),0,E8*0.035),2)","v":0}]
[{"$nulls":7},{"$f":"ROUND(IF(OR(COUNTIF('Reference Data'!$G$1:$G$17,A9), COUNTIF('Reference Data'!$H$1:$H$100,D9)),0,E9*0.035),2)","v":0}]
[{"$nulls":7},{"$f":"ROUND(IF(OR(COUNTIF('Reference Data'!$G$1:$G$17,A10), COUNTIF('Reference Data'!$H$1:$H$100,D10)),0,E10*0.035),2)","v":0}]
[{"$nulls":7},{"$f":"ROUND(IF(OR(COUNTIF('Reference Data'!$G$1:$G$17,A11), COUNTIF('Reference Data'!$H$1:$H$100,D11)),0,E11*0.035),2)","v":0}]
[{"$nulls":7},{"$f":"ROUND(IF(OR(COUNTIF('Reference Data'!$G$1:$G$17,A12), COUNTIF('Reference Data'!$H$1:$H$100,D12)),0,E12*0.035),2)","v":0}]
[{"$nulls":7},{"$f":"ROUND(IF(OR(COUNTIF('Reference Data'!$G$1:$G$17,A13), COUNTIF('Reference Data'!$H$1:$H$100,D13)),0,E13*0.035),2)","v":0}]
[{"$nulls":7},{"$f":"ROUND(IF(OR(COUNTIF('Reference Data'!$G$1:$G$17,A14), COUNTIF('Reference Data'!$H$1:$H$100,D14)),0,E14*0.035),2)","v":0}]
[{"$nulls":7},{"$f":"ROUND(IF(OR(COUNTIF('Reference Data'!$G$1:$G$17,A15), COUNTIF('Reference Data'!$H$1:$H$100,D15)),0,E15*0.035),2)","v":0}]
[{"$nulls":7},{"$f":"ROUND(IF(OR(COUNTIF('Reference Data'!$G$1:$G$17,A16), COUNTIF('Reference Data'!$H$1:$H$100,D16)),0,E16*0.035),2)","v":0}]
[{"$nulls":7},{"$f":"ROUND(IF(OR(COUNTIF('Reference Data'!$G$1:$G$17,A17), COUNTIF('Reference Data'!$H$1:$H$100,D17)),0,E17*0.035),2)","v":0}]
[{"$nulls":7},{"$f":"ROUND(IF(OR(COUNTIF('Reference Data'!$G$1:$G$17,A18), COUNTIF('Reference Data'!$H$1:$H$100,D18)),0,E18*0.035),2)","v":0}]
[{"$nulls":7},{"$f":"ROUND(IF(OR(COUNTIF('Reference Data'!$G$1:$G$17,A19), COUNTIF('Reference Data'!$H$1:$H$100,D19)),0,E19*0.035),2)","v":0}]
[{"$nulls":7},{"$f":"ROUND(IF(OR(COUNTIF('Reference Data'!$G$1:$G$17,A20), COUNTIF('Reference Data'!$H$1:$H$100,D20)),0,E20*0.035),2)","v":0}]
{"$rows_left_out":282}
{"sheet":"Template Instructions","index":5,"n_rows":50,"n_cols":6,"rows_kept":50,"merged":[[25,3,25,4],[26,3,26,4],[27,3,27,4],[28,3,28,4],[29,3,29,4],[30,3,30,4],[31,3,31,4],[32,3,32,4],[33,3,33,4],[34,3,34,4],[35,3,35,4],[36,3,36,4],[37,3,37,4],[38,3,38,4],[39,3,39,4],[40,3,40,4],[41,3,41,4],[42,3,42,4],[43,3,43,4],[44,1,45,1],[44,3,44,4],[45,3,45,4],[46,3,46,4],[47,3,47,4],[48,3,48,4],[49,3,49,4]]}
[]
[null,"Enrollment and Payment Data Template Instructions"]
[null,"Data Template Objective:","To document the total premium, APTC, CSR advance payment, and user fee amounts for all effectuated enrollment groups by Qualified Health Plan (QHP) ID. User fees do not apply to SBMs."]
[null,null,"1.) During each data submission window, submitters will be allowed to submit multiple versions of the Enrollment and Payment Data Template (the \"Template\").  Based on data validation checks, CMS may require submitters to submit updated versions of the Template during each data collection window."]
[null,"Submissions Guidelines:","2.) Submitters will email the Template to the Marketplacepayments@cms.hhs.gov mailbox.  Submitters will be instructed to send the Templates as a ‘reply’ to an email that they get from CMS.  Please ensure that the email subject line retains the issuer's 5-digit HIOS ID.  Additionally, email submissions should include the following information in the body of the email:"]
[null,null,"- Whether this is a resubmission, and reason for the resubmission where necessary"]
[null,null,"- Enrollment and Payment Data Template attachment"]
[null,null,"- Certification of data accuracy"]
[null,null,"1.) Submission Window for May payment initial submission of the Production Enrollment and Payment Data Templates: 4/16/14 - 4/21/14"]
[null,"Data Collection \nTimelines:","2) Submission Window for resubmission of the May Production Enrollment and Payment Data Templates: 4/23/14 -4/25/14"]
[]
[null,null,"1.) In the FFM, data should be submitted for issuers in both the individual and small group markets. For small group market issuers in the FFM, all APTC and CSR enrollment and payment fields on the Template should be listed as zero since SHOP plans do not receive APTC or CSR payments.  FFM SHOP plans must be included in the Template as these plans are subject to user fees."]
[null,null,"2.) In the SBM, data should be submitted for the individual market. User fee amounts will automatically populate to zero if the issuer is participating in an SBM."]
[null,null,"3.) Any stand alone dental issuer expecting to receive no APTC payments for the current collection month is not required to submit an Enrollment and Payment Data workbook.  Such stand alone dental issuers must state that they expect to receive no APTC on the submission certification form."]
[null,null,"4) Enrollment and Payment Data workbooks should not be submitted for issuers with zero enrollments as these plans would have $0  total premium, $0 advance APTC or CSR payments, and $0 user fees. \nIf the submitter is an issuer, the submitter must identify that issuer ID as having no enrollments on the submission certification form.  \nIf the submitter is an SBM, the submitter must omit that issuer ID from the Enrollment and Payment Data workbook and identify that issuer ID as having no enrollments on the submission certification form. "]
[null,null,"5.) If the submitter is an issuer, all information for an issuer should be documented in a single Enrollment and Payment Data Template. Issuers will be identified by the 5 digit HIOS ID."]
[null,"Payment Reporting Completion Information:","6.) If the submitter is an SBM, data for all issuers in the SBM should be included in a single Enrollment and Payment Data Template.  Data should be documented in numerical order by issuer ID.  For example, if an SBM has four participating individual market issuers with enrollment data, data for all four issuers will be included within the same tab in a single Enrollment and Payment Data Template file submission."]
[null,null,"7.) CMS will replace any previously submitted files with the resubmission file.  As a result, when submitters send resubmission files, the file must include the most current data for all issuers.  For example, if during the initial submission, CMS determined that three of the four QHP ID's data required modification, when the submitter sends the corrected data for its three QHP IDs, it must also submit the original data for the fourth QHP ID in the same file.      "]
[null,null,"8.) Blank fields will be treated as zero values in the payment calculations.  Submitters are encouraged to enter zero values instead of leaving fields blank."]
[null,null,"9.) Data should be submitted at the 16-digit QHP ID level (14 digit standard component ID plus 2 digit variant ID, otherwise known as the HIOS Plan ID).  There should be no spaces  between the 14 digit standard component ID and the 2 digit variant ID and no special characters."]
{"$rows_left_out":31}
{"sheet":"Reference Data","index":6,"n_rows":100,"n_cols":12,"rows_kept":100,"hidden":true}
["Yes (populate this sheet with updated enrollment data)",null,"Initial Submission",{"$nulls":3},"CA","10753UT004000101",null,"Issuer ID","16 Digit QHP ID","CSR PMPM"]
["No (do not populate sheet below)",null,"Resubmission 1",{"$nulls":3},"CO","10753UT004000201",null,10191,"10191NJ003000101",0]
[null,null,"Resubmission 2",{"$nulls":3},"CT","10753UT004000301",null,10191,"10191NJ003000201",0]
[null,null,"Resubmission 3",{"$nulls":3},"DC","10753UT004000401",null,10191,"10191NJ004000101",0]
[{"$nulls":6},"HI","10753UT004000501",null,10191,"10191NJ004000201",0]
[{"$nulls":6},"ID","10753UT004000601",null,10191,"10191NJ005000101",0]
[{"$nulls":6},"KY","10753UT004000701",null,10191,"10191NJ005000201",0]
[{"$nulls":6},"MA","10753UT004000801",null,10191,"10191NJ005000301",0]
[{"$nulls":6},"MD","10753UT004000901",null,10191,"10191NJ006000101",0]
[{"$nulls":6},"MN","10753UT004001001",null,10191,"10191NJ006000201",0]
[{"$nulls":6},"NM","10753UT004001101",null,10191,"10191NJ006000301",0]
[{"$nulls":6},"NV","10753UT004001201",null,10191,"10191NJ007000101",0]
[{"$nulls":6},"NY","10753UT004001301",null,10191,"10191NJ007000301",0]
[{"$nulls":6},"OR","10753UT004001401",null,10191,"10191NJ007000401",0]
[{"$nulls":6},"RI","10753UT004001501",null,10191,"10191NJ010000101",0]
[{"$nulls":6},"VT","10753UT004001601",null,10191,"10191NJ010000201",0]
[{"$nulls":6},"WA","11324MS001000101",null,10191,"10191NJ010000301",0]
[{"$nulls":7},"11324MS001000201",null,10191,"10191NJ012000101",0]
[{"$nulls":7},"11324MS001000301",null,10191,"10191NJ012000201",0]
[{"$nulls":7},"11324MS001000401",null,10191,"10191NJ012000301",0]
{"$rows_left_out":80}