{"text_format":"3","workbook":"xlsx","n_sheets":12,"sheets":["Instructions","Section 1","Section 2","Section 3","Section 4","Summary","Reference List","Lists","Checks","OutputForCSV","TempOutput","Data for Summary"],"not_rendered":{"macros":1,"defined_names":64,"comments":8},"read":"whole","date_system":"1900"}

{"sheet":"Instructions","index":0,"n_rows":21,"n_cols":3,"rows_kept":21}
[]
[null,null,"U.S. Environmental Protection Agency"]
[null,null,"Stratospheric Ozone Protection Program"]
[]
[null,null,"Methyl Bromide Importer Quarterly Report (Sec 82.13)"]
[null,null,"Version 1.0 "]
[null,null,"Last Updated: December 2017"]
[]
[null,null,"Instructions"]
[null,null,"Complete this form by filling in the data fields that are highlighted in blue.  Guidance on how to complete individual data fields are provided in comment bubbles. Use the arrows to navigate between the tabs. Once completed, use the 'prepare submission' button on the Summary tab to generate your CSV file.  "]
[null,null,"Copying and Pasting Data: If data are pasted into this reporting form from another spreadsheet, the formatting of specific cells must be consistent with the requirements of the form in order to be "]
[null,null,"accepted into EPA’s ODS Tracking System. Refer to the Reference List to identify the valid naming scheme for specific data fields. Additionally, select \"Paste As Values\" when pasting data into the form."]
[null,null,"Report Submission: This Excel file, the generated CSV file, and all supporting attachments should be submitted to EPA through the Central Data Exchange (CDX). Refer to EPA's website for additional information on form submission:"]
[null,null,"https://www.epa.gov/ods-phaseout/ods-recordkeeping-and-reporting"]
[]
[null,null,"All information submitted to EPA will be treated as confidential in accordance with 40 CFR Part 2, Subpart B, and will only be disclosed by the means set forth in the subpart. "]
[null,null,"The public reporting and recordkeeping burden for this collection of information is estimated to average 2 hours per response.  Send comments on the Agency's need for this information, the accuracy of the provided burden estimates, and any suggested methods for minimizing respondent burden, including through the use of automated collection techniques to the Director, Collection Strategies Division, U.S. Environmental Protection Agency (2822T), 1200 Pennsylvania Avenue NW, Washington, D.C. 20460.  Include the OMB control number in any correspondence.  Do not send the completed form to this address."]
[]
[null,null,"EPA Form #5900-144"]
[null,null,"OMB Control Number: 2060-0482"]
[null,null,"Expiration Date: 8/31/2018"]

{"sheet":"Section 1","index":1,"n_rows":16,"n_cols":9,"rows_kept":16,"merged":[[7,2,7,3]]}
[]
[null,null,"U.S. Environmental Protection Agency"]
[null,null,"Methyl Bromide Importer Quarterly Report"]
[]
[null,null,"   Date Prepared:",{"$f":"TODAY()","v":"2017-12-06"}]
[]
[null,null,"Section 1: Report Identification Information "]
[null,null,"Complete all fields below.  No fields may be left blank."]
[null,null,"Company Name: ",null,null,{"$f":"IF(D9=0,1,0)","v":1}]
[null,null,"Submission Type:",null,null,{"$f":"IF(OR(SubTSelection=Lists!C3,SubTSelection=Lists!C4),0,1)","v":1},null,null,{"$f":"IF(SubTSelection=\"\",\"\",IF(OR(SubTSelection=Lists!C3,SubTSelection=Lists!C4),\"\",\"PLEASE SELECT A VALID SUBMISSION TYPE FROM THE DROPDOWN LIST\"))","v":""}]
[null,null,"Reporting Year:",null,null,{"$f":"IF(OR($D$11=0,$D$11>YEAR(TODAY())),1,0)","v":1},null,null,{"$f":"IF(D11>YEAR(TODAY()),\"PLEASE CHOOSE A CURRENT OR PAST YEAR\",\"\")","v":""}]
[null,null,"Reporting Quarter:",null,null,{"$f":"IF(OR(ReportQtr=0,ReportQtr>Lists!E6),1,0)","v":1},null,null,{"$f":"IF(ReportQtr>Lists!E6,\"PLEASE SELECT A VALID QUARTER FROM THE DROPDOWN LIST\",\"\")","v":""}]
[null,null,"Importer Number:",null,null,{"$f":"IF(OR($D$13=0,LEN(D13)<9,LEN(D13)>11),1,0)","v":1},null,null,{"$f":"IF(D13=\"\",\"\",IF(OR(LEN(D13)=9,LEN(D13)=10,LEN(D13)=11),\"\",\"PLEASE ENTER A 9 OR 11-DIGIT NUMBER\"))","v":""}]
[{"$nulls":3},""]
[{"$nulls":3},{"$f":"Lists!C3","v":"Original Submission"}]
[{"$nulls":3},{"$f":"Lists!C4","v":"Re-Submittal"}]

{"sheet":"Section 2","index":2,"n_rows":312,"n_cols":28,"rows_kept":312,"merged":[[6,2,6,3],[7,2,7,3],[10,2,10,12],[11,2,11,9]]}
[{"$nulls":10},"ImporterCol"]
[{"$nulls":10},{"$f":"IF('Section 1'!D13=0,\"\",'Section 1'!D13)","v":""}]
[]
[null,null,"U.S. Environmental Protection Agency"]
[null,null,"Methyl Bromide Importer Quarterly Report"]
[]
[null,null,"Company Name:",null,{"$f":"IF('Section 1'!D9=0,\"\",'Section 1'!D9)","v":""}]
[null,null,"Reporting Period:",null,{"$f":"IF(OR('Section 1'!D11=0,'Section 1'!D12=0),\"\",\"Quarter \"&'Section 1'!D12&\", \"&'Section 1'!D11)","v":""}]
[]
[null,null,"Section 2: Import Transaction Data"]
[null,null,"In the table below, enter data for each methyl bromide import transaction that took place during the reporting period.  If no methyl bromide was imported, the table may be left blank. For each transaction, all fields are required.  As a reminder, if methyl bromide was imported for QPS applications, global lab, emergency uses, second party transformation, or second party destruction, a copy of the transformation verification, destruction verification, QPS certification, and/or essential use certification from each company for whom material was imported must be provided to EPA along with the submission of this report.\n"]
[null,null,"If copying and pasting data into the table, please refer to the Reference List and the accompanying instructions."]
[null,null,"Transaction Number","Date of Import","Source Country","Name of the Chemical Imported ","Total Quantity Imported","Commodity Code","Port of Entry into the United States","Customs Entry Summary Number","Shipment Importer Number","Transaction Type","Intended Use"]
[null,null,"Autopopulated","Date","Selection","Autopopulated","kg","Text","Text","Text","Number","Selection","Selection",{"$nulls":4},"Checks"]
[null,null,1,"2018-01-15","Australia",{"$f":"IF($D15=\"\", \"\", \"CH3Br\")","v":"CH3Br"},{"v":5000,"d":"5,000.00"},"2903.39.1520","Miami, FL","abc123456789",12345678900,"New ","QPS",{"$nulls":4},"ActiveRow?","Date Range Check","Row Completed?","Valid Country","2nd Party Trans, Destruction, QPS","2nd Party Transformation","2nd Party Destruction","QPS","Lab/EU in Section3","Valid Transaction Type","Valid Intended Use"]
["1st",null,{"$f":"IF(F16=\"\",\"\",1)","v":""},null,null,{"$f":"IF($D16=\"\", \"\", \"CH3Br\")","v":""},{"$nulls":4},"",{"$nulls":4},{"$f":"IF(SUM(S16:T16,U16:U16,AA16:AB16)>0,\"ROW INCOMPLETE OR INVALID DATA ENTERED; ENTER/EDIT DATA IN REQUIRED FIELDS\",\"\")","v":""},null,{"$f":"IF(C16=\"\",\"N\",\"Y\")","v":"N"},{"$f":"IF(OR(D16=0,AND(D16>=StartDate,D16<=EndDate)),0,1)","v":0},{"$f":"IF(C16=\"\",0,IF(OR(D16=0,E16=0,F16=0,G16=0,H16=0,I16=0,K16=0,K16=\"\",L16=0,M16=0,AND(L16=Lists!$I$3,J16=0)),1,0))","v":0},{"$f":"IF(E16=0,0,IF(COUNTIF(Lists!$B$3:$B$203,E16)>0,0,1))","v":0},{"$f":"SUM(W16:Y16)","v":0},{"$f":"IF(M16=Lists!$J$6,IF(COUNTIF('Section 3'!$G$15:$G$24,Lists!$H$5)>0,0,1), 0)","v":0},{"$f":"IF(M16=Lists!$J$8,IF(COUNTIF('Section 3'!$G$15:$G$24,Lists!$H$6)>0,0,1), 0)","v":0},{"$f":"IF(M16=Lists!$J$9,IF(COUNTIF('Section 3'!$G$15:$G$24,Lists!$H$4)>0,0,1), 0)","v":0},{"$f":"IF(M16=Lists!$J$11,IF(COUNTIF('Section 3'!$G$15:$G$24,Lists!$H$3)>0,0,1),IF(M16=Lists!$J$10,IF(COUNTIF('Section 3'!$G$15:$G$24,Lists!$H$7)>0,0,1),0))","v":0},{"$f":"IF(L16=0,0,IF(COUNTIF(MeBrTransactionType,L16)>0,0,1))","v":0},{"$f":"IF(M16=0,0,IF(OR(COUNTIF(MeBrNewIntendedUses,M16)>0,COUNTIF(HeelsIntendedUses,M16)>0),0,1))","v":0}]
[null,null,{"$f":"IF(F17=\"\",\"\",MAX($C$16:C16)+1)","v":""},null,null,{"$f":"IF($D17=\"\", \"\", \"CH3Br\")","v":""},{"$nulls":4},"",{"$nulls":4},{"$f":"IF(SUM(S17:T17,U17:U17,AA17:AB17)>0,\"ROW INCOMPLETE OR INVALID DATA ENTERED; ENTER/EDIT DATA IN REQUIRED FIELDS\",\"\")","v":""},null,"N",0,{"$f":"IF(C17=\"\",0,IF(OR(D17=0,E17=0,F17=0,G17=0,H17=0,I17=0,K17=0,K17=\"\",L17=0,M17=0,AND(L17=Lists!$I$3,J17=0)),1,0))","v":0},{"$f":"IF(E17=0,0,IF(COUNTIF(Lists!$B$3:$B$203,E17)>0,0,1))","v":0},{"$f":"SUM(W17:Y17)","v":0},{"$f":"IF(M17=Lists!$J$6,IF(COUNTIF('Section 3'!$G$15:$G$24,Lists!$H$5)>0,0,1), 0)","v":0},{"$f":"IF(M17=Lists!$J$8,IF(COUNTIF('Section 3'!$G$15:$G$24,Lists!$H$6)>0,0,1), 0)","v":0},{"$f":"IF(M17=Lists!$J$9,IF(COUNTIF('Section 3'!$G$15:$G$24,Lists!$H$4)>0,0,1), 0)","v":0},{"$f":"IF(M17=Lists!$J$11,IF(COUNTIF('Section 3'!$G$15:$G$24,Lists!$H$3)>0,0,1),IF(M17=Lists!$J$10,IF(COUNTIF('Section 3'!$G$15:$G$24,Lists!$H$7)>0,0,1),0))","v":0},0,0]
[null,null,{"$f":"IF(F18=\"\",\"\",MAX($C$16:C17)+1)","v":""},null,null,"",{"$nulls":4},"",{"$nulls":4},"",null,"N",0,{"$f":"IF(C18=\"\",0,IF(OR(D18=0,E18=0,F18=0,G18=0,H18=0,I18=0,K18=0,K18=\"\",L18=0,M18=0,AND(L18=Lists!$I$3,J18=0)),1,0))","v":0},{"$f":"IF(E18=0,0,IF(COUNTIF(Lists!$B$3:$B$203,E18)>0,0,1))","v":0},0,{"$f":"IF(M18=Lists!$J$6,IF(COUNTIF('Section 3'!$G$15:$G$24,Lists!$H$5)>0,0,1), 0)","v":0},{"$f":"IF(M18=Lists!$J$8,IF(COUNTIF('Section 3'!$G$15:$G$24,Lists!$H$6)>0,0,1), 0)","v":0},{"$f":"IF(M18=Lists!$J$9,IF(COUNTIF('Section 3'!$G$15:$G$24,Lists!$H$4)>0,0,1), 0)","v":0},{"$f":"IF(M18=Lists!$J$11,IF(COUNTIF('Section 3'!$G$15:$G$24,Lists!$H$3)>0,0,1),IF(M18=Lists!$J$10,IF(COUNTIF('Section 3'!$G$15:$G$24,Lists!$H$7)>0,0,1),0))","v":0},0,0]
[null,null,{"$f":"IF(F19=\"\",\"\",MAX($C$16:C18)+1)","v":""},null,null,"",{"$nulls":4},"",{"$nulls":4},"",null,"N",0,{"$f":"IF(C19=\"\",0,IF(OR(D19=0,E19=0,F19=0,G19=0,H19=0,I19=0,K19=0,K19=\"\",L19=0,M19=0,AND(L19=Lists!$I$3,J19=0)),1,0))","v":0},{"$f":"IF(E19=0,0,IF(COUNTIF(Lists!$B$3:$B$203,E19)>0,0,1))","v":0},0,{"$f":"IF(M19=Lists!$J$6,IF(COUNTIF('Section 3'!$G$15:$G$24,Lists!$H$5)>0,0,1), 0)","v":0},{"$f":"IF(M19=Lists!$J$8,IF(COUNTIF('Section 3'!$G$15:$G$24,Lists!$H$6)>0,0,1), 0)","v":0},{"$f":"IF(M19=Lists!$J$9,IF(COUNTIF('Section 3'!$G$15:$G$24,Lists!$H$4)>0,0,1), 0)","v":0},{"$f":"IF(M19=Lists!$J$11,IF(COUNTIF('Section 3'!$G$15:$G$24,Lists!$H$3)>0,0,1),IF(M19=Lists!$J$10,IF(COUNTIF('Section 3'!$G$15:$G$24,Lists!$H$7)>0,0,1),0))","v":0},0,0]
[null,null,{"$f":"IF(F20=\"\",\"\",MAX($C$16:C19)+1)","v":""},null,null,"",{"$nulls":4},"",{"$nulls":4},"",null,"N",0,{"$f":"IF(C20=\"\",0,IF(OR(D20=0,E20=0,F20=0,G20=0,H20=0,I20=0,K20=0,K20=\"\",L20=0,M20=0,AND(L20=Lists!$I$3,J20=0)),1,0))","v":0},{"$f":"IF(E20=0,0,IF(COUNTIF(Lists!$B$3:$B$203,E20)>0,0,1))","v":0},0,{"$f":"IF(M20=Lists!$J$6,IF(COUNTIF('Section 3'!$G$15:$G$24,Lists!$H$5)>0,0,1), 0)","v":0},{"$f":"IF(M20=Lists!$J$8,IF(COUNTIF('Section 3'!$G$15:$G$24,Lists!$H$6)>0,0,1), 0)","v":0},{"$f":"IF(M20=Lists!$J$9,IF(COUNTIF('Section 3'!$G$15:$G$24,Lists!$H$4)>0,0,1), 0)","v":0},{"$f":"IF(M20=Lists!$J$11,IF(COUNTIF('Section 3'!$G$15:$G$24,Lists!$H$3)>0,0,1),IF(M20=Lists!$J$10,IF(COUNTIF('Section 3'!$G$15:$G$24,Lists!$H$7)>0,0,1),0))","v":0},0,0]
[null,null,{"$f":"IF(F21=\"\",\"\",MAX($C$16:C20)+1)","v":""},null,null,"",{"$nulls":4},"",{"$nulls":4},"",null,"N",0,{"$f":"IF(C21=\"\",0,IF(OR(D21=0,E21=0,F21=0,G21=0,H21=0,I21=0,K21=0,K21=\"\",L21=0,M21=0,AND(L21=Lists!$I$3,J21=0)),1,0))","v":0},{"$f":"IF(E21=0,0,IF(COUNTIF(Lists!$B$3:$B$203,E21)>0,0,1))","v":0},0,{"$f":"IF(M21=Lists!$J$6,IF(COUNTIF('Section 3'!$G$15:$G$24,Lists!$H$5)>0,0,1), 0)","v":0},{"$f":"IF(M21=Lists!$J$8,IF(COUNTIF('Section 3'!$G$15:$G$24,Lists!$H$6)>0,0,1), 0)","v":0},{"$f":"IF(M21=Lists!$J$9,IF(COUNTIF('Section 3'!$G$15:$G$24,Lists!$H$4)>0,0,1), 0)","v":0},{"$f":"IF(M21=Lists!$J$11,IF(COUNTIF('Section 3'!$G$15:$G$24,Lists!$H$3)>0,0,1),IF(M21=Lists!$J$10,IF(COUNTIF('Section 3'!$G$15:$G$24,Lists!$H$7)>0,0,1),0))","v":0},0,0]
[null,null,{"$f":"IF(F22=\"\",\"\",MAX($C$16:C21)+1)","v":""},null,null,"",{"$nulls":4},"",{"$nulls":4},"",null,"N",0,{"$f":"IF(C22=\"\",0,IF(OR(D22=0,E22=0,F22=0,G22=0,H22=0,I22=0,K22=0,K22=\"\",L22=0,M22=0,AND(L22=Lists!$I$3,J22=0)),1,0))","v":0},{"$f":"IF(E22=0,0,IF(COUNTIF(Lists!$B$3:$B$203,E22)>0,0,1))","v":0},0,{"$f":"IF(M22=Lists!$J$6,IF(COUNTIF('Section 3'!$G$15:$G$24,Lists!$H$5)>0,0,1), 0)","v":0},{"$f":"IF(M22=Lists!$J$8,IF(COUNTIF('Section 3'!$G$15:$G$24,Lists!$H$6)>0,0,1), 0)","v":0},{"$f":"IF(M22=Lists!$J$9,IF(COUNTIF('Section 3'!$G$15:$G$24,Lists!$H$4)>0,0,1), 0)","v":0},{"$f":"IF(M22=Lists!$J$11,IF(COUNTIF('Section 3'!$G$15:$G$24,Lists!$H$3)>0,0,1),IF(M22=Lists!$J$10,IF(COUNTIF('Section 3'!$G$15:$G$24,Lists!$H$7)>0,0,1),0))","v":0},0,0]
[null,null,{"$f":"IF(F23=\"\",\"\",MAX($C$16:C22)+1)","v":""},null,null,"",{"$nulls":4},"",{"$nulls":4},"",null,"N",0,{"$f":"IF(C23=\"\",0,IF(OR(D23=0,E23=0,F23=0,G23=0,H23=0,I23=0,K23=0,K23=\"\",L23=0,M23=0,AND(L23=Lists!$I$3,J23=0)),1,0))","v":0},{"$f":"IF(E23=0,0,IF(COUNTIF(Lists!$B$3:$B$203,E23)>0,0,1))","v":0},0,{"$f":"IF(M23=Lists!$J$6,IF(COUNTIF('Section 3'!$G$15:$G$24,Lists!$H$5)>0,0,1), 0)","v":0},{"$f":"IF(M23=Lists!$J$8,IF(COUNTIF('Section 3'!$G$15:$G$24,Lists!$H$6)>0,0,1), 0)","v":0},{"$f":"IF(M23=Lists!$J$9,IF(COUNTIF('Section 3'!$G$15:$G$24,Lists!$H$4)>0,0,1), 0)","v":0},{"$f":"IF(M23=Lists!$J$11,IF(COUNTIF('Section 3'!$G$15:$G$24,Lists!$H$3)>0,0,1),IF(M23=Lists!$J$10,IF(COUNTIF('Section 3'!$G$15:$G$24,Lists!$H$7)>0,0,1),0))","v":0},0,0]
[null,null,{"$f":"IF(F24=\"\",\"\",MAX($C$16:C23)+1)","v":""},null,null,"",{"$nulls":4},"",{"$nulls":4},"",null,"N",0,{"$f":"IF(C24=\"\",0,IF(OR(D24=0,E24=0,F24=0,G24=0,H24=0,I24=0,K24=0,K24=\"\",L24=0,M24=0,AND(L24=Lists!$I$3,J24=0)),1,0))","v":0},{"$f":"IF(E24=0,0,IF(COUNTIF(Lists!$B$3:$B$203,E24)>0,0,1))","v":0},0,{"$f":"IF(M24=Lists!$J$6,IF(COUNTIF('Section 3'!$G$15:$G$24,Lists!$H$5)>0,0,1), 0)","v":0},{"$f":"IF(M24=Lists!$J$8,IF(COUNTIF('Section 3'!$G$15:$G$24,Lists!$H$6)>0,0,1), 0)","v":0},{"$f":"IF(M24=Lists!$J$9,IF(COUNTIF('Section 3'!$G$15:$G$24,Lists!$H$4)>0,0,1), 0)","v":0},{"$f":"IF(M24=Lists!$J$11,IF(COUNTIF('Section 3'!$G$15:$G$24,Lists!$H$3)>0,0,1),IF(M24=Lists!$J$10,IF(COUNTIF('Section 3'!$G$15:$G$24,Lists!$H$7)>0,0,1),0))","v":0},0,0]
[null,null,{"$f":"IF(F25=\"\",\"\",MAX($C$16:C24)+1)","v":""},null,null,"",{"$nulls":4},"",{"$nulls":4},"",null,"N",0,{"$f":"IF(C25=\"\",0,IF(OR(D25=0,E25=0,F25=0,G25=0,H25=0,I25=0,K25=0,K25=\"\",L25=0,M25=0,AND(L25=Lists!$I$3,J25=0)),1,0))","v":0},{"$f":"IF(E25=0,0,IF(COUNTIF(Lists!$B$3:$B$203,E25)>0,0,1))","v":0},0,{"$f":"IF(M25=Lists!$J$6,IF(COUNTIF('Section 3'!$G$15:$G$24,Lists!$H$5)>0,0,1), 0)","v":0},{"$f":"IF(M25=Lists!$J$8,IF(COUNTIF('Section 3'!$G$15:$G$24,Lists!$H$6)>0,0,1), 0)","v":0},{"$f":"IF(M25=Lists!$J$9,IF(COUNTIF('Section 3'!$G$15:$G$24,Lists!$H$4)>0,0,1), 0)","v":0},{"$f":"IF(M25=Lists!$J$11,IF(COUNTIF('Section 3'!$G$15:$G$24,Lists!$H$3)>0,0,1),IF(M25=Lists!$J$10,IF(COUNTIF('Section 3'!$G$15:$G$24,Lists!$H$7)>0,0,1),0))","v":0},0,0]
[null,null,{"$f":"IF(F26=\"\",\"\",MAX($C$16:C25)+1)","v":""},null,null,"",{"$nulls":4},"",{"$nulls":4},"",null,"N",0,{"$f":"IF(C26=\"\",0,IF(OR(D26=0,E26=0,F26=0,G26=0,H26=0,I26=0,K26=0,K26=\"\",L26=0,M26=0,AND(L26=Lists!$I$3,J26=0)),1,0))","v":0},{"$f":"IF(E26=0,0,IF(COUNTIF(Lists!$B$3:$B$203,E26)>0,0,1))","v":0},0,{"$f":"IF(M26=Lists!$J$6,IF(COUNTIF('Section 3'!$G$15:$G$24,Lists!$H$5)>0,0,1), 0)","v":0},{"$f":"IF(M26=Lists!$J$8,IF(COUNTIF('Section 3'!$G$15:$G$24,Lists!$H$6)>0,0,1), 0)","v":0},{"$f":"IF(M26=Lists!$J$9,IF(COUNTIF('Section 3'!$G$15:$G$24,Lists!$H$4)>0,0,1), 0)","v":0},{"$f":"IF(M26=Lists!$J$11,IF(COUNTIF('Section 3'!$G$15:$G$24,Lists!$H$3)>0,0,1),IF(M26=Lists!$J$10,IF(COUNTIF('Section 3'!$G$15:$G$24,Lists!$H$7)>0,0,1),0))","v":0},0,0]
[null,null,{"$f":"IF(F27=\"\",\"\",MAX($C$16:C26)+1)","v":""},null,null,"",{"$nulls":4},"",{"$nulls":4},"",null,"N",0,{"$f":"IF(C27=\"\",0,IF(OR(D27=0,E27=0,F27=0,G27=0,H27=0,I27=0,K27=0,K27=\"\",L27=0,M27=0,AND(L27=Lists!$I$3,J27=0)),1,0))","v":0},{"$f":"IF(E27=0,0,IF(COUNTIF(Lists!$B$3:$B$203,E27)>0,0,1))","v":0},0,{"$f":"IF(M27=Lists!$J$6,IF(COUNTIF('Section 3'!$G$15:$G$24,Lists!$H$5)>0,0,1), 0)","v":0},{"$f":"IF(M27=Lists!$J$8,IF(COUNTIF('Section 3'!$G$15:$G$24,Lists!$H$6)>0,0,1), 0)","v":0},{"$f":"IF(M27=Lists!$J$9,IF(COUNTIF('Section 3'!$G$15:$G$24,Lists!$H$4)>0,0,1), 0)","v":0},{"$f":"IF(M27=Lists!$J$11,IF(COUNTIF('Section 3'!$G$15:$G$24,Lists!$H$3)>0,0,1),IF(M27=Lists!$J$10,IF(COUNTIF('Section 3'!$G$15:$G$24,Lists!$H$7)>0,0,1),0))","v":0},0,0]
[null,null,{"$f":"IF(F28=\"\",\"\",MAX($C$16:C27)+1)","v":""},null,null,"",{"$nulls":4},"",{"$nulls":4},"",null,"N",0,{"$f":"IF(C28=\"\",0,IF(OR(D28=0,E28=0,F28=0,G28=0,H28=0,I28=0,K28=0,K28=\"\",L28=0,M28=0,AND(L28=Lists!$I$3,J28=0)),1,0))","v":0},{"$f":"IF(E28=0,0,IF(COUNTIF(Lists!$B$3:$B$203,E28)>0,0,1))","v":0},0,{"$f":"IF(M28=Lists!$J$6,IF(COUNTIF('Section 3'!$G$15:$G$24,Lists!$H$5)>0,0,1), 0)","v":0},{"$f":"IF(M28=Lists!$J$8,IF(COUNTIF('Section 3'!$G$15:$G$24,Lists!$H$6)>0,0,1), 0)","v":0},{"$f":"IF(M28=Lists!$J$9,IF(COUNTIF('Section 3'!$G$15:$G$24,Lists!$H$4)>0,0,1), 0)","v":0},{"$f":"IF(M28=Lists!$J$11,IF(COUNTIF('Section 3'!$G$15:$G$24,Lists!$H$3)>0,0,1),IF(M28=Lists!$J$10,IF(COUNTIF('Section 3'!$G$15:$G$24,Lists!$H$7)>0,0,1),0))","v":0},0,0]
[null,null,{"$f":"IF(F29=\"\",\"\",MAX($C$16:C28)+1)","v":""},null,null,"",{"$nulls":4},"",{"$nulls":4},"",null,"N",0,{"$f":"IF(C29=\"\",0,IF(OR(D29=0,E29=0,F29=0,G29=0,H29=0,I29=0,K29=0,K29=\"\",L29=0,M29=0,AND(L29=Lists!$I$3,J29=0)),1,0))","v":0},{"$f":"IF(E29=0,0,IF(COUNTIF(Lists!$B$3:$B$203,E29)>0,0,1))","v":0},0,{"$f":"IF(M29=Lists!$J$6,IF(COUNTIF('Section 3'!$G$15:$G$24,Lists!$H$5)>0,0,1), 0)","v":0},{"$f":"IF(M29=Lists!$J$8,IF(COUNTIF('Section 3'!$G$15:$G$24,Lists!$H$6)>0,0,1), 0)","v":0},{"$f":"IF(M29=Lists!$J$9,IF(COUNTIF('Section 3'!$G$15:$G$24,Lists!$H$4)>0,0,1), 0)","v":0},{"$f":"IF(M29=Lists!$J$11,IF(COUNTIF('Section 3'!$G$15:$G$24,Lists!$H$3)>0,0,1),IF(M29=Lists!$J$10,IF(COUNTIF('Section 3'!$G$15:$G$24,Lists!$H$7)>0,0,1),0))","v":0},0,0]
[null,null,{"$f":"IF(F30=\"\",\"\",MAX($C$16:C29)+1)","v":""},null,null,"",{"$nulls":4},"",{"$nulls":4},"",null,"N",0,{"$f":"IF(C30=\"\",0,IF(OR(D30=0,E30=0,F30=0,G30=0,H30=0,I30=0,K30=0,K30=\"\",L30=0,M30=0,AND(L30=Lists!$I$3,J30=0)),1,0))","v":0},{"$f":"IF(E30=0,0,IF(COUNTIF(Lists!$B$3:$B$203,E30)>0,0,1))","v":0},0,{"$f":"IF(M30=Lists!$J$6,IF(COUNTIF('Section 3'!$G$15:$G$24,Lists!$H$5)>0,0,1), 0)","v":0},{"$f":"IF(M30=Lists!$J$8,IF(COUNTIF('Section 3'!$G$15:$G$24,Lists!$H$6)>0,0,1), 0)","v":0},{"$f":"IF(M30=Lists!$J$9,IF(COUNTIF('Section 3'!$G$15:$G$24,Lists!$H$4)>0,0,1), 0)","v":0},{"$f":"IF(M30=Lists!$J$11,IF(COUNTIF('Section 3'!$G$15:$G$24,Lists!$H$3)>0,0,1),IF(M30=Lists!$J$10,IF(COUNTIF('Section 3'!$G$15:$G$24,Lists!$H$7)>0,0,1),0))","v":0},0,0]
[null,null,{"$f":"IF(F31=\"\",\"\",MAX($C$16:C30)+1)","v":""},null,null,"",{"$nulls":4},"",{"$nulls":4},"",null,"N",0,{"$f":"IF(C31=\"\",0,IF(OR(D31=0,E31=0,F31=0,G31=0,H31=0,I31=0,K31=0,K31=\"\",L31=0,M31=0,AND(L31=Lists!$I$3,J31=0)),1,0))","v":0},{"$f":"IF(E31=0,0,IF(COUNTIF(Lists!$B$3:$B$203,E31)>0,0,1))","v":0},0,{"$f":"IF(M31=Lists!$J$6,IF(COUNTIF('Section 3'!$G$15:$G$24,Lists!$H$5)>0,0,1), 0)","v":0},{"$f":"IF(M31=Lists!$J$8,IF(COUNTIF('Section 3'!$G$15:$G$24,Lists!$H$6)>0,0,1), 0)","v":0},{"$f":"IF(M31=Lists!$J$9,IF(COUNTIF('Section 3'!$G$15:$G$24,Lists!$H$4)>0,0,1), 0)","v":0},{"$f":"IF(M31=Lists!$J$11,IF(COUNTIF('Section 3'!$G$15:$G$24,Lists!$H$3)>0,0,1),IF(M31=Lists!$J$10,IF(COUNTIF('Section 3'!$G$15:$G$24,Lists!$H$7)>0,0,1),0))","v":0},0,0]
[null,null,{"$f":"IF(F32=\"\",\"\",MAX($C$16:C31)+1)","v":""},null,null,"",{"$nulls":4},"",{"$nulls":4},"",null,"N",0,{"$f":"IF(C32=\"\",0,IF(OR(D32=0,E32=0,F32=0,G32=0,H32=0,I32=0,K32=0,K32=\"\",L32=0,M32=0,AND(L32=Lists!$I$3,J32=0)),1,0))","v":0},{"$f":"IF(E32=0,0,IF(COUNTIF(Lists!$B$3:$B$203,E32)>0,0,1))","v":0},0,{"$f":"IF(M32=Lists!$J$6,IF(COUNTIF('Section 3'!$G$15:$G$24,Lists!$H$5)>0,0,1), 0)","v":0},{"$f":"IF(M32=Lists!$J$8,IF(COUNTIF('Section 3'!$G$15:$G$24,Lists!$H$6)>0,0,1), 0)","v":0},{"$f":"IF(M32=Lists!$J$9,IF(COUNTIF('Section 3'!$G$15:$G$24,Lists!$H$4)>0,0,1), 0)","v":0},{"$f":"IF(M32=Lists!$J$11,IF(COUNTIF('Section 3'!$G$15:$G$24,Lists!$H$3)>0,0,1),IF(M32=Lists!$J$10,IF(COUNTIF('Section 3'!$G$15:$G$24,Lists!$H$7)>0,0,1),0))","v":0},0,0]
[null,null,{"$f":"IF(F33=\"\",\"\",MAX($C$16:C32)+1)","v":""},null,null,"",{"$nulls":4},"",{"$nulls":4},"",null,"N",0,{"$f":"IF(C33=\"\",0,IF(OR(D33=0,E33=0,F33=0,G33=0,H33=0,I33=0,K33=0,K33=\"\",L33=0,M33=0,AND(L33=Lists!$I$3,J33=0)),1,0))","v":0},{"$f":"IF(E33=0,0,IF(COUNTIF(Lists!$B$3:$B$203,E33)>0,0,1))","v":0},0,{"$f":"IF(M33=Lists!$J$6,IF(COUNTIF('Section 3'!$G$15:$G$24,Lists!$H$5)>0,0,1), 0)","v":0},{"$f":"IF(M33=Lists!$J$8,IF(COUNTIF('Section 3'!$G$15:$G$24,Lists!$H$6)>0,0,1), 0)","v":0},{"$f":"IF(M33=Lists!$J$9,IF(COUNTIF('Section 3'!$G$15:$G$24,Lists!$H$4)>0,0,1), 0)","v":0},{"$f":"IF(M33=Lists!$J$11,IF(COUNTIF('Section 3'!$G$15:$G$24,Lists!$H$3)>0,0,1),IF(M33=Lists!$J$10,IF(COUNTIF('Section 3'!$G$15:$G$24,Lists!$H$7)>0,0,1),0))","v":0},0,0]
[null,null,{"$f":"IF(F34=\"\",\"\",MAX($C$16:C33)+1)","v":""},null,null,"",{"$nulls":4},"",{"$nulls":4},"",null,"N",0,{"$f":"IF(C34=\"\",0,IF(OR(D34=0,E34=0,F34=0,G34=0,H34=0,I34=0,K34=0,K34=\"\",L34=0,M34=0,AND(L34=Lists!$I$3,J34=0)),1,0))","v":0},{"$f":"IF(E34=0,0,IF(COUNTIF(Lists!$B$3:$B$203,E34)>0,0,1))","v":0},0,{"$f":"IF(M34=Lists!$J$6,IF(COUNTIF('Section 3'!$G$15:$G$24,Lists!$H$5)>0,0,1), 0)","v":0},{"$f":"IF(M34=Lists!$J$8,IF(COUNTIF('Section 3'!$G$15:$G$24,Lists!$H$6)>0,0,1), 0)","v":0},{"$f":"IF(M34=Lists!$J$9,IF(COUNTIF('Section 3'!$G$15:$G$24,Lists!$H$4)>0,0,1), 0)","v":0},{"$f":"IF(M34=Lists!$J$11,IF(COUNTIF('Section 3'!$G$15:$G$24,Lists!$H$3)>0,0,1),IF(M34=Lists!$J$10,IF(COUNTIF('Section 3'!$G$15:$G$24,Lists!$H$7)>0,0,1),0))","v":0},0,0]
[null,null,{"$f":"IF(F35=\"\",\"\",MAX($C$16:C34)+1)","v":""},null,null,"",{"$nulls":4},"",{"$nulls":4},"",null,"N",0,{"$f":"IF(C35=\"\",0,IF(OR(D35=0,E35=0,F35=0,G35=0,H35=0,I35=0,K35=0,K35=\"\",L35=0,M35=0,AND(L35=Lists!$I$3,J35=0)),1,0))","v":0},{"$f":"IF(E35=0,0,IF(COUNTIF(Lists!$B$3:$B$203,E35)>0,0,1))","v":0},0,{"$f":"IF(M35=Lists!$J$6,IF(COUNTIF('Section 3'!$G$15:$G$24,Lists!$H$5)>0,0,1), 0)","v":0},{"$f":"IF(M35=Lists!$J$8,IF(COUNTIF('Section 3'!$G$15:$G$24,Lists!$H$6)>0,0,1), 0)","v":0},{"$f":"IF(M35=Lists!$J$9,IF(COUNTIF('Section 3'!$G$15:$G$24,Lists!$H$4)>0,0,1), 0)","v":0},{"$f":"IF(M35=Lists!$J$11,IF(COUNTIF('Section 3'!$G$15:$G$24,Lists!$H$3)>0,0,1),IF(M35=Lists!$J$10,IF(COUNTIF('Section 3'!$G$15:$G$24,Lists!$H$7)>0,0,1),0))","v":0},0,0]
[null,null,{"$f":"IF(F36=\"\",\"\",MAX($C$16:C35)+1)","v":""},null,null,"",{"$nulls":4},"",{"$nulls":4},"",null,"N",0,{"$f":"IF(C36=\"\",0,IF(OR(D36=0,E36=0,F36=0,G36=0,H36=0,I36=0,K36=0,K36=\"\",L36=0,M36=0,AND(L36=Lists!$I$3,J36=0)),1,0))","v":0},{"$f":"IF(E36=0,0,IF(COUNTIF(Lists!$B$3:$B$203,E36)>0,0,1))","v":0},0,{"$f":"IF(M36=Lists!$J$6,IF(COUNTIF('Section 3'!$G$15:$G$24,Lists!$H$5)>0,0,1), 0)","v":0},{"$f":"IF(M36=Lists!$J$8,IF(COUNTIF('Section 3'!$G$15:$G$24,Lists!$H$6)>0,0,1), 0)","v":0},{"$f":"IF(M36=Lists!$J$9,IF(COUNTIF('Section 3'!$G$15:$G$24,Lists!$H$4)>0,0,1), 0)","v":0},{"$f":"IF(M36=Lists!$J$11,IF(COUNTIF('Section 3'!$G$15:$G$24,Lists!$H$3)>0,0,1),IF(M36=Lists!$J$10,IF(COUNTIF('Section 3'!$G$15:$G$24,Lists!$H$7)>0,0,1),0))","v":0},0,0]
[null,null,{"$f":"IF(F37=\"\",\"\",MAX($C$16:C36)+1)","v":""},null,null,"",{"$nulls":4},"",{"$nulls":4},"",null,"N",0,{"$f":"IF(C37=\"\",0,IF(OR(D37=0,E37=0,F37=0,G37=0,H37=0,I37=0,K37=0,K37=\"\",L37=0,M37=0,AND(L37=Lists!$I$3,J37=0)),1,0))","v":0},{"$f":"IF(E37=0,0,IF(COUNTIF(Lists!$B$3:$B$203,E37)>0,0,1))","v":0},0,{"$f":"IF(M37=Lists!$J$6,IF(COUNTIF('Section 3'!$G$15:$G$24,Lists!$H$5)>0,0,1), 0)","v":0},{"$f":"IF(M37=Lists!$J$8,IF(COUNTIF('Section 3'!$G$15:$G$24,Lists!$H$6)>0,0,1), 0)","v":0},{"$f":"IF(M37=Lists!$J$9,IF(COUNTIF('Section 3'!$G$15:$G$24,Lists!$H$4)>0,0,1), 0)","v":0},{"$f":"IF(M37=Lists!$J$11,IF(COUNTIF('Section 3'!$G$15:$G$24,Lists!$H$3)>0,0,1),IF(M37=Lists!$J$10,IF(COUNTIF('Section 3'!$G$15:$G$24,Lists!$H$7)>0,0,1),0))","v":0},0,0]
[null,null,{"$f":"IF(F38=\"\",\"\",MAX($C$16:C37)+1)","v":""},null,null,"",{"$nulls":4},"",{"$nulls":4},"",null,"N",0,{"$f":"IF(C38=\"\",0,IF(OR(D38=0,E38=0,F38=0,G38=0,H38=0,I38=0,K38=0,K38=\"\",L38=0,M38=0,AND(L38=Lists!$I$3,J38=0)),1,0))","v":0},{"$f":"IF(E38=0,0,IF(COUNTIF(Lists!$B$3:$B$203,E38)>0,0,1))","v":0},0,{"$f":"IF(M38=Lists!$J$6,IF(COUNTIF('Section 3'!$G$15:$G$24,Lists!$H$5)>0,0,1), 0)","v":0},{"$f":"IF(M38=Lists!$J$8,IF(COUNTIF('Section 3'!$G$15:$G$24,Lists!$H$6)>0,0,1), 0)","v":0},{"$f":"IF(M38=Lists!$J$9,IF(COUNTIF('Section 3'!$G$15:$G$24,Lists!$H$4)>0,0,1), 0)","v":0},{"$f":"IF(M38=Lists!$J$11,IF(COUNTIF('Section 3'!$G$15:$G$24,Lists!$H$3)>0,0,1),IF(M38=Lists!$J$10,IF(COUNTIF('Section 3'!$G$15:$G$24,Lists!$H$7)>0,0,1),0))","v":0},0,0]
[null,null,{"$f":"IF(F39=\"\",\"\",MAX($C$16:C38)+1)","v":""},null,null,"",{"$nulls":4},"",{"$nulls":4},"",null,"N",0,{"$f":"IF(C39=\"\",0,IF(OR(D39=0,E39=0,F39=0,G39=0,H39=0,I39=0,K39=0,K39=\"\",L39=0,M39=0,AND(L39=Lists!$I$3,J39=0)),1,0))","v":0},{"$f":"IF(E39=0,0,IF(COUNTIF(Lists!$B$3:$B$203,E39)>0,0,1))","v":0},0,{"$f":"IF(M39=Lists!$J$6,IF(COUNTIF('Section 3'!$G$15:$G$24,Lists!$H$5)>0,0,1), 0)","v":0},{"$f":"IF(M39=Lists!$J$8,IF(COUNTIF('Section 3'!$G$15:$G$24,Lists!$H$6)>0,0,1), 0)","v":0},{"$f":"IF(M39=Lists!$J$9,IF(COUNTIF('Section 3'!$G$15:$G$24,Lists!$H$4)>0,0,1), 0)","v":0},{"$f":"IF(M39=Lists!$J$11,IF(COUNTIF('Section 3'!$G$15:$G$24,Lists!$H$3)>0,0,1),IF(M39=Lists!$J$10,IF(COUNTIF('Section 3'!$G$15:$G$24,Lists!$H$7)>0,0,1),0))","v":0},0,0]
[null,null,{"$f":"IF(F40=\"\",\"\",MAX($C$16:C39)+1)","v":""},null,null,"",{"$nulls":4},"",{"$nulls":4},"",null,"N",0,{"$f":"IF(C40=\"\",0,IF(OR(D40=0,E40=0,F40=0,G40=0,H40=0,I40=0,K40=0,K40=\"\",L40=0,M40=0,AND(L40=Lists!$I$3,J40=0)),1,0))","v":0},{"$f":"IF(E40=0,0,IF(COUNTIF(Lists!$B$3:$B$203,E40)>0,0,1))","v":0},0,{"$f":"IF(M40=Lists!$J$6,IF(COUNTIF('Section 3'!$G$15:$G$24,Lists!$H$5)>0,0,1), 0)","v":0},{"$f":"IF(M40=Lists!$J$8,IF(COUNTIF('Section 3'!$G$15:$G$24,Lists!$H$6)>0,0,1), 0)","v":0},{"$f":"IF(M40=Lists!$J$9,IF(COUNTIF('Section 3'!$G$15:$G$24,Lists!$H$4)>0,0,1), 0)","v":0},{"$f":"IF(M40=Lists!$J$11,IF(COUNTIF('Section 3'!$G$15:$G$24,Lists!$H$3)>0,0,1),IF(M40=Lists!$J$10,IF(COUNTIF('Section 3'!$G$15:$G$24,Lists!$H$7)>0,0,1),0))","v":0},0,0]
[null,null,{"$f":"IF(F41=\"\",\"\",MAX($C$16:C40)+1)","v":""},null,null,"",{"$nulls":4},"",{"$nulls":4},"",null,"N",0,{"$f":"IF(C41=\"\",0,IF(OR(D41=0,E41=0,F41=0,G41=0,H41=0,I41=0,K41=0,K41=\"\",L41=0,M41=0,AND(L41=Lists!$I$3,J41=0)),1,0))","v":0},{"$f":"IF(E41=0,0,IF(COUNTIF(Lists!$B$3:$B$203,E41)>0,0,1))","v":0},0,{"$f":"IF(M41=Lists!$J$6,IF(COUNTIF('Section 3'!$G$15:$G$24,Lists!$H$5)>0,0,1), 0)","v":0},{"$f":"IF(M41=Lists!$J$8,IF(COUNTIF('Section 3'!$G$15:$G$24,Lists!$H$6)>0,0,1), 0)","v":0},{"$f":"IF(M41=Lists!$J$9,IF(COUNTIF('Section 3'!$G$15:$G$24,Lists!$H$4)>0,0,1), 0)","v":0},{"$f":"IF(M41=Lists!$J$11,IF(COUNTIF('Section 3'!$G$15:$G$24,Lists!$H$3)>0,0,1),IF(M41=Lists!$J$10,IF(COUNTIF('Section 3'!$G$15:$G$24,Lists!$H$7)>0,0,1),0))","v":0},0,0]
[null,null,{"$f":"IF(F42=\"\",\"\",MAX($C$16:C41)+1)","v":""},null,null,"",{"$nulls":4},"",{"$nulls":4},"",null,"N",0,{"$f":"IF(C42=\"\",0,IF(OR(D42=0,E42=0,F42=0,G42=0,H42=0,I42=0,K42=0,K42=\"\",L42=0,M42=0,AND(L42=Lists!$I$3,J42=0)),1,0))","v":0},{"$f":"IF(E42=0,0,IF(COUNTIF(Lists!$B$3:$B$203,E42)>0,0,1))","v":0},0,{"$f":"IF(M42=Lists!$J$6,IF(COUNTIF('Section 3'!$G$15:$G$24,Lists!$H$5)>0,0,1), 0)","v":0},{"$f":"IF(M42=Lists!$J$8,IF(COUNTIF('Section 3'!$G$15:$G$24,Lists!$H$6)>0,0,1), 0)","v":0},{"$f":"IF(M42=Lists!$J$9,IF(COUNTIF('Section 3'!$G$15:$G$24,Lists!$H$4)>0,0,1), 0)","v":0},{"$f":"IF(M42=Lists!$J$11,IF(COUNTIF('Section 3'!$G$15:$G$24,Lists!$H$3)>0,0,1),IF(M42=Lists!$J$10,IF(COUNTIF('Section 3'!$G$15:$G$24,Lists!$H$7)>0,0,1),0))","v":0},0,0]
[null,null,{"$f":"IF(F43=\"\",\"\",MAX($C$16:C42)+1)","v":""},null,null,"",{"$nulls":4},"",{"$nulls":4},"",null,"N",0,{"$f":"IF(C43=\"\",0,IF(OR(D43=0,E43=0,F43=0,G43=0,H43=0,I43=0,K43=0,K43=\"\",L43=0,M43=0,AND(L43=Lists!$I$3,J43=0)),1,0))","v":0},{"$f":"IF(E43=0,0,IF(COUNTIF(Lists!$B$3:$B$203,E43)>0,0,1))","v":0},0,{"$f":"IF(M43=Lists!$J$6,IF(COUNTIF('Section 3'!$G$15:$G$24,Lists!$H$5)>0,0,1), 0)","v":0},{"$f":"IF(M43=Lists!$J$8,IF(COUNTIF('Section 3'!$G$15:$G$24,Lists!$H$6)>0,0,1), 0)","v":0},{"$f":"IF(M43=Lists!$J$9,IF(COUNTIF('Section 3'!$G$15:$G$24,Lists!$H$4)>0,0,1), 0)","v":0},{"$f":"IF(M43=Lists!$J$11,IF(COUNTIF('Section 3'!$G$15:$G$24,Lists!$H$3)>0,0,1),IF(M43=Lists!$J$10,IF(COUNTIF('Section 3'!$G$15:$G$24,Lists!$H$7)>0,0,1),0))","v":0},0,0]
[null,null,{"$f":"IF(F44=\"\",\"\",MAX($C$16:C43)+1)","v":""},null,null,"",{"$nulls":4},"",{"$nulls":4},"",null,"N",0,{"$f":"IF(C44=\"\",0,IF(OR(D44=0,E44=0,F44=0,G44=0,H44=0,I44=0,K44=0,K44=\"\",L44=0,M44=0,AND(L44=Lists!$I$3,J44=0)),1,0))","v":0},{"$f":"IF(E44=0,0,IF(COUNTIF(Lists!$B$3:$B$203,E44)>0,0,1))","v":0},0,{"$f":"IF(M44=Lists!$J$6,IF(COUNTIF('Section 3'!$G$15:$G$24,Lists!$H$5)>0,0,1), 0)","v":0},{"$f":"IF(M44=Lists!$J$8,IF(COUNTIF('Section 3'!$G$15:$G$24,Lists!$H$6)>0,0,1), 0)","v":0},{"$f":"IF(M44=Lists!$J$9,IF(COUNTIF('Section 3'!$G$15:$G$24,Lists!$H$4)>0,0,1), 0)","v":0},{"$f":"IF(M44=Lists!$J$11,IF(COUNTIF('Section 3'!$G$15:$G$24,Lists!$H$3)>0,0,1),IF(M44=Lists!$J$10,IF(COUNTIF('Section 3'!$G$15:$G$24,Lists!$H$7)>0,0,1),0))","v":0},0,0]
[null,null,{"$f":"IF(F45=\"\",\"\",MAX($C$16:C44)+1)","v":""},null,null,"",{"$nulls":4},"",{"$nulls":4},"",null,"N",0,{"$f":"IF(C45=\"\",0,IF(OR(D45=0,E45=0,F45=0,G45=0,H45=0,I45=0,K45=0,K45=\"\",L45=0,M45=0,AND(L45=Lists!$I$3,J45=0)),1,0))","v":0},{"$f":"IF(E45=0,0,IF(COUNTIF(Lists!$B$3:$B$203,E45)>0,0,1))","v":0},0,{"$f":"IF(M45=Lists!$J$6,IF(COUNTIF('Section 3'!$G$15:$G$24,Lists!$H$5)>0,0,1), 0)","v":0},{"$f":"IF(M45=Lists!$J$8,IF(COUNTIF('Section 3'!$G$15:$G$24,Lists!$H$6)>0,0,1), 0)","v":0},{"$f":"IF(M45=Lists!$J$9,IF(COUNTIF('Section 3'!$G$15:$G$24,Lists!$H$4)>0,0,1), 0)","v":0},{"$f":"IF(M45=Lists!$J$11,IF(COUNTIF('Section 3'!$G$15:$G$24,Lists!$H$3)>0,0,1),IF(M45=Lists!$J$10,IF(COUNTIF('Section 3'!$G$15:$G$24,Lists!$H$7)>0,0,1),0))","v":0},0,0]
[null,null,{"$f":"IF(F46=\"\",\"\",MAX($C$16:C45)+1)","v":""},null,null,"",{"$nulls":4},"",{"$nulls":4},"",null,"N",0,{"$f":"IF(C46=\"\",0,IF(OR(D46=0,E46=0,F46=0,G46=0,H46=0,I46=0,K46=0,K46=\"\",L46=0,M46=0,AND(L46=Lists!$I$3,J46=0)),1,0))","v":0},{"$f":"IF(E46=0,0,IF(COUNTIF(Lists!$B$3:$B$203,E46)>0,0,1))","v":0},0,{"$f":"IF(M46=Lists!$J$6,IF(COUNTIF('Section 3'!$G$15:$G$24,Lists!$H$5)>0,0,1), 0)","v":0},{"$f":"IF(M46=Lists!$J$8,IF(COUNTIF('Section 3'!$G$15:$G$24,Lists!$H$6)>0,0,1), 0)","v":0},{"$f":"IF(M46=Lists!$J$9,IF(COUNTIF('Section 3'!$G$15:$G$24,Lists!$H$4)>0,0,1), 0)","v":0},{"$f":"IF(M46=Lists!$J$11,IF(COUNTIF('Section 3'!$G$15:$G$24,Lists!$H$3)>0,0,1),IF(M46=Lists!$J$10,IF(COUNTIF('Section 3'!$G$15:$G$24,Lists!$H$7)>0,0,1),0))","v":0},0,0]
[null,null,{"$f":"IF(F47=\"\",\"\",MAX($C$16:C46)+1)","v":""},null,null,"",{"$nulls":4},"",{"$nulls":4},"",null,{"$f":"IF(C47=\"\",\"N\",\"Y\")","v":"N"},{"$f":"IF(OR(D47=0,AND(D47>=StartDate,D47<=EndDate)),0,1)","v":0},{"$f":"IF(C47=\"\",0,IF(OR(D47=0,E47=0,F47=0,G47=0,H47=0,I47=0,K47=0,K47=\"\",L47=0,M47=0,AND(L47=Lists!$I$3,J47=0)),1,0))","v":0},{"$f":"IF(E47=0,0,IF(COUNTIF(Lists!$B$3:$B$203,E47)>0,0,1))","v":0},0,{"$f":"IF(M47=Lists!$J$6,IF(COUNTIF('Section 3'!$G$15:$G$24,Lists!$H$5)>0,0,1), 0)","v":0},{"$f":"IF(M47=Lists!$J$8,IF(COUNTIF('Section 3'!$G$15:$G$24,Lists!$H$6)>0,0,1), 0)","v":0},{"$f":"IF(M47=Lists!$J$9,IF(COUNTIF('Section 3'!$G$15:$G$24,Lists!$H$4)>0,0,1), 0)","v":0},{"$f":"IF(M47=Lists!$J$11,IF(COUNTIF('Section 3'!$G$15:$G$24,Lists!$H$3)>0,0,1),IF(M47=Lists!$J$10,IF(COUNTIF('Section 3'!$G$15:$G$24,Lists!$H$7)>0,0,1),0))","v":0},0,0]
[null,null,{"$f":"IF(F48=\"\",\"\",MAX($C$16:C47)+1)","v":""},null,null,"",{"$nulls":4},"",{"$nulls":4},"",null,"N",0,{"$f":"IF(C48=\"\",0,IF(OR(D48=0,E48=0,F48=0,G48=0,H48=0,I48=0,K48=0,K48=\"\",L48=0,M48=0,AND(L48=Lists!$I$3,J48=0)),1,0))","v":0},{"$f":"IF(E48=0,0,IF(COUNTIF(Lists!$B$3:$B$203,E48)>0,0,1))","v":0},0,{"$f":"IF(M48=Lists!$J$6,IF(COUNTIF('Section 3'!$G$15:$G$24,Lists!$H$5)>0,0,1), 0)","v":0},{"$f":"IF(M48=Lists!$J$8,IF(COUNTIF('Section 3'!$G$15:$G$24,Lists!$H$6)>0,0,1), 0)","v":0},{"$f":"IF(M48=Lists!$J$9,IF(COUNTIF('Section 3'!$G$15:$G$24,Lists!$H$4)>0,0,1), 0)","v":0},{"$f":"IF(M48=Lists!$J$11,IF(COUNTIF('Section 3'!$G$15:$G$24,Lists!$H$3)>0,0,1),IF(M48=Lists!$J$10,IF(COUNTIF('Section 3'!$G$15:$G$24,Lists!$H$7)>0,0,1),0))","v":0},{"$f":"IF(L48=0,0,IF(COUNTIF(MeBrTransactionType,L48)>0,0,1))","v":0},{"$f":"IF(M48=0,0,IF(OR(COUNTIF(MeBrNewIntendedUses,M48)>0,COUNTIF(HeelsIntendedUses,M48)>0),0,1))","v":0}]
[null,null,{"$f":"IF(F49=\"\",\"\",MAX($C$16:C48)+1)","v":""},null,null,"",{"$nulls":4},"",{"$nulls":4},"",null,"N",0,{"$f":"IF(C49=\"\",0,IF(OR(D49=0,E49=0,F49=0,G49=0,H49=0,I49=0,K49=0,K49=\"\",L49=0,M49=0,AND(L49=Lists!$I$3,J49=0)),1,0))","v":0},{"$f":"IF(E49=0,0,IF(COUNTIF(Lists!$B$3:$B$203,E49)>0,0,1))","v":0},0,{"$f":"IF(M49=Lists!$J$6,IF(COUNTIF('Section 3'!$G$15:$G$24,Lists!$H$5)>0,0,1), 0)","v":0},{"$f":"IF(M49=Lists!$J$8,IF(COUNTIF('Section 3'!$G$15:$G$24,Lists!$H$6)>0,0,1), 0)","v":0},{"$f":"IF(M49=Lists!$J$9,IF(COUNTIF('Section 3'!$G$15:$G$24,Lists!$H$4)>0,0,1), 0)","v":0},{"$f":"IF(M49=Lists!$J$11,IF(COUNTIF('Section 3'!$G$15:$G$24,Lists!$H$3)>0,0,1),IF(M49=Lists!$J$10,IF(COUNTIF('Section 3'!$G$15:$G$24,Lists!$H$7)>0,0,1),0))","v":0},0,0]
[null,null,{"$f":"IF(F50=\"\",\"\",MAX($C$16:C49)+1)","v":""},null,null,"",{"$nulls":4},"",{"$nulls":4},"",null,"N",0,{"$f":"IF(C50=\"\",0,IF(OR(D50=0,E50=0,F50=0,G50=0,H50=0,I50=0,K50=0,K50=\"\",L50=0,M50=0,AND(L50=Lists!$I$3,J50=0)),1,0))","v":0},{"$f":"IF(E50=0,0,IF(COUNTIF(Lists!$B$3:$B$203,E50)>0,0,1))","v":0},0,{"$f":"IF(M50=Lists!$J$6,IF(COUNTIF('Section 3'!$G$15:$G$24,Lists!$H$5)>0,0,1), 0)","v":0},{"$f":"IF(M50=Lists!$J$8,IF(COUNTIF('Section 3'!$G$15:$G$24,Lists!$H$6)>0,0,1), 0)","v":0},{"$f":"IF(M50=Lists!$J$9,IF(COUNTIF('Section 3'!$G$15:$G$24,Lists!$H$4)>0,0,1), 0)","v":0},{"$f":"IF(M50=Lists!$J$11,IF(COUNTIF('Section 3'!$G$15:$G$24,Lists!$H$3)>0,0,1),IF(M50=Lists!$J$10,IF(COUNTIF('Section 3'!$G$15:$G$24,Lists!$H$7)>0,0,1),0))","v":0},0,0]
[null,null,{"$f":"IF(F51=\"\",\"\",MAX($C$16:C50)+1)","v":""},null,null,"",{"$nulls":4},"",{"$nulls":4},"",null,"N",0,{"$f":"IF(C51=\"\",0,IF(OR(D51=0,E51=0,F51=0,G51=0,H51=0,I51=0,K51=0,K51=\"\",L51=0,M51=0,AND(L51=Lists!$I$3,J51=0)),1,0))","v":0},{"$f":"IF(E51=0,0,IF(COUNTIF(Lists!$B$3:$B$203,E51)>0,0,1))","v":0},0,{"$f":"IF(M51=Lists!$J$6,IF(COUNTIF('Section 3'!$G$15:$G$24,Lists!$H$5)>0,0,1), 0)","v":0},{"$f":"IF(M51=Lists!$J$8,IF(COUNTIF('Section 3'!$G$15:$G$24,Lists!$H$6)>0,0,1), 0)","v":0},{"$f":"IF(M51=Lists!$J$9,IF(COUNTIF('Section 3'!$G$15:$G$24,Lists!$H$4)>0,0,1), 0)","v":0},{"$f":"IF(M51=Lists!$J$11,IF(COUNTIF('Section 3'!$G$15:$G$24,Lists!$H$3)>0,0,1),IF(M51=Lists!$J$10,IF(COUNTIF('Section 3'!$G$15:$G$24,Lists!$H$7)>0,0,1),0))","v":0},0,0]
[null,null,{"$f":"IF(F52=\"\",\"\",MAX($C$16:C51)+1)","v":""},null,null,"",{"$nulls":4},"",{"$nulls":4},"",null,"N",0,{"$f":"IF(C52=\"\",0,IF(OR(D52=0,E52=0,F52=0,G52=0,H52=0,I52=0,K52=0,K52=\"\",L52=0,M52=0,AND(L52=Lists!$I$3,J52=0)),1,0))","v":0},{"$f":"IF(E52=0,0,IF(COUNTIF(Lists!$B$3:$B$203,E52)>0,0,1))","v":0},0,{"$f":"IF(M52=Lists!$J$6,IF(COUNTIF('Section 3'!$G$15:$G$24,Lists!$H$5)>0,0,1), 0)","v":0},{"$f":"IF(M52=Lists!$J$8,IF(COUNTIF('Section 3'!$G$15:$G$24,Lists!$H$6)>0,0,1), 0)","v":0},{"$f":"IF(M52=Lists!$J$9,IF(COUNTIF('Section 3'!$G$15:$G$24,Lists!$H$4)>0,0,1), 0)","v":0},{"$f":"IF(M52=Lists!$J$11,IF(COUNTIF('Section 3'!$G$15:$G$24,Lists!$H$3)>0,0,1),IF(M52=Lists!$J$10,IF(COUNTIF('Section 3'!$G$15:$G$24,Lists!$H$7)>0,0,1),0))","v":0},0,0]
[null,null,{"$f":"IF(F53=\"\",\"\",MAX($C$16:C52)+1)","v":""},null,null,"",{"$nulls":4},"",{"$nulls":4},"",null,"N",0,{"$f":"IF(C53=\"\",0,IF(OR(D53=0,E53=0,F53=0,G53=0,H53=0,I53=0,K53=0,K53=\"\",L53=0,M53=0,AND(L53=Lists!$I$3,J53=0)),1,0))","v":0},{"$f":"IF(E53=0,0,IF(COUNTIF(Lists!$B$3:$B$203,E53)>0,0,1))","v":0},0,{"$f":"IF(M53=Lists!$J$6,IF(COUNTIF('Section 3'!$G$15:$G$24,Lists!$H$5)>0,0,1), 0)","v":0},{"$f":"IF(M53=Lists!$J$8,IF(COUNTIF('Section 3'!$G$15:$G$24,Lists!$H$6)>0,0,1), 0)","v":0},{"$f":"IF(M53=Lists!$J$9,IF(COUNTIF('Section 3'!$G$15:$G$24,Lists!$H$4)>0,0,1), 0)","v":0},{"$f":"IF(M53=Lists!$J$11,IF(COUNTIF('Section 3'!$G$15:$G$24,Lists!$H$3)>0,0,1),IF(M53=Lists!$J$10,IF(COUNTIF('Section 3'!$G$15:$G$24,Lists!$H$7)>0,0,1),0))","v":0},0,0]
[null,null,{"$f":"IF(F54=\"\",\"\",MAX($C$16:C53)+1)","v":""},null,null,"",{"$nulls":4},"",{"$nulls":4},"",null,"N",0,{"$f":"IF(C54=\"\",0,IF(OR(D54=0,E54=0,F54=0,G54=0,H54=0,I54=0,K54=0,K54=\"\",L54=0,M54=0,AND(L54=Lists!$I$3,J54=0)),1,0))","v":0},{"$f":"IF(E54=0,0,IF(COUNTIF(Lists!$B$3:$B$203,E54)>0,0,1))","v":0},0,{"$f":"IF(M54=Lists!$J$6,IF(COUNTIF('Section 3'!$G$15:$G$24,Lists!$H$5)>0,0,1), 0)","v":0},{"$f":"IF(M54=Lists!$J$8,IF(COUNTIF('Section 3'!$G$15:$G$24,Lists!$H$6)>0,0,1), 0)","v":0},{"$f":"IF(M54=Lists!$J$9,IF(COUNTIF('Section 3'!$G$15:$G$24,Lists!$H$4)>0,0,1), 0)","v":0},{"$f":"IF(M54=Lists!$J$11,IF(COUNTIF('Section 3'!$G$15:$G$24,Lists!$H$3)>0,0,1),IF(M54=Lists!$J$10,IF(COUNTIF('Section 3'!$G$15:$G$24,Lists!$H$7)>0,0,1),0))","v":0},0,0]
[null,null,{"$f":"IF(F55=\"\",\"\",MAX($C$16:C54)+1)","v":""},null,null,"",{"$nulls":4},"",{"$nulls":4},"",null,"N",0,{"$f":"IF(C55=\"\",0,IF(OR(D55=0,E55=0,F55=0,G55=0,H55=0,I55=0,K55=0,K55=\"\",L55=0,M55=0,AND(L55=Lists!$I$3,J55=0)),1,0))","v":0},{"$f":"IF(E55=0,0,IF(COUNTIF(Lists!$B$3:$B$203,E55)>0,0,1))","v":0},0,{"$f":"IF(M55=Lists!$J$6,IF(COUNTIF('Section 3'!$G$15:$G$24,Lists!$H$5)>0,0,1), 0)","v":0},{"$f":"IF(M55=Lists!$J$8,IF(COUNTIF('Section 3'!$G$15:$G$24,Lists!$H$6)>0,0,1), 0)","v":0},{"$f":"IF(M55=Lists!$J$9,IF(COUNTIF('Section 3'!$G$15:$G$24,Lists!$H$4)>0,0,1), 0)","v":0},{"$f":"IF(M55=Lists!$J$11,IF(COUNTIF('Section 3'!$G$15:$G$24,Lists!$H$3)>0,0,1),IF(M55=Lists!$J$10,IF(COUNTIF('Section 3'!$G$15:$G$24,Lists!$H$7)>0,0,1),0))","v":0},0,0]
[null,null,{"$f":"IF(F56=\"\",\"\",MAX($C$16:C55)+1)","v":""},null,null,"",{"$nulls":4},"",{"$nulls":4},"",null,"N",0,{"$f":"IF(C56=\"\",0,IF(OR(D56=0,E56=0,F56=0,G56=0,H56=0,I56=0,K56=0,K56=\"\",L56=0,M56=0,AND(L56=Lists!$I$3,J56=0)),1,0))","v":0},{"$f":"IF(E56=0,0,IF(COUNTIF(Lists!$B$3:$B$203,E56)>0,0,1))","v":0},0,{"$f":"IF(M56=Lists!$J$6,IF(COUNTIF('Section 3'!$G$15:$G$24,Lists!$H$5)>0,0,1), 0)","v":0},{"$f":"IF(M56=Lists!$J$8,IF(COUNTIF('Section 3'!$G$15:$G$24,Lists!$H$6)>0,0,1), 0)","v":0},{"$f":"IF(M56=Lists!$J$9,IF(COUNTIF('Section 3'!$G$15:$G$24,Lists!$H$4)>0,0,1), 0)","v":0},{"$f":"IF(M56=Lists!$J$11,IF(COUNTIF('Section 3'!$G$15:$G$24,Lists!$H$3)>0,0,1),IF(M56=Lists!$J$10,IF(COUNTIF('Section 3'!$G$15:$G$24,Lists!$H$7)>0,0,1),0))","v":0},0,0]
[null,null,{"$f":"IF(F57=\"\",\"\",MAX($C$16:C56)+1)","v":""},null,null,"",{"$nulls":4},"",{"$nulls":4},"",null,"N",0,{"$f":"IF(C57=\"\",0,IF(OR(D57=0,E57=0,F57=0,G57=0,H57=0,I57=0,K57=0,K57=\"\",L57=0,M57=0,AND(L57=Lists!$I$3,J57=0)),1,0))","v":0},{"$f":"IF(E57=0,0,IF(COUNTIF(Lists!$B$3:$B$203,E57)>0,0,1))","v":0},0,{"$f":"IF(M57=Lists!$J$6,IF(COUNTIF('Section 3'!$G$15:$G$24,Lists!$H$5)>0,0,1), 0)","v":0},{"$f":"IF(M57=Lists!$J$8,IF(COUNTIF('Section 3'!$G$15:$G$24,Lists!$H$6)>0,0,1), 0)","v":0},{"$f":"IF(M57=Lists!$J$9,IF(COUNTIF('Section 3'!$G$15:$G$24,Lists!$H$4)>0,0,1), 0)","v":0},{"$f":"IF(M57=Lists!$J$11,IF(COUNTIF('Section 3'!$G$15:$G$24,Lists!$H$3)>0,0,1),IF(M57=Lists!$J$10,IF(COUNTIF('Section 3'!$G$15:$G$24,Lists!$H$7)>0,0,1),0))","v":0},0,0]
[null,null,{"$f":"IF(F58=\"\",\"\",MAX($C$16:C57)+1)","v":""},null,null,"",{"$nulls":4},"",{"$nulls":4},"",null,"N",0,{"$f":"IF(C58=\"\",0,IF(OR(D58=0,E58=0,F58=0,G58=0,H58=0,I58=0,K58=0,K58=\"\",L58=0,M58=0,AND(L58=Lists!$I$3,J58=0)),1,0))","v":0},{"$f":"IF(E58=0,0,IF(COUNTIF(Lists!$B$3:$B$203,E58)>0,0,1))","v":0},0,{"$f":"IF(M58=Lists!$J$6,IF(COUNTIF('Section 3'!$G$15:$G$24,Lists!$H$5)>0,0,1), 0)","v":0},{"$f":"IF(M58=Lists!$J$8,IF(COUNTIF('Section 3'!$G$15:$G$24,Lists!$H$6)>0,0,1), 0)","v":0},{"$f":"IF(M58=Lists!$J$9,IF(COUNTIF('Section 3'!$G$15:$G$24,Lists!$H$4)>0,0,1), 0)","v":0},{"$f":"IF(M58=Lists!$J$11,IF(COUNTIF('Section 3'!$G$15:$G$24,Lists!$H$3)>0,0,1),IF(M58=Lists!$J$10,IF(COUNTIF('Section 3'!$G$15:$G$24,Lists!$H$7)>0,0,1),0))","v":0},0,0]
[null,null,{"$f":"IF(F59=\"\",\"\",MAX($C$16:C58)+1)","v":""},null,null,"",{"$nulls":4},"",{"$nulls":4},"",null,"N",0,{"$f":"IF(C59=\"\",0,IF(OR(D59=0,E59=0,F59=0,G59=0,H59=0,I59=0,K59=0,K59=\"\",L59=0,M59=0,AND(L59=Lists!$I$3,J59=0)),1,0))","v":0},{"$f":"IF(E59=0,0,IF(COUNTIF(Lists!$B$3:$B$203,E59)>0,0,1))","v":0},0,{"$f":"IF(M59=Lists!$J$6,IF(COUNTIF('Section 3'!$G$15:$G$24,Lists!$H$5)>0,0,1), 0)","v":0},{"$f":"IF(M59=Lists!$J$8,IF(COUNTIF('Section 3'!$G$15:$G$24,Lists!$H$6)>0,0,1), 0)","v":0},{"$f":"IF(M59=Lists!$J$9,IF(COUNTIF('Section 3'!$G$15:$G$24,Lists!$H$4)>0,0,1), 0)","v":0},{"$f":"IF(M59=Lists!$J$11,IF(COUNTIF('Section 3'!$G$15:$G$24,Lists!$H$3)>0,0,1),IF(M59=Lists!$J$10,IF(COUNTIF('Section 3'!$G$15:$G$24,Lists!$H$7)>0,0,1),0))","v":0},0,0]
[null,null,{"$f":"IF(F60=\"\",\"\",MAX($C$16:C59)+1)","v":""},null,null,"",{"$nulls":4},"",{"$nulls":4},"",null,"N",0,{"$f":"IF(C60=\"\",0,IF(OR(D60=0,E60=0,F60=0,G60=0,H60=0,I60=0,K60=0,K60=\"\",L60=0,M60=0,AND(L60=Lists!$I$3,J60=0)),1,0))","v":0},{"$f":"IF(E60=0,0,IF(COUNTIF(Lists!$B$3:$B$203,E60)>0,0,1))","v":0},0,{"$f":"IF(M60=Lists!$J$6,IF(COUNTIF('Section 3'!$G$15:$G$24,Lists!$H$5)>0,0,1), 0)","v":0},{"$f":"IF(M60=Lists!$J$8,IF(COUNTIF('Section 3'!$G$15:$G$24,Lists!$H$6)>0,0,1), 0)","v":0},{"$f":"IF(M60=Lists!$J$9,IF(COUNTIF('Section 3'!$G$15:$G$24,Lists!$H$4)>0,0,1), 0)","v":0},{"$f":"IF(M60=Lists!$J$11,IF(COUNTIF('Section 3'!$G$15:$G$24,Lists!$H$3)>0,0,1),IF(M60=Lists!$J$10,IF(COUNTIF('Section 3'!$G$15:$G$24,Lists!$H$7)>0,0,1),0))","v":0},0,0]
[null,null,{"$f":"IF(F61=\"\",\"\",MAX($C$16:C60)+1)","v":""},null,null,"",{"$nulls":4},"",{"$nulls":4},"",null,"N",0,{"$f":"IF(C61=\"\",0,IF(OR(D61=0,E61=0,F61=0,G61=0,H61=0,I61=0,K61=0,K61=\"\",L61=0,M61=0,AND(L61=Lists!$I$3,J61=0)),1,0))","v":0},{"$f":"IF(E61=0,0,IF(COUNTIF(Lists!$B$3:$B$203,E61)>0,0,1))","v":0},0,{"$f":"IF(M61=Lists!$J$6,IF(COUNTIF('Section 3'!$G$15:$G$24,Lists!$H$5)>0,0,1), 0)","v":0},{"$f":"IF(M61=Lists!$J$8,IF(COUNTIF('Section 3'!$G$15:$G$24,Lists!$H$6)>0,0,1), 0)","v":0},{"$f":"IF(M61=Lists!$J$9,IF(COUNTIF('Section 3'!$G$15:$G$24,Lists!$H$4)>0,0,1), 0)","v":0},{"$f":"IF(M61=Lists!$J$11,IF(COUNTIF('Section 3'!$G$15:$G$24,Lists!$H$3)>0,0,1),IF(M61=Lists!$J$10,IF(COUNTIF('Section 3'!$G$15:$G$24,Lists!$H$7)>0,0,1),0))","v":0},0,0]
[null,null,{"$f":"IF(F62=\"\",\"\",MAX($C$16:C61)+1)","v":""},null,null,"",{"$nulls":4},"",{"$nulls":4},"",null,"N",0,{"$f":"IF(C62=\"\",0,IF(OR(D62=0,E62=0,F62=0,G62=0,H62=0,I62=0,K62=0,K62=\"\",L62=0,M62=0,AND(L62=Lists!$I$3,J62=0)),1,0))","v":0},{"$f":"IF(E62=0,0,IF(COUNTIF(Lists!$B$3:$B$203,E62)>0,0,1))","v":0},0,{"$f":"IF(M62=Lists!$J$6,IF(COUNTIF('Section 3'!$G$15:$G$24,Lists!$H$5)>0,0,1), 0)","v":0},{"$f":"IF(M62=Lists!$J$8,IF(COUNTIF('Section 3'!$G$15:$G$24,Lists!$H$6)>0,0,1), 0)","v":0},{"$f":"IF(M62=Lists!$J$9,IF(COUNTIF('Section 3'!$G$15:$G$24,Lists!$H$4)>0,0,1), 0)","v":0},{"$f":"IF(M62=Lists!$J$11,IF(COUNTIF('Section 3'!$G$15:$G$24,Lists!$H$3)>0,0,1),IF(M62=Lists!$J$10,IF(COUNTIF('Section 3'!$G$15:$G$24,Lists!$H$7)>0,0,1),0))","v":0},0,0]
[null,null,{"$f":"IF(F63=\"\",\"\",MAX($C$16:C62)+1)","v":""},null,null,"",{"$nulls":4},"",{"$nulls":4},"",null,"N",0,{"$f":"IF(C63=\"\",0,IF(OR(D63=0,E63=0,F63=0,G63=0,H63=0,I63=0,K63=0,K63=\"\",L63=0,M63=0,AND(L63=Lists!$I$3,J63=0)),1,0))","v":0},{"$f":"IF(E63=0,0,IF(COUNTIF(Lists!$B$3:$B$203,E63)>0,0,1))","v":0},0,{"$f":"IF(M63=Lists!$J$6,IF(COUNTIF('Section 3'!$G$15:$G$24,Lists!$H$5)>0,0,1), 0)","v":0},{"$f":"IF(M63=Lists!$J$8,IF(COUNTIF('Section 3'!$G$15:$G$24,Lists!$H$6)>0,0,1), 0)","v":0},{"$f":"IF(M63=Lists!$J$9,IF(COUNTIF('Section 3'!$G$15:$G$24,Lists!$H$4)>0,0,1), 0)","v":0},{"$f":"IF(M63=Lists!$J$11,IF(COUNTIF('Section 3'!$G$15:$G$24,Lists!$H$3)>0,0,1),IF(M63=Lists!$J$10,IF(COUNTIF('Section 3'!$G$15:$G$24,Lists!$H$7)>0,0,1),0))","v":0},0,0]
[null,null,{"$f":"IF(F64=\"\",\"\",MAX($C$16:C63)+1)","v":""},null,null,"",{"$nulls":4},"",{"$nulls":4},"",null,"N",0,{"$f":"IF(C64=\"\",0,IF(OR(D64=0,E64=0,F64=0,G64=0,H64=0,I64=0,K64=0,K64=\"\",L64=0,M64=0,AND(L64=Lists!$I$3,J64=0)),1,0))","v":0},{"$f":"IF(E64=0,0,IF(COUNTIF(Lists!$B$3:$B$203,E64)>0,0,1))","v":0},0,{"$f":"IF(M64=Lists!$J$6,IF(COUNTIF('Section 3'!$G$15:$G$24,Lists!$H$5)>0,0,1), 0)","v":0},{"$f":"IF(M64=Lists!$J$8,IF(COUNTIF('Section 3'!$G$15:$G$24,Lists!$H$6)>0,0,1), 0)","v":0},{"$f":"IF(M64=Lists!$J$9,IF(COUNTIF('Section 3'!$G$15:$G$24,Lists!$H$4)>0,0,1), 0)","v":0},{"$f":"IF(M64=Lists!$J$11,IF(COUNTIF('Section 3'!$G$15:$G$24,Lists!$H$3)>0,0,1),IF(M64=Lists!$J$10,IF(COUNTIF('Section 3'!$G$15:$G$24,Lists!$H$7)>0,0,1),0))","v":0},0,0]
[null,null,{"$f":"IF(F65=\"\",\"\",MAX($C$16:C64)+1)","v":""},null,null,"",{"$nulls":4},"",{"$nulls":4},"",null,"N",0,{"$f":"IF(C65=\"\",0,IF(OR(D65=0,E65=0,F65=0,G65=0,H65=0,I65=0,K65=0,K65=\"\",L65=0,M65=0,AND(L65=Lists!$I$3,J65=0)),1,0))","v":0},{"$f":"IF(E65=0,0,IF(COUNTIF(Lists!$B$3:$B$203,E65)>0,0,1))","v":0},0,{"$f":"IF(M65=Lists!$J$6,IF(COUNTIF('Section 3'!$G$15:$G$24,Lists!$H$5)>0,0,1), 0)","v":0},{"$f":"IF(M65=Lists!$J$8,IF(COUNTIF('Section 3'!$G$15:$G$24,Lists!$H$6)>0,0,1), 0)","v":0},{"$f":"IF(M65=Lists!$J$9,IF(COUNTIF('Section 3'!$G$15:$G$24,Lists!$H$4)>0,0,1), 0)","v":0},{"$f":"IF(M65=Lists!$J$11,IF(COUNTIF('Section 3'!$G$15:$G$24,Lists!$H$3)>0,0,1),IF(M65=Lists!$J$10,IF(COUNTIF('Section 3'!$G$15:$G$24,Lists!$H$7)>0,0,1),0))","v":0},0,0]
[null,null,{"$f":"IF(F66=\"\",\"\",MAX($C$16:C65)+1)","v":""},null,null,"",{"$nulls":4},"",{"$nulls":4},"",null,"N",0,{"$f":"IF(C66=\"\",0,IF(OR(D66=0,E66=0,F66=0,G66=0,H66=0,I66=0,K66=0,K66=\"\",L66=0,M66=0,AND(L66=Lists!$I$3,J66=0)),1,0))","v":0},{"$f":"IF(E66=0,0,IF(COUNTIF(Lists!$B$3:$B$203,E66)>0,0,1))","v":0},0,{"$f":"IF(M66=Lists!$J$6,IF(COUNTIF('Section 3'!$G$15:$G$24,Lists!$H$5)>0,0,1), 0)","v":0},{"$f":"IF(M66=Lists!$J$8,IF(COUNTIF('Section 3'!$G$15:$G$24,Lists!$H$6)>0,0,1), 0)","v":0},{"$f":"IF(M66=Lists!$J$9,IF(COUNTIF('Section 3'!$G$15:$G$24,Lists!$H$4)>0,0,1), 0)","v":0},{"$f":"IF(M66=Lists!$J$11,IF(COUNTIF('Section 3'!$G$15:$G$24,Lists!$H$3)>0,0,1),IF(M66=Lists!$J$10,IF(COUNTIF('Section 3'!$G$15:$G$24,Lists!$H$7)>0,0,1),0))","v":0},0,0]
[null,null,{"$f":"IF(F67=\"\",\"\",MAX($C$16:C66)+1)","v":""},null,null,"",{"$nulls":4},"",{"$nulls":4},"",null,"N",0,{"$f":"IF(C67=\"\",0,IF(OR(D67=0,E67=0,F67=0,G67=0,H67=0,I67=0,K67=0,K67=\"\",L67=0,M67=0,AND(L67=Lists!$I$3,J67=0)),1,0))","v":0},{"$f":"IF(E67=0,0,IF(COUNTIF(Lists!$B$3:$B$203,E67)>0,0,1))","v":0},0,{"$f":"IF(M67=Lists!$J$6,IF(COUNTIF('Section 3'!$G$15:$G$24,Lists!$H$5)>0,0,1), 0)","v":0},{"$f":"IF(M67=Lists!$J$8,IF(COUNTIF('Section 3'!$G$15:$G$24,Lists!$H$6)>0,0,1), 0)","v":0},{"$f":"IF(M67=Lists!$J$9,IF(COUNTIF('Section 3'!$G$15:$G$24,Lists!$H$4)>0,0,1), 0)","v":0},{"$f":"IF(M67=Lists!$J$11,IF(COUNTIF('Section 3'!$G$15:$G$24,Lists!$H$3)>0,0,1),IF(M67=Lists!$J$10,IF(COUNTIF('Section 3'!$G$15:$G$24,Lists!$H$7)>0,0,1),0))","v":0},0,0]
[null,null,{"$f":"IF(F68=\"\",\"\",MAX($C$16:C67)+1)","v":""},null,null,"",{"$nulls":4},"",{"$nulls":4},"",null,"N",0,{"$f":"IF(C68=\"\",0,IF(OR(D68=0,E68=0,F68=0,G68=0,H68=0,I68=0,K68=0,K68=\"\",L68=0,M68=0,AND(L68=Lists!$I$3,J68=0)),1,0))","v":0},{"$f":"IF(E68=0,0,IF(COUNTIF(Lists!$B$3:$B$203,E68)>0,0,1))","v":0},0,{"$f":"IF(M68=Lists!$J$6,IF(COUNTIF('Section 3'!$G$15:$G$24,Lists!$H$5)>0,0,1), 0)","v":0},{"$f":"IF(M68=Lists!$J$8,IF(COUNTIF('Section 3'!$G$15:$G$24,Lists!$H$6)>0,0,1), 0)","v":0},{"$f":"IF(M68=Lists!$J$9,IF(COUNTIF('Section 3'!$G$15:$G$24,Lists!$H$4)>0,0,1), 0)","v":0},{"$f":"IF(M68=Lists!$J$11,IF(COUNTIF('Section 3'!$G$15:$G$24,Lists!$H$3)>0,0,1),IF(M68=Lists!$J$10,IF(COUNTIF('Section 3'!$G$15:$G$24,Lists!$H$7)>0,0,1),0))","v":0},0,0]
[null,null,{"$f":"IF(F69=\"\",\"\",MAX($C$16:C68)+1)","v":""},null,null,"",{"$nulls":4},"",{"$nulls":4},"",null,"N",0,{"$f":"IF(C69=\"\",0,IF(OR(D69=0,E69=0,F69=0,G69=0,H69=0,I69=0,K69=0,K69=\"\",L69=0,M69=0,AND(L69=Lists!$I$3,J69=0)),1,0))","v":0},{"$f":"IF(E69=0,0,IF(COUNTIF(Lists!$B$3:$B$203,E69)>0,0,1))","v":0},0,{"$f":"IF(M69=Lists!$J$6,IF(COUNTIF('Section 3'!$G$15:$G$24,Lists!$H$5)>0,0,1), 0)","v":0},{"$f":"IF(M69=Lists!$J$8,IF(COUNTIF('Section 3'!$G$15:$G$24,Lists!$H$6)>0,0,1), 0)","v":0},{"$f":"IF(M69=Lists!$J$9,IF(COUNTIF('Section 3'!$G$15:$G$24,Lists!$H$4)>0,0,1), 0)","v":0},{"$f":"IF(M69=Lists!$J$11,IF(COUNTIF('Section 3'!$G$15:$G$24,Lists!$H$3)>0,0,1),IF(M69=Lists!$J$10,IF(COUNTIF('Section 3'!$G$15:$G$24,Lists!$H$7)>0,0,1),0))","v":0},0,0]
[null,null,{"$f":"IF(F70=\"\",\"\",MAX($C$16:C69)+1)","v":""},null,null,"",{"$nulls":4},"",{"$nulls":4},"",null,"N",0,{"$f":"IF(C70=\"\",0,IF(OR(D70=0,E70=0,F70=0,G70=0,H70=0,I70=0,K70=0,K70=\"\",L70=0,M70=0,AND(L70=Lists!$I$3,J70=0)),1,0))","v":0},{"$f":"IF(E70=0,0,IF(COUNTIF(Lists!$B$3:$B$203,E70)>0,0,1))","v":0},0,{"$f":"IF(M70=Lists!$J$6,IF(COUNTIF('Section 3'!$G$15:$G$24,Lists!$H$5)>0,0,1), 0)","v":0},{"$f":"IF(M70=Lists!$J$8,IF(COUNTIF('Section 3'!$G$15:$G$24,Lists!$H$6)>0,0,1), 0)","v":0},{"$f":"IF(M70=Lists!$J$9,IF(COUNTIF('Section 3'!$G$15:$G$24,Lists!$H$4)>0,0,1), 0)","v":0},{"$f":"IF(M70=Lists!$J$11,IF(COUNTIF('Section 3'!$G$15:$G$24,Lists!$H$3)>0,0,1),IF(M70=Lists!$J$10,IF(COUNTIF('Section 3'!$G$15:$G$24,Lists!$H$7)>0,0,1),0))","v":0},0,0]
[null,null,{"$f":"IF(F71=\"\",\"\",MAX($C$16:C70)+1)","v":""},null,null,"",{"$nulls":4},"",{"$nulls":4},"",null,"N",0,{"$f":"IF(C71=\"\",0,IF(OR(D71=0,E71=0,F71=0,G71=0,H71=0,I71=0,K71=0,K71=\"\",L71=0,M71=0,AND(L71=Lists!$I$3,J71=0)),1,0))","v":0},{"$f":"IF(E71=0,0,IF(COUNTIF(Lists!$B$3:$B$203,E71)>0,0,1))","v":0},0,{"$f":"IF(M71=Lists!$J$6,IF(COUNTIF('Section 3'!$G$15:$G$24,Lists!$H$5)>0,0,1), 0)","v":0},{"$f":"IF(M71=Lists!$J$8,IF(COUNTIF('Section 3'!$G$15:$G$24,Lists!$H$6)>0,0,1), 0)","v":0},{"$f":"IF(M71=Lists!$J$9,IF(COUNTIF('Section 3'!$G$15:$G$24,Lists!$H$4)>0,0,1), 0)","v":0},{"$f":"IF(M71=Lists!$J$11,IF(COUNTIF('Section 3'!$G$15:$G$24,Lists!$H$3)>0,0,1),IF(M71=Lists!$J$10,IF(COUNTIF('Section 3'!$G$15:$G$24,Lists!$H$7)>0,0,1),0))","v":0},0,0]
[null,null,{"$f":"IF(F72=\"\",\"\",MAX($C$16:C71)+1)","v":""},null,null,"",{"$nulls":4},"",{"$nulls":4},"",null,"N",0,{"$f":"IF(C72=\"\",0,IF(OR(D72=0,E72=0,F72=0,G72=0,H72=0,I72=0,K72=0,K72=\"\",L72=0,M72=0,AND(L72=Lists!$I$3,J72=0)),1,0))","v":0},{"$f":"IF(E72=0,0,IF(COUNTIF(Lists!$B$3:$B$203,E72)>0,0,1))","v":0},0,{"$f":"IF(M72=Lists!$J$6,IF(COUNTIF('Section 3'!$G$15:$G$24,Lists!$H$5)>0,0,1), 0)","v":0},{"$f":"IF(M72=Lists!$J$8,IF(COUNTIF('Section 3'!$G$15:$G$24,Lists!$H$6)>0,0,1), 0)","v":0},{"$f":"IF(M72=Lists!$J$9,IF(COUNTIF('Section 3'!$G$15:$G$24,Lists!$H$4)>0,0,1), 0)","v":0},{"$f":"IF(M72=Lists!$J$11,IF(COUNTIF('Section 3'!$G$15:$G$24,Lists!$H$3)>0,0,1),IF(M72=Lists!$J$10,IF(COUNTIF('Section 3'!$G$15:$G$24,Lists!$H$7)>0,0,1),0))","v":0},0,0]
[null,null,{"$f":"IF(F73=\"\",\"\",MAX($C$16:C72)+1)","v":""},null,null,"",{"$nulls":4},"",{"$nulls":4},"",null,"N",0,{"$f":"IF(C73=\"\",0,IF(OR(D73=0,E73=0,F73=0,G73=0,H73=0,I73=0,K73=0,K73=\"\",L73=0,M73=0,AND(L73=Lists!$I$3,J73=0)),1,0))","v":0},{"$f":"IF(E73=0,0,IF(COUNTIF(Lists!$B$3:$B$203,E73)>0,0,1))","v":0},0,{"$f":"IF(M73=Lists!$J$6,IF(COUNTIF('Section 3'!$G$15:$G$24,Lists!$H$5)>0,0,1), 0)","v":0},{"$f":"IF(M73=Lists!$J$8,IF(COUNTIF('Section 3'!$G$15:$G$24,Lists!$H$6)>0,0,1), 0)","v":0},{"$f":"IF(M73=Lists!$J$9,IF(COUNTIF('Section 3'!$G$15:$G$24,Lists!$H$4)>0,0,1), 0)","v":0},{"$f":"IF(M73=Lists!$J$11,IF(COUNTIF('Section 3'!$G$15:$G$24,Lists!$H$3)>0,0,1),IF(M73=Lists!$J$10,IF(COUNTIF('Section 3'!$G$15:$G$24,Lists!$H$7)>0,0,1),0))","v":0},0,0]
[null,null,{"$f":"IF(F74=\"\",\"\",MAX($C$16:C73)+1)","v":""},null,null,"",{"$nulls":4},"",{"$nulls":4},"",null,"N",0,{"$f":"IF(C74=\"\",0,IF(OR(D74=0,E74=0,F74=0,G74=0,H74=0,I74=0,K74=0,K74=\"\",L74=0,M74=0,AND(L74=Lists!$I$3,J74=0)),1,0))","v":0},{"$f":"IF(E74=0,0,IF(COUNTIF(Lists!$B$3:$B$203,E74)>0,0,1))","v":0},0,{"$f":"IF(M74=Lists!$J$6,IF(COUNTIF('Section 3'!$G$15:$G$24,Lists!$H$5)>0,0,1), 0)","v":0},{"$f":"IF(M74=Lists!$J$8,IF(COUNTIF('Section 3'!$G$15:$G$24,Lists!$H$6)>0,0,1), 0)","v":0},{"$f":"IF(M74=Lists!$J$9,IF(COUNTIF('Section 3'!$G$15:$G$24,Lists!$H$4)>0,0,1), 0)","v":0},{"$f":"IF(M74=Lists!$J$11,IF(COUNTIF('Section 3'!$G$15:$G$24,Lists!$H$3)>0,0,1),IF(M74=Lists!$J$10,IF(COUNTIF('Section 3'!$G$15:$G$24,Lists!$H$7)>0,0,1),0))","v":0},0,0]
[null,null,{"$f":"IF(F75=\"\",\"\",MAX($C$16:C74)+1)","v":""},null,null,"",{"$nulls":4},"",{"$nulls":4},"",null,"N",0,{"$f":"IF(C75=\"\",0,IF(OR(D75=0,E75=0,F75=0,G75=0,H75=0,I75=0,K75=0,K75=\"\",L75=0,M75=0,AND(L75=Lists!$I$3,J75=0)),1,0))","v":0},{"$f":"IF(E75=0,0,IF(COUNTIF(Lists!$B$3:$B$203,E75)>0,0,1))","v":0},0,{"$f":"IF(M75=Lists!$J$6,IF(COUNTIF('Section 3'!$G$15:$G$24,Lists!$H$5)>0,0,1), 0)","v":0},{"$f":"IF(M75=Lists!$J$8,IF(COUNTIF('Section 3'!$G$15:$G$24,Lists!$H$6)>0,0,1), 0)","v":0},{"$f":"IF(M75=Lists!$J$9,IF(COUNTIF('Section 3'!$G$15:$G$24,Lists!$H$4)>0,0,1), 0)","v":0},{"$f":"IF(M75=Lists!$J$11,IF(COUNTIF('Section 3'!$G$15:$G$24,Lists!$H$3)>0,0,1),IF(M75=Lists!$J$10,IF(COUNTIF('Section 3'!$G$15:$G$24,Lists!$H$7)>0,0,1),0))","v":0},0,0]
[null,null,{"$f":"IF(F76=\"\",\"\",MAX($C$16:C75)+1)","v":""},null,null,"",{"$nulls":4},"",{"$nulls":4},"",null,"N",0,{"$f":"IF(C76=\"\",0,IF(OR(D76=0,E76=0,F76=0,G76=0,H76=0,I76=0,K76=0,K76=\"\",L76=0,M76=0,AND(L76=Lists!$I$3,J76=0)),1,0))","v":0},{"$f":"IF(E76=0,0,IF(COUNTIF(Lists!$B$3:$B$203,E76)>0,0,1))","v":0},0,{"$f":"IF(M76=Lists!$J$6,IF(COUNTIF('Section 3'!$G$15:$G$24,Lists!$H$5)>0,0,1), 0)","v":0},{"$f":"IF(M76=Lists!$J$8,IF(COUNTIF('Section 3'!$G$15:$G$24,Lists!$H$6)>0,0,1), 0)","v":0},{"$f":"IF(M76=Lists!$J$9,IF(COUNTIF('Section 3'!$G$15:$G$24,Lists!$H$4)>0,0,1), 0)","v":0},{"$f":"IF(M76=Lists!$J$11,IF(COUNTIF('Section 3'!$G$15:$G$24,Lists!$H$3)>0,0,1),IF(M76=Lists!$J$10,IF(COUNTIF('Section 3'!$G$15:$G$24,Lists!$H$7)>0,0,1),0))","v":0},0,0]
[null,null,{"$f":"IF(F77=\"\",\"\",MAX($C$16:C76)+1)","v":""},null,null,"",{"$nulls":4},"",{"$nulls":4},"",null,"N",0,{"$f":"IF(C77=\"\",0,IF(OR(D77=0,E77=0,F77=0,G77=0,H77=0,I77=0,K77=0,K77=\"\",L77=0,M77=0,AND(L77=Lists!$I$3,J77=0)),1,0))","v":0},{"$f":"IF(E77=0,0,IF(COUNTIF(Lists!$B$3:$B$203,E77)>0,0,1))","v":0},0,{"$f":"IF(M77=Lists!$J$6,IF(COUNTIF('Section 3'!$G$15:$G$24,Lists!$H$5)>0,0,1), 0)","v":0},{"$f":"IF(M77=Lists!$J$8,IF(COUNTIF('Section 3'!$G$15:$G$24,Lists!$H$6)>0,0,1), 0)","v":0},{"$f":"IF(M77=Lists!$J$9,IF(COUNTIF('Section 3'!$G$15:$G$24,Lists!$H$4)>0,0,1), 0)","v":0},{"$f":"IF(M77=Lists!$J$11,IF(COUNTIF('Section 3'!$G$15:$G$24,Lists!$H$3)>0,0,1),IF(M77=Lists!$J$10,IF(COUNTIF('Section 3'!$G$15:$G$24,Lists!$H$7)>0,0,1),0))","v":0},0,0]
[null,null,{"$f":"IF(F78=\"\",\"\",MAX($C$16:C77)+1)","v":""},null,null,"",{"$nulls":4},"",{"$nulls":4},"",null,"N",0,{"$f":"IF(C78=\"\",0,IF(OR(D78=0,E78=0,F78=0,G78=0,H78=0,I78=0,K78=0,K78=\"\",L78=0,M78=0,AND(L78=Lists!$I$3,J78=0)),1,0))","v":0},{"$f":"IF(E78=0,0,IF(COUNTIF(Lists!$B$3:$B$203,E78)>0,0,1))","v":0},0,{"$f":"IF(M78=Lists!$J$6,IF(COUNTIF('Section 3'!$G$15:$G$24,Lists!$H$5)>0,0,1), 0)","v":0},{"$f":"IF(M78=Lists!$J$8,IF(COUNTIF('Section 3'!$G$15:$G$24,Lists!$H$6)>0,0,1), 0)","v":0},{"$f":"IF(M78=Lists!$J$9,IF(COUNTIF('Section 3'!$G$15:$G$24,Lists!$H$4)>0,0,1), 0)","v":0},{"$f":"IF(M78=Lists!$J$11,IF(COUNTIF('Section 3'!$G$15:$G$24,Lists!$H$3)>0,0,1),IF(M78=Lists!$J$10,IF(COUNTIF('Section 3'!$G$15:$G$24,Lists!$H$7)>0,0,1),0))","v":0},0,0]
[null,null,{"$f":"IF(F79=\"\",\"\",MAX($C$16:C78)+1)","v":""},null,null,"",{"$nulls":4},"",{"$nulls":4},"",null,{"$f":"IF(C79=\"\",\"N\",\"Y\")","v":"N"},{"$f":"IF(OR(D79=0,AND(D79>=StartDate,D79<=EndDate)),0,1)","v":0},{"$f":"IF(C79=\"\",0,IF(OR(D79=0,E79=0,F79=0,G79=0,H79=0,I79=0,K79=0,K79=\"\",L79=0,M79=0,AND(L79=Lists!$I$3,J79=0)),1,0))","v":0},{"$f":"IF(E79=0,0,IF(COUNTIF(Lists!$B$3:$B$203,E79)>0,0,1))","v":0},0,{"$f":"IF(M79=Lists!$J$6,IF(COUNTIF('Section 3'!$G$15:$G$24,Lists!$H$5)>0,0,1), 0)","v":0},{"$f":"IF(M79=Lists!$J$8,IF(COUNTIF('Section 3'!$G$15:$G$24,Lists!$H$6)>0,0,1), 0)","v":0},{"$f":"IF(M79=Lists!$J$9,IF(COUNTIF('Section 3'!$G$15:$G$24,Lists!$H$4)>0,0,1), 0)","v":0},{"$f":"IF(M79=Lists!$J$11,IF(COUNTIF('Section 3'!$G$15:$G$24,Lists!$H$3)>0,0,1),IF(M79=Lists!$J$10,IF(COUNTIF('Section 3'!$G$15:$G$24,Lists!$H$7)>0,0,1),0))","v":0},0,0]
[null,null,{"$f":"IF(F80=\"\",\"\",MAX($C$16:C79)+1)","v":""},null,null,"",{"$nulls":4},"",{"$nulls":4},"",null,"N",0,{"$f":"IF(C80=\"\",0,IF(OR(D80=0,E80=0,F80=0,G80=0,H80=0,I80=0,K80=0,K80=\"\",L80=0,M80=0,AND(L80=Lists!$I$3,J80=0)),1,0))","v":0},{"$f":"IF(E80=0,0,IF(COUNTIF(Lists!$B$3:$B$203,E80)>0,0,1))","v":0},0,{"$f":"IF(M80=Lists!$J$6,IF(COUNTIF('Section 3'!$G$15:$G$24,Lists!$H$5)>0,0,1), 0)","v":0},{"$f":"IF(M80=Lists!$J$8,IF(COUNTIF('Section 3'!$G$15:$G$24,Lists!$H$6)>0,0,1), 0)","v":0},{"$f":"IF(M80=Lists!$J$9,IF(COUNTIF('Section 3'!$G$15:$G$24,Lists!$H$4)>0,0,1), 0)","v":0},{"$f":"IF(M80=Lists!$J$11,IF(COUNTIF('Section 3'!$G$15:$G$24,Lists!$H$3)>0,0,1),IF(M80=Lists!$J$10,IF(COUNTIF('Section 3'!$G$15:$G$24,Lists!$H$7)>0,0,1),0))","v":0},{"$f":"IF(L80=0,0,IF(COUNTIF(MeBrTransactionType,L80)>0,0,1))","v":0},{"$f":"IF(M80=0,0,IF(OR(COUNTIF(MeBrNewIntendedUses,M80)>0,COUNTIF(HeelsIntendedUses,M80)>0),0,1))","v":0}]
[null,null,{"$f":"IF(F81=\"\",\"\",MAX($C$16:C80)+1)","v":""},null,null,{"$f":"IF($D81=\"\", \"\", \"CH3Br\")","v":""},{"$nulls":4},"",{"$nulls":4},{"$f":"IF(SUM(S81:T81,U81:U81,AA81:AB81)>0,\"ROW INCOMPLETE OR INVALID DATA ENTERED; ENTER/EDIT DATA IN REQUIRED FIELDS\",\"\")","v":""},null,"N",0,{"$f":"IF(C81=\"\",0,IF(OR(D81=0,E81=0,F81=0,G81=0,H81=0,I81=0,K81=0,K81=\"\",L81=0,M81=0,AND(L81=Lists!$I$3,J81=0)),1,0))","v":0},{"$f":"IF(E81=0,0,IF(COUNTIF(Lists!$B$3:$B$203,E81)>0,0,1))","v":0},{"$f":"SUM(W81:Y81)","v":0},{"$f":"IF(M81=Lists!$J$6,IF(COUNTIF('Section 3'!$G$15:$G$24,Lists!$H$5)>0,0,1), 0)","v":0},{"$f":"IF(M81=Lists!$J$8,IF(COUNTIF('Section 3'!$G$15:$G$24,Lists!$H$6)>0,0,1), 0)","v":0},{"$f":"IF(M81=Lists!$J$9,IF(COUNTIF('Section 3'!$G$15:$G$24,Lists!$H$4)>0,0,1), 0)","v":0},{"$f":"IF(M81=Lists!$J$11,IF(COUNTIF('Section 3'!$G$15:$G$24,Lists!$H$3)>0,0,1),IF(M81=Lists!$J$10,IF(COUNTIF('Section 3'!$G$15:$G$24,Lists!$H$7)>0,0,1),0))","v":0},0,0]
[null,null,{"$f":"IF(F82=\"\",\"\",MAX($C$16:C81)+1)","v":""},null,null,"",{"$nulls":4},"",{"$nulls":4},"",null,"N",0,{"$f":"IF(C82=\"\",0,IF(OR(D82=0,E82=0,F82=0,G82=0,H82=0,I82=0,K82=0,K82=\"\",L82=0,M82=0,AND(L82=Lists!$I$3,J82=0)),1,0))","v":0},{"$f":"IF(E82=0,0,IF(COUNTIF(Lists!$B$3:$B$203,E82)>0,0,1))","v":0},0,{"$f":"IF(M82=Lists!$J$6,IF(COUNTIF('Section 3'!$G$15:$G$24,Lists!$H$5)>0,0,1), 0)","v":0},{"$f":"IF(M82=Lists!$J$8,IF(COUNTIF('Section 3'!$G$15:$G$24,Lists!$H$6)>0,0,1), 0)","v":0},{"$f":"IF(M82=Lists!$J$9,IF(COUNTIF('Section 3'!$G$15:$G$24,Lists!$H$4)>0,0,1), 0)","v":0},{"$f":"IF(M82=Lists!$J$11,IF(COUNTIF('Section 3'!$G$15:$G$24,Lists!$H$3)>0,0,1),IF(M82=Lists!$J$10,IF(COUNTIF('Section 3'!$G$15:$G$24,Lists!$H$7)>0,0,1),0))","v":0},0,0]
[null,null,{"$f":"IF(F83=\"\",\"\",MAX($C$16:C82)+1)","v":""},null,null,"",{"$nulls":4},"",{"$nulls":4},"",null,"N",0,{"$f":"IF(C83=\"\",0,IF(OR(D83=0,E83=0,F83=0,G83=0,H83=0,I83=0,K83=0,K83=\"\",L83=0,M83=0,AND(L83=Lists!$I$3,J83=0)),1,0))","v":0},{"$f":"IF(E83=0,0,IF(COUNTIF(Lists!$B$3:$B$203,E83)>0,0,1))","v":0},0,{"$f":"IF(M83=Lists!$J$6,IF(COUNTIF('Section 3'!$G$15:$G$24,Lists!$H$5)>0,0,1), 0)","v":0},{"$f":"IF(M83=Lists!$J$8,IF(COUNTIF('Section 3'!$G$15:$G$24,Lists!$H$6)>0,0,1), 0)","v":0},{"$f":"IF(M83=Lists!$J$9,IF(COUNTIF('Section 3'!$G$15:$G$24,Lists!$H$4)>0,0,1), 0)","v":0},{"$f":"IF(M83=Lists!$J$11,IF(COUNTIF('Section 3'!$G$15:$G$24,Lists!$H$3)>0,0,1),IF(M83=Lists!$J$10,IF(COUNTIF('Section 3'!$G$15:$G$24,Lists!$H$7)>0,0,1),0))","v":0},0,0]
[null,null,{"$f":"IF(F84=\"\",\"\",MAX($C$16:C83)+1)","v":""},null,null,"",{"$nulls":4},"",{"$nulls":4},"",null,"N",0,{"$f":"IF(C84=\"\",0,IF(OR(D84=0,E84=0,F84=0,G84=0,H84=0,I84=0,K84=0,K84=\"\",L84=0,M84=0,AND(L84=Lists!$I$3,J84=0)),1,0))","v":0},{"$f":"IF(E84=0,0,IF(COUNTIF(Lists!$B$3:$B$203,E84)>0,0,1))","v":0},0,{"$f":"IF(M84=Lists!$J$6,IF(COUNTIF('Section 3'!$G$15:$G$24,Lists!$H$5)>0,0,1), 0)","v":0},{"$f":"IF(M84=Lists!$J$8,IF(COUNTIF('Section 3'!$G$15:$G$24,Lists!$H$6)>0,0,1), 0)","v":0},{"$f":"IF(M84=Lists!$J$9,IF(COUNTIF('Section 3'!$G$15:$G$24,Lists!$H$4)>0,0,1), 0)","v":0},{"$f":"IF(M84=Lists!$J$11,IF(COUNTIF('Section 3'!$G$15:$G$24,Lists!$H$3)>0,0,1),IF(M84=Lists!$J$10,IF(COUNTIF('Section 3'!$G$15:$G$24,Lists!$H$7)>0,0,1),0))","v":0},0,0]
[null,null,{"$f":"IF(F85=\"\",\"\",MAX($C$16:C84)+1)","v":""},null,null,"",{"$nulls":4},"",{"$nulls":4},"",null,"N",0,{"$f":"IF(C85=\"\",0,IF(OR(D85=0,E85=0,F85=0,G85=0,H85=0,I85=0,K85=0,K85=\"\",L85=0,M85=0,AND(L85=Lists!$I$3,J85=0)),1,0))","v":0},{"$f":"IF(E85=0,0,IF(COUNTIF(Lists!$B$3:$B$203,E85)>0,0,1))","v":0},0,{"$f":"IF(M85=Lists!$J$6,IF(COUNTIF('Section 3'!$G$15:$G$24,Lists!$H$5)>0,0,1), 0)","v":0},{"$f":"IF(M85=Lists!$J$8,IF(COUNTIF('Section 3'!$G$15:$G$24,Lists!$H$6)>0,0,1), 0)","v":0},{"$f":"IF(M85=Lists!$J$9,IF(COUNTIF('Section 3'!$G$15:$G$24,Lists!$H$4)>0,0,1), 0)","v":0},{"$f":"IF(M85=Lists!$J$11,IF(COUNTIF('Section 3'!$G$15:$G$24,Lists!$H$3)>0,0,1),IF(M85=Lists!$J$10,IF(COUNTIF('Section 3'!$G$15:$G$24,Lists!$H$7)>0,0,1),0))","v":0},0,0]
[null,null,{"$f":"IF(F86=\"\",\"\",MAX($C$16:C85)+1)","v":""},null,null,"",{"$nulls":4},"",{"$nulls":4},"",null,"N",0,{"$f":"IF(C86=\"\",0,IF(OR(D86=0,E86=0,F86=0,G86=0,H86=0,I86=0,K86=0,K86=\"\",L86=0,M86=0,AND(L86=Lists!$I$3,J86=0)),1,0))","v":0},{"$f":"IF(E86=0,0,IF(COUNTIF(Lists!$B$3:$B$203,E86)>0,0,1))","v":0},0,{"$f":"IF(M86=Lists!$J$6,IF(COUNTIF('Section 3'!$G$15:$G$24,Lists!$H$5)>0,0,1), 0)","v":0},{"$f":"IF(M86=Lists!$J$8,IF(COUNTIF('Section 3'!$G$15:$G$24,Lists!$H$6)>0,0,1), 0)","v":0},{"$f":"IF(M86=Lists!$J$9,IF(COUNTIF('Section 3'!$G$15:$G$24,Lists!$H$4)>0,0,1), 0)","v":0},{"$f":"IF(M86=Lists!$J$11,IF(COUNTIF('Section 3'!$G$15:$G$24,Lists!$H$3)>0,0,1),IF(M86=Lists!$J$10,IF(COUNTIF('Section 3'!$G$15:$G$24,Lists!$H$7)>0,0,1),0))","v":0},0,0]
[null,null,{"$f":"IF(F87=\"\",\"\",MAX($C$16:C86)+1)","v":""},null,null,"",{"$nulls":4},"",{"$nulls":4},"",null,"N",0,{"$f":"IF(C87=\"\",0,IF(OR(D87=0,E87=0,F87=0,G87=0,H87=0,I87=0,K87=0,K87=\"\",L87=0,M87=0,AND(L87=Lists!$I$3,J87=0)),1,0))","v":0},{"$f":"IF(E87=0,0,IF(COUNTIF(Lists!$B$3:$B$203,E87)>0,0,1))","v":0},0,{"$f":"IF(M87=Lists!$J$6,IF(COUNTIF('Section 3'!$G$15:$G$24,Lists!$H$5)>0,0,1), 0)","v":0},{"$f":"IF(M87=Lists!$J$8,IF(COUNTIF('Section 3'!$G$15:$G$24,Lists!$H$6)>0,0,1), 0)","v":0},{"$f":"IF(M87=Lists!$J$9,IF(COUNTIF('Section 3'!$G$15:$G$24,Lists!$H$4)>0,0,1), 0)","v":0},{"$f":"IF(M87=Lists!$J$11,IF(COUNTIF('Section 3'!$G$15:$G$24,Lists!$H$3)>0,0,1),IF(M87=Lists!$J$10,IF(COUNTIF('Section 3'!$G$15:$G$24,Lists!$H$7)>0,0,1),0))","v":0},0,0]
[null,null,{"$f":"IF(F88=\"\",\"\",MAX($C$16:C87)+1)","v":""},null,null,"",{"$nulls":4},"",{"$nulls":4},"",null,"N",0,{"$f":"IF(C88=\"\",0,IF(OR(D88=0,E88=0,F88=0,G88=0,H88=0,I88=0,K88=0,K88=\"\",L88=0,M88=0,AND(L88=Lists!$I$3,J88=0)),1,0))","v":0},{"$f":"IF(E88=0,0,IF(COUNTIF(Lists!$B$3:$B$203,E88)>0,0,1))","v":0},0,{"$f":"IF(M88=Lists!$J$6,IF(COUNTIF('Section 3'!$G$15:$G$24,Lists!$H$5)>0,0,1), 0)","v":0},{"$f":"IF(M88=Lists!$J$8,IF(COUNTIF('Section 3'!$G$15:$G$24,Lists!$H$6)>0,0,1), 0)","v":0},{"$f":"IF(M88=Lists!$J$9,IF(COUNTIF('Section 3'!$G$15:$G$24,Lists!$H$4)>0,0,1), 0)","v":0},{"$f":"IF(M88=Lists!$J$11,IF(COUNTIF('Section 3'!$G$15:$G$24,Lists!$H$3)>0,0,1),IF(M88=Lists!$J$10,IF(COUNTIF('Section 3'!$G$15:$G$24,Lists!$H$7)>0,0,1),0))","v":0},0,0]
[null,null,{"$f":"IF(F89=\"\",\"\",MAX($C$16:C88)+1)","v":""},null,null,"",{"$nulls":4},"",{"$nulls":4},"",null,"N",0,{"$f":"IF(C89=\"\",0,IF(OR(D89=0,E89=0,F89=0,G89=0,H89=0,I89=0,K89=0,K89=\"\",L89=0,M89=0,AND(L89=Lists!$I$3,J89=0)),1,0))","v":0},{"$f":"IF(E89=0,0,IF(COUNTIF(Lists!$B$3:$B$203,E89)>0,0,1))","v":0},0,{"$f":"IF(M89=Lists!$J$6,IF(COUNTIF('Section 3'!$G$15:$G$24,Lists!$H$5)>0,0,1), 0)","v":0},{"$f":"IF(M89=Lists!$J$8,IF(COUNTIF('Section 3'!$G$15:$G$24,Lists!$H$6)>0,0,1), 0)","v":0},{"$f":"IF(M89=Lists!$J$9,IF(COUNTIF('Section 3'!$G$15:$G$24,Lists!$H$4)>0,0,1), 0)","v":0},{"$f":"IF(M89=Lists!$J$11,IF(COUNTIF('Section 3'!$G$15:$G$24,Lists!$H$3)>0,0,1),IF(M89=Lists!$J$10,IF(COUNTIF('Section 3'!$G$15:$G$24,Lists!$H$7)>0,0,1),0))","v":0},0,0]
[null,null,{"$f":"IF(F90=\"\",\"\",MAX($C$16:C89)+1)","v":""},null,null,"",{"$nulls":4},"",{"$nulls":4},"",null,"N",0,{"$f":"IF(C90=\"\",0,IF(OR(D90=0,E90=0,F90=0,G90=0,H90=0,I90=0,K90=0,K90=\"\",L90=0,M90=0,AND(L90=Lists!$I$3,J90=0)),1,0))","v":0},{"$f":"IF(E90=0,0,IF(COUNTIF(Lists!$B$3:$B$203,E90)>0,0,1))","v":0},0,{"$f":"IF(M90=Lists!$J$6,IF(COUNTIF('Section 3'!$G$15:$G$24,Lists!$H$5)>0,0,1), 0)","v":0},{"$f":"IF(M90=Lists!$J$8,IF(COUNTIF('Section 3'!$G$15:$G$24,Lists!$H$6)>0,0,1), 0)","v":0},{"$f":"IF(M90=Lists!$J$9,IF(COUNTIF('Section 3'!$G$15:$G$24,Lists!$H$4)>0,0,1), 0)","v":0},{"$f":"IF(M90=Lists!$J$11,IF(COUNTIF('Section 3'!$G$15:$G$24,Lists!$H$3)>0,0,1),IF(M90=Lists!$J$10,IF(COUNTIF('Section 3'!$G$15:$G$24,Lists!$H$7)>0,0,1),0))","v":0},0,0]
[null,null,{"$f":"IF(F91=\"\",\"\",MAX($C$16:C90)+1)","v":""},null,null,"",{"$nulls":4},"",{"$nulls":4},"",null,"N",0,{"$f":"IF(C91=\"\",0,IF(OR(D91=0,E91=0,F91=0,G91=0,H91=0,I91=0,K91=0,K91=\"\",L91=0,M91=0,AND(L91=Lists!$I$3,J91=0)),1,0))","v":0},{"$f":"IF(E91=0,0,IF(COUNTIF(Lists!$B$3:$B$203,E91)>0,0,1))","v":0},0,{"$f":"IF(M91=Lists!$J$6,IF(COUNTIF('Section 3'!$G$15:$G$24,Lists!$H$5)>0,0,1), 0)","v":0},{"$f":"IF(M91=Lists!$J$8,IF(COUNTIF('Section 3'!$G$15:$G$24,Lists!$H$6)>0,0,1), 0)","v":0},{"$f":"IF(M91=Lists!$J$9,IF(COUNTIF('Section 3'!$G$15:$G$24,Lists!$H$4)>0,0,1), 0)","v":0},{"$f":"IF(M91=Lists!$J$11,IF(COUNTIF('Section 3'!$G$15:$G$24,Lists!$H$3)>0,0,1),IF(M91=Lists!$J$10,IF(COUNTIF('Section 3'!$G$15:$G$24,Lists!$H$7)>0,0,1),0))","v":0},0,0]
[null,null,{"$f":"IF(F92=\"\",\"\",MAX($C$16:C91)+1)","v":""},null,null,"",{"$nulls":4},"",{"$nulls":4},"",null,"N",0,{"$f":"IF(C92=\"\",0,IF(OR(D92=0,E92=0,F92=0,G92=0,H92=0,I92=0,K92=0,K92=\"\",L92=0,M92=0,AND(L92=Lists!$I$3,J92=0)),1,0))","v":0},{"$f":"IF(E92=0,0,IF(COUNTIF(Lists!$B$3:$B$203,E92)>0,0,1))","v":0},0,{"$f":"IF(M92=Lists!$J$6,IF(COUNTIF('Section 3'!$G$15:$G$24,Lists!$H$5)>0,0,1), 0)","v":0},{"$f":"IF(M92=Lists!$J$8,IF(COUNTIF('Section 3'!$G$15:$G$24,Lists!$H$6)>0,0,1), 0)","v":0},{"$f":"IF(M92=Lists!$J$9,IF(COUNTIF('Section 3'!$G$15:$G$24,Lists!$H$4)>0,0,1), 0)","v":0},{"$f":"IF(M92=Lists!$J$11,IF(COUNTIF('Section 3'!$G$15:$G$24,Lists!$H$3)>0,0,1),IF(M92=Lists!$J$10,IF(COUNTIF('Section 3'!$G$15:$G$24,Lists!$H$7)>0,0,1),0))","v":0},0,0]
[null,null,{"$f":"IF(F93=\"\",\"\",MAX($C$16:C92)+1)","v":""},null,null,"",{"$nulls":4},"",{"$nulls":4},"",null,"N",0,{"$f":"IF(C93=\"\",0,IF(OR(D93=0,E93=0,F93=0,G93=0,H93=0,I93=0,K93=0,K93=\"\",L93=0,M93=0,AND(L93=Lists!$I$3,J93=0)),1,0))","v":0},{"$f":"IF(E93=0,0,IF(COUNTIF(Lists!$B$3:$B$203,E93)>0,0,1))","v":0},0,{"$f":"IF(M93=Lists!$J$6,IF(COUNTIF('Section 3'!$G$15:$G$24,Lists!$H$5)>0,0,1), 0)","v":0},{"$f":"IF(M93=Lists!$J$8,IF(COUNTIF('Section 3'!$G$15:$G$24,Lists!$H$6)>0,0,1), 0)","v":0},{"$f":"IF(M93=Lists!$J$9,IF(COUNTIF('Section 3'!$G$15:$G$24,Lists!$H$4)>0,0,1), 0)","v":0},{"$f":"IF(M93=Lists!$J$11,IF(COUNTIF('Section 3'!$G$15:$G$24,Lists!$H$3)>0,0,1),IF(M93=Lists!$J$10,IF(COUNTIF('Section 3'!$G$15:$G$24,Lists!$H$7)>0,0,1),0))","v":0},0,0]
[null,null,{"$f":"IF(F94=\"\",\"\",MAX($C$16:C93)+1)","v":""},null,null,"",{"$nulls":4},"",{"$nulls":4},"",null,"N",0,{"$f":"IF(C94=\"\",0,IF(OR(D94=0,E94=0,F94=0,G94=0,H94=0,I94=0,K94=0,K94=\"\",L94=0,M94=0,AND(L94=Lists!$I$3,J94=0)),1,0))","v":0},{"$f":"IF(E94=0,0,IF(COUNTIF(Lists!$B$3:$B$203,E94)>0,0,1))","v":0},0,{"$f":"IF(M94=Lists!$J$6,IF(COUNTIF('Section 3'!$G$15:$G$24,Lists!$H$5)>0,0,1), 0)","v":0},{"$f":"IF(M94=Lists!$J$8,IF(COUNTIF('Section 3'!$G$15:$G$24,Lists!$H$6)>0,0,1), 0)","v":0},{"$f":"IF(M94=Lists!$J$9,IF(COUNTIF('Section 3'!$G$15:$G$24,Lists!$H$4)>0,0,1), 0)","v":0},{"$f":"IF(M94=Lists!$J$11,IF(COUNTIF('Section 3'!$G$15:$G$24,Lists!$H$3)>0,0,1),IF(M94=Lists!$J$10,IF(COUNTIF('Section 3'!$G$15:$G$24,Lists!$H$7)>0,0,1),0))","v":0},0,0]
[null,null,{"$f":"IF(F95=\"\",\"\",MAX($C$16:C94)+1)","v":""},null,null,"",{"$nulls":4},"",{"$nulls":4},"",null,"N",0,{"$f":"IF(C95=\"\",0,IF(OR(D95=0,E95=0,F95=0,G95=0,H95=0,I95=0,K95=0,K95=\"\",L95=0,M95=0,AND(L95=Lists!$I$3,J95=0)),1,0))","v":0},{"$f":"IF(E95=0,0,IF(COUNTIF(Lists!$B$3:$B$203,E95)>0,0,1))","v":0},0,{"$f":"IF(M95=Lists!$J$6,IF(COUNTIF('Section 3'!$G$15:$G$24,Lists!$H$5)>0,0,1), 0)","v":0},{"$f":"IF(M95=Lists!$J$8,IF(COUNTIF('Section 3'!$G$15:$G$24,Lists!$H$6)>0,0,1), 0)","v":0},{"$f":"IF(M95=Lists!$J$9,IF(COUNTIF('Section 3'!$G$15:$G$24,Lists!$H$4)>0,0,1), 0)","v":0},{"$f":"IF(M95=Lists!$J$11,IF(COUNTIF('Section 3'!$G$15:$G$24,Lists!$H$3)>0,0,1),IF(M95=Lists!$J$10,IF(COUNTIF('Section 3'!$G$15:$G$24,Lists!$H$7)>0,0,1),0))","v":0},0,0]
[null,null,{"$f":"IF(F96=\"\",\"\",MAX($C$16:C95)+1)","v":""},null,null,"",{"$nulls":4},"",{"$nulls":4},"",null,"N",0,{"$f":"IF(C96=\"\",0,IF(OR(D96=0,E96=0,F96=0,G96=0,H96=0,I96=0,K96=0,K96=\"\",L96=0,M96=0,AND(L96=Lists!$I$3,J96=0)),1,0))","v":0},{"$f":"IF(E96=0,0,IF(COUNTIF(Lists!$B$3:$B$203,E96)>0,0,1))","v":0},0,{"$f":"IF(M96=Lists!$J$6,IF(COUNTIF('Section 3'!$G$15:$G$24,Lists!$H$5)>0,0,1), 0)","v":0},{"$f":"IF(M96=Lists!$J$8,IF(COUNTIF('Section 3'!$G$15:$G$24,Lists!$H$6)>0,0,1), 0)","v":0},{"$f":"IF(M96=Lists!$J$9,IF(COUNTIF('Section 3'!$G$15:$G$24,Lists!$H$4)>0,0,1), 0)","v":0},{"$f":"IF(M96=Lists!$J$11,IF(COUNTIF('Section 3'!$G$15:$G$24,Lists!$H$3)>0,0,1),IF(M96=Lists!$J$10,IF(COUNTIF('Section 3'!$G$15:$G$24,Lists!$H$7)>0,0,1),0))","v":0},0,0]
[null,null,{"$f":"IF(F97=\"\",\"\",MAX($C$16:C96)+1)","v":""},null,null,"",{"$nulls":4},"",{"$nulls":4},"",null,"N",0,{"$f":"IF(C97=\"\",0,IF(OR(D97=0,E97=0,F97=0,G97=0,H97=0,I97=0,K97=0,K97=\"\",L97=0,M97=0,AND(L97=Lists!$I$3,J97=0)),1,0))","v":0},{"$f":"IF(E97=0,0,IF(COUNTIF(Lists!$B$3:$B$203,E97)>0,0,1))","v":0},0,{"$f":"IF(M97=Lists!$J$6,IF(COUNTIF('Section 3'!$G$15:$G$24,Lists!$H$5)>0,0,1), 0)","v":0},{"$f":"IF(M97=Lists!$J$8,IF(COUNTIF('Section 3'!$G$15:$G$24,Lists!$H$6)>0,0,1), 0)","v":0},{"$f":"IF(M97=Lists!$J$9,IF(COUNTIF('Section 3'!$G$15:$G$24,Lists!$H$4)>0,0,1), 0)","v":0},{"$f":"IF(M97=Lists!$J$11,IF(COUNTIF('Section 3'!$G$15:$G$24,Lists!$H$3)>0,0,1),IF(M97=Lists!$J$10,IF(COUNTIF('Section 3'!$G$15:$G$24,Lists!$H$7)>0,0,1),0))","v":0},0,0]
[null,null,{"$f":"IF(F98=\"\",\"\",MAX($C$16:C97)+1)","v":""},null,null,"",{"$nulls":4},"",{"$nulls":4},"",null,"N",0,{"$f":"IF(C98=\"\",0,IF(OR(D98=0,E98=0,F98=0,G98=0,H98=0,I98=0,K98=0,K98=\"\",L98=0,M98=0,AND(L98=Lists!$I$3,J98=0)),1,0))","v":0},{"$f":"IF(E98=0,0,IF(COUNTIF(Lists!$B$3:$B$203,E98)>0,0,1))","v":0},0,{"$f":"IF(M98=Lists!$J$6,IF(COUNTIF('Section 3'!$G$15:$G$24,Lists!$H$5)>0,0,1), 0)","v":0},{"$f":"IF(M98=Lists!$J$8,IF(COUNTIF('Section 3'!$G$15:$G$24,Lists!$H$6)>0,0,1), 0)","v":0},{"$f":"IF(M98=Lists!$J$9,IF(COUNTIF('Section 3'!$G$15:$G$24,Lists!$H$4)>0,0,1), 0)","v":0},{"$f":"IF(M98=Lists!$J$11,IF(COUNTIF('Section 3'!$G$15:$G$24,Lists!$H$3)>0,0,1),IF(M98=Lists!$J$10,IF(COUNTIF('Section 3'!$G$15:$G$24,Lists!$H$7)>0,0,1),0))","v":0},0,0]
[null,null,{"$f":"IF(F99=\"\",\"\",MAX($C$16:C98)+1)","v":""},null,null,"",{"$nulls":4},"",{"$nulls":4},"",null,"N",0,{"$f":"IF(C99=\"\",0,IF(OR(D99=0,E99=0,F99=0,G99=0,H99=0,I99=0,K99=0,K99=\"\",L99=0,M99=0,AND(L99=Lists!$I$3,J99=0)),1,0))","v":0},{"$f":"IF(E99=0,0,IF(COUNTIF(Lists!$B$3:$B$203,E99)>0,0,1))","v":0},0,{"$f":"IF(M99=Lists!$J$6,IF(COUNTIF('Section 3'!$G$15:$G$24,Lists!$H$5)>0,0,1), 0)","v":0},{"$f":"IF(M99=Lists!$J$8,IF(COUNTIF('Section 3'!$G$15:$G$24,Lists!$H$6)>0,0,1), 0)","v":0},{"$f":"IF(M99=Lists!$J$9,IF(COUNTIF('Section 3'!$G$15:$G$24,Lists!$H$4)>0,0,1), 0)","v":0},{"$f":"IF(M99=Lists!$J$11,IF(COUNTIF('Section 3'!$G$15:$G$24,Lists!$H$3)>0,0,1),IF(M99=Lists!$J$10,IF(COUNTIF('Section 3'!$G$15:$G$24,Lists!$H$7)>0,0,1),0))","v":0},0,0]
[null,null,{"$f":"IF(F100=\"\",\"\",MAX($C$16:C99)+1)","v":""},null,null,"",{"$nulls":4},"",{"$nulls":4},"",null,"N",0,{"$f":"IF(C100=\"\",0,IF(OR(D100=0,E100=0,F100=0,G100=0,H100=0,I100=0,K100=0,K100=\"\",L100=0,M100=0,AND(L100=Lists!$I$3,J100=0)),1,0))","v":0},{"$f":"IF(E100=0,0,IF(COUNTIF(Lists!$B$3:$B$203,E100)>0,0,1))","v":0},0,{"$f":"IF(M100=Lists!$J$6,IF(COUNTIF('Section 3'!$G$15:$G$24,Lists!$H$5)>0,0,1), 0)","v":0},{"$f":"IF(M100=Lists!$J$8,IF(COUNTIF('Section 3'!$G$15:$G$24,Lists!$H$6)>0,0,1), 0)","v":0},{"$f":"IF(M100=Lists!$J$9,IF(COUNTIF('Section 3'!$G$15:$G$24,Lists!$H$4)>0,0,1), 0)","v":0},{"$f":"IF(M100=Lists!$J$11,IF(COUNTIF('Section 3'!$G$15:$G$24,Lists!$H$3)>0,0,1),IF(M100=Lists!$J$10,IF(COUNTIF('Section 3'!$G$15:$G$24,Lists!$H$7)>0,0,1),0))","v":0},0,0]
[null,null,{"$f":"IF(F101=\"\",\"\",MAX($C$16:C100)+1)","v":""},null,null,"",{"$nulls":4},"",{"$nulls":4},"",null,"N",0,{"$f":"IF(C101=\"\",0,IF(OR(D101=0,E101=0,F101=0,G101=0,H101=0,I101=0,K101=0,K101=\"\",L101=0,M101=0,AND(L101=Lists!$I$3,J101=0)),1,0))","v":0},{"$f":"IF(E101=0,0,IF(COUNTIF(Lists!$B$3:$B$203,E101)>0,0,1))","v":0},0,{"$f":"IF(M101=Lists!$J$6,IF(COUNTIF('Section 3'!$G$15:$G$24,Lists!$H$5)>0,0,1), 0)","v":0},{"$f":"IF(M101=Lists!$J$8,IF(COUNTIF('Section 3'!$G$15:$G$24,Lists!$H$6)>0,0,1), 0)","v":0},{"$f":"IF(M101=Lists!$J$9,IF(COUNTIF('Section 3'!$G$15:$G$24,Lists!$H$4)>0,0,1), 0)","v":0},{"$f":"IF(M101=Lists!$J$11,IF(COUNTIF('Section 3'!$G$15:$G$24,Lists!$H$3)>0,0,1),IF(M101=Lists!$J$10,IF(COUNTIF('Section 3'!$G$15:$G$24,Lists!$H$7)>0,0,1),0))","v":0},0,0]
[null,null,{"$f":"IF(F102=\"\",\"\",MAX($C$16:C101)+1)","v":""},null,null,"",{"$nulls":4},"",{"$nulls":4},"",null,"N",0,{"$f":"IF(C102=\"\",0,IF(OR(D102=0,E102=0,F102=0,G102=0,H102=0,I102=0,K102=0,K102=\"\",L102=0,M102=0,AND(L102=Lists!$I$3,J102=0)),1,0))","v":0},{"$f":"IF(E102=0,0,IF(COUNTIF(Lists!$B$3:$B$203,E102)>0,0,1))","v":0},0,{"$f":"IF(M102=Lists!$J$6,IF(COUNTIF('Section 3'!$G$15:$G$24,Lists!$H$5)>0,0,1), 0)","v":0},{"$f":"IF(M102=Lists!$J$8,IF(COUNTIF('Section 3'!$G$15:$G$24,Lists!$H$6)>0,0,1), 0)","v":0},{"$f":"IF(M102=Lists!$J$9,IF(COUNTIF('Section 3'!$G$15:$G$24,Lists!$H$4)>0,0,1), 0)","v":0},{"$f":"IF(M102=Lists!$J$11,IF(COUNTIF('Section 3'!$G$15:$G$24,Lists!$H$3)>0,0,1),IF(M102=Lists!$J$10,IF(COUNTIF('Section 3'!$G$15:$G$24,Lists!$H$7)>0,0,1),0))","v":0},0,0]
[null,null,{"$f":"IF(F103=\"\",\"\",MAX($C$16:C102)+1)","v":""},null,null,"",{"$nulls":4},"",{"$nulls":4},"",null,"N",0,{"$f":"IF(C103=\"\",0,IF(OR(D103=0,E103=0,F103=0,G103=0,H103=0,I103=0,K103=0,K103=\"\",L103=0,M103=0,AND(L103=Lists!$I$3,J103=0)),1,0))","v":0},{"$f":"IF(E103=0,0,IF(COUNTIF(Lists!$B$3:$B$203,E103)>0,0,1))","v":0},0,{"$f":"IF(M103=Lists!$J$6,IF(COUNTIF('Section 3'!$G$15:$G$24,Lists!$H$5)>0,0,1), 0)","v":0},{"$f":"IF(M103=Lists!$J$8,IF(COUNTIF('Section 3'!$G$15:$G$24,Lists!$H$6)>0,0,1), 0)","v":0},{"$f":"IF(M103=Lists!$J$9,IF(COUNTIF('Section 3'!$G$15:$G$24,Lists!$H$4)>0,0,1), 0)","v":0},{"$f":"IF(M103=Lists!$J$11,IF(COUNTIF('Section 3'!$G$15:$G$24,Lists!$H$3)>0,0,1),IF(M103=Lists!$J$10,IF(COUNTIF('Section 3'!$G$15:$G$24,Lists!$H$7)>0,0,1),0))","v":0},0,0]
[null,null,{"$f":"IF(F104=\"\",\"\",MAX($C$16:C103)+1)","v":""},null,null,"",{"$nulls":4},"",{"$nulls":4},"",null,"N",0,{"$f":"IF(C104=\"\",0,IF(OR(D104=0,E104=0,F104=0,G104=0,H104=0,I104=0,K104=0,K104=\"\",L104=0,M104=0,AND(L104=Lists!$I$3,J104=0)),1,0))","v":0},{"$f":"IF(E104=0,0,IF(COUNTIF(Lists!$B$3:$B$203,E104)>0,0,1))","v":0},0,{"$f":"IF(M104=Lists!$J$6,IF(COUNTIF('Section 3'!$G$15:$G$24,Lists!$H$5)>0,0,1), 0)","v":0},{"$f":"IF(M104=Lists!$J$8,IF(COUNTIF('Section 3'!$G$15:$G$24,Lists!$H$6)>0,0,1), 0)","v":0},{"$f":"IF(M104=Lists!$J$9,IF(COUNTIF('Section 3'!$G$15:$G$24,Lists!$H$4)>0,0,1), 0)","v":0},{"$f":"IF(M104=Lists!$J$11,IF(COUNTIF('Section 3'!$G$15:$G$24,Lists!$H$3)>0,0,1),IF(M104=Lists!$J$10,IF(COUNTIF('Section 3'!$G$15:$G$24,Lists!$H$7)>0,0,1),0))","v":0},0,0]
[null,null,{"$f":"IF(F105=\"\",\"\",MAX($C$16:C104)+1)","v":""},null,null,"",{"$nulls":4},"",{"$nulls":4},"",null,"N",0,{"$f":"IF(C105=\"\",0,IF(OR(D105=0,E105=0,F105=0,G105=0,H105=0,I105=0,K105=0,K105=\"\",L105=0,M105=0,AND(L105=Lists!$I$3,J105=0)),1,0))","v":0},{"$f":"IF(E105=0,0,IF(COUNTIF(Lists!$B$3:$B$203,E105)>0,0,1))","v":0},0,{"$f":"IF(M105=Lists!$J$6,IF(COUNTIF('Section 3'!$G$15:$G$24,Lists!$H$5)>0,0,1), 0)","v":0},{"$f":"IF(M105=Lists!$J$8,IF(COUNTIF('Section 3'!$G$15:$G$24,Lists!$H$6)>0,0,1), 0)","v":0},{"$f":"IF(M105=Lists!$J$9,IF(COUNTIF('Section 3'!$G$15:$G$24,Lists!$H$4)>0,0,1), 0)","v":0},{"$f":"IF(M105=Lists!$J$11,IF(COUNTIF('Section 3'!$G$15:$G$24,Lists!$H$3)>0,0,1),IF(M105=Lists!$J$10,IF(COUNTIF('Section 3'!$G$15:$G$24,Lists!$H$7)>0,0,1),0))","v":0},0,0]
[null,null,{"$f":"IF(F106=\"\",\"\",MAX($C$16:C105)+1)","v":""},null,null,"",{"$nulls":4},"",{"$nulls":4},"",null,"N",0,{"$f":"IF(C106=\"\",0,IF(OR(D106=0,E106=0,F106=0,G106=0,H106=0,I106=0,K106=0,K106=\"\",L106=0,M106=0,AND(L106=Lists!$I$3,J106=0)),1,0))","v":0},{"$f":"IF(E106=0,0,IF(COUNTIF(Lists!$B$3:$B$203,E106)>0,0,1))","v":0},0,{"$f":"IF(M106=Lists!$J$6,IF(COUNTIF('Section 3'!$G$15:$G$24,Lists!$H$5)>0,0,1), 0)","v":0},{"$f":"IF(M106=Lists!$J$8,IF(COUNTIF('Section 3'!$G$15:$G$24,Lists!$H$6)>0,0,1), 0)","v":0},{"$f":"IF(M106=Lists!$J$9,IF(COUNTIF('Section 3'!$G$15:$G$24,Lists!$H$4)>0,0,1), 0)","v":0},{"$f":"IF(M106=Lists!$J$11,IF(COUNTIF('Section 3'!$G$15:$G$24,Lists!$H$3)>0,0,1),IF(M106=Lists!$J$10,IF(COUNTIF('Section 3'!$G$15:$G$24,Lists!$H$7)>0,0,1),0))","v":0},0,0]
[null,null,{"$f":"IF(F107=\"\",\"\",MAX($C$16:C106)+1)","v":""},null,null,"",{"$nulls":4},"",{"$nulls":4},"",null,"N",0,{"$f":"IF(C107=\"\",0,IF(OR(D107=0,E107=0,F107=0,G107=0,H107=0,I107=0,K107=0,K107=\"\",L107=0,M107=0,AND(L107=Lists!$I$3,J107=0)),1,0))","v":0},{"$f":"IF(E107=0,0,IF(COUNTIF(Lists!$B$3:$B$203,E107)>0,0,1))","v":0},0,{"$f":"IF(M107=Lists!$J$6,IF(COUNTIF('Section 3'!$G$15:$G$24,Lists!$H$5)>0,0,1), 0)","v":0},{"$f":"IF(M107=Lists!$J$8,IF(COUNTIF('Section 3'!$G$15:$G$24,Lists!$H$6)>0,0,1), 0)","v":0},{"$f":"IF(M107=Lists!$J$9,IF(COUNTIF('Section 3'!$G$15:$G$24,Lists!$H$4)>0,0,1), 0)","v":0},{"$f":"IF(M107=Lists!$J$11,IF(COUNTIF('Section 3'!$G$15:$G$24,Lists!$H$3)>0,0,1),IF(M107=Lists!$J$10,IF(COUNTIF('Section 3'!$G$15:$G$24,Lists!$H$7)>0,0,1),0))","v":0},0,0]
[null,null,{"$f":"IF(F108=\"\",\"\",MAX($C$16:C107)+1)","v":""},null,null,"",{"$nulls":4},"",{"$nulls":4},"",null,"N",0,{"$f":"IF(C108=\"\",0,IF(OR(D108=0,E108=0,F108=0,G108=0,H108=0,I108=0,K108=0,K108=\"\",L108=0,M108=0,AND(L108=Lists!$I$3,J108=0)),1,0))","v":0},{"$f":"IF(E108=0,0,IF(COUNTIF(Lists!$B$3:$B$203,E108)>0,0,1))","v":0},0,{"$f":"IF(M108=Lists!$J$6,IF(COUNTIF('Section 3'!$G$15:$G$24,Lists!$H$5)>0,0,1), 0)","v":0},{"$f":"IF(M108=Lists!$J$8,IF(COUNTIF('Section 3'!$G$15:$G$24,Lists!$H$6)>0,0,1), 0)","v":0},{"$f":"IF(M108=Lists!$J$9,IF(COUNTIF('Section 3'!$G$15:$G$24,Lists!$H$4)>0,0,1), 0)","v":0},{"$f":"IF(M108=Lists!$J$11,IF(COUNTIF('Section 3'!$G$15:$G$24,Lists!$H$3)>0,0,1),IF(M108=Lists!$J$10,IF(COUNTIF('Section 3'!$G$15:$G$24,Lists!$H$7)>0,0,1),0))","v":0},0,0]
[null,null,{"$f":"IF(F109=\"\",\"\",MAX($C$16:C108)+1)","v":""},null,null,"",{"$nulls":4},"",{"$nulls":4},"",null,"N",0,{"$f":"IF(C109=\"\",0,IF(OR(D109=0,E109=0,F109=0,G109=0,H109=0,I109=0,K109=0,K109=\"\",L109=0,M109=0,AND(L109=Lists!$I$3,J109=0)),1,0))","v":0},{"$f":"IF(E109=0,0,IF(COUNTIF(Lists!$B$3:$B$203,E109)>0,0,1))","v":0},0,{"$f":"IF(M109=Lists!$J$6,IF(COUNTIF('Section 3'!$G$15:$G$24,Lists!$H$5)>0,0,1), 0)","v":0},{"$f":"IF(M109=Lists!$J$8,IF(COUNTIF('Section 3'!$G$15:$G$24,Lists!$H$6)>0,0,1), 0)","v":0},{"$f":"IF(M109=Lists!$J$9,IF(COUNTIF('Section 3'!$G$15:$G$24,Lists!$H$4)>0,0,1), 0)","v":0},{"$f":"IF(M109=Lists!$J$11,IF(COUNTIF('Section 3'!$G$15:$G$24,Lists!$H$3)>0,0,1),IF(M109=Lists!$J$10,IF(COUNTIF('Section 3'!$G$15:$G$24,Lists!$H$7)>0,0,1),0))","v":0},0,0]
[null,null,{"$f":"IF(F110=\"\",\"\",MAX($C$16:C109)+1)","v":""},null,null,"",{"$nulls":4},"",{"$nulls":4},"",null,"N",0,{"$f":"IF(C110=\"\",0,IF(OR(D110=0,E110=0,F110=0,G110=0,H110=0,I110=0,K110=0,K110=\"\",L110=0,M110=0,AND(L110=Lists!$I$3,J110=0)),1,0))","v":0},{"$f":"IF(E110=0,0,IF(COUNTIF(Lists!$B$3:$B$203,E110)>0,0,1))","v":0},0,{"$f":"IF(M110=Lists!$J$6,IF(COUNTIF('Section 3'!$G$15:$G$24,Lists!$H$5)>0,0,1), 0)","v":0},{"$f":"IF(M110=Lists!$J$8,IF(COUNTIF('Section 3'!$G$15:$G$24,Lists!$H$6)>0,0,1), 0)","v":0},{"$f":"IF(M110=Lists!$J$9,IF(COUNTIF('Section 3'!$G$15:$G$24,Lists!$H$4)>0,0,1), 0)","v":0},{"$f":"IF(M110=Lists!$J$11,IF(COUNTIF('Section 3'!$G$15:$G$24,Lists!$H$3)>0,0,1),IF(M110=Lists!$J$10,IF(COUNTIF('Section 3'!$G$15:$G$24,Lists!$H$7)>0,0,1),0))","v":0},0,0]
[null,null,{"$f":"IF(F111=\"\",\"\",MAX($C$16:C110)+1)","v":""},null,null,"",{"$nulls":4},"",{"$nulls":4},"",null,{"$f":"IF(C111=\"\",\"N\",\"Y\")","v":"N"},{"$f":"IF(OR(D111=0,AND(D111>=StartDate,D111<=EndDate)),0,1)","v":0},{"$f":"IF(C111=\"\",0,IF(OR(D111=0,E111=0,F111=0,G111=0,H111=0,I111=0,K111=0,K111=\"\",L111=0,M111=0,AND(L111=Lists!$I$3,J111=0)),1,0))","v":0},{"$f":"IF(E111=0,0,IF(COUNTIF(Lists!$B$3:$B$203,E111)>0,0,1))","v":0},0,{"$f":"IF(M111=Lists!$J$6,IF(COUNTIF('Section 3'!$G$15:$G$24,Lists!$H$5)>0,0,1), 0)","v":0},{"$f":"IF(M111=Lists!$J$8,IF(COUNTIF('Section 3'!$G$15:$G$24,Lists!$H$6)>0,0,1), 0)","v":0},{"$f":"IF(M111=Lists!$J$9,IF(COUNTIF('Section 3'!$G$15:$G$24,Lists!$H$4)>0,0,1), 0)","v":0},{"$f":"IF(M111=Lists!$J$11,IF(COUNTIF('Section 3'!$G$15:$G$24,Lists!$H$3)>0,0,1),IF(M111=Lists!$J$10,IF(COUNTIF('Section 3'!$G$15:$G$24,Lists!$H$7)>0,0,1),0))","v":0},0,0]
[null,null,{"$f":"IF(F112=\"\",\"\",MAX($C$16:C111)+1)","v":""},null,null,"",{"$nulls":4},"",{"$nulls":4},"",null,"N",0,{"$f":"IF(C112=\"\",0,IF(OR(D112=0,E112=0,F112=0,G112=0,H112=0,I112=0,K112=0,K112=\"\",L112=0,M112=0,AND(L112=Lists!$I$3,J112=0)),1,0))","v":0},{"$f":"IF(E112=0,0,IF(COUNTIF(Lists!$B$3:$B$203,E112)>0,0,1))","v":0},0,{"$f":"IF(M112=Lists!$J$6,IF(COUNTIF('Section 3'!$G$15:$G$24,Lists!$H$5)>0,0,1), 0)","v":0},{"$f":"IF(M112=Lists!$J$8,IF(COUNTIF('Section 3'!$G$15:$G$24,Lists!$H$6)>0,0,1), 0)","v":0},{"$f":"IF(M112=Lists!$J$9,IF(COUNTIF('Section 3'!$G$15:$G$24,Lists!$H$4)>0,0,1), 0)","v":0},{"$f":"IF(M112=Lists!$J$11,IF(COUNTIF('Section 3'!$G$15:$G$24,Lists!$H$3)>0,0,1),IF(M112=Lists!$J$10,IF(COUNTIF('Section 3'!$G$15:$G$24,Lists!$H$7)>0,0,1),0))","v":0},0,0]
[null,null,{"$f":"IF(F113=\"\",\"\",MAX($C$16:C112)+1)","v":""},null,null,"",{"$nulls":4},"",{"$nulls":4},"",null,"N",0,{"$f":"IF(C113=\"\",0,IF(OR(D113=0,E113=0,F113=0,G113=0,H113=0,I113=0,K113=0,K113=\"\",L113=0,M113=0,AND(L113=Lists!$I$3,J113=0)),1,0))","v":0},{"$f":"IF(E113=0,0,IF(COUNTIF(Lists!$B$3:$B$203,E113)>0,0,1))","v":0},0,{"$f":"IF(M113=Lists!$J$6,IF(COUNTIF('Section 3'!$G$15:$G$24,Lists!$H$5)>0,0,1), 0)","v":0},{"$f":"IF(M113=Lists!$J$8,IF(COUNTIF('Section 3'!$G$15:$G$24,Lists!$H$6)>0,0,1), 0)","v":0},{"$f":"IF(M113=Lists!$J$9,IF(COUNTIF('Section 3'!$G$15:$G$24,Lists!$H$4)>0,0,1), 0)","v":0},{"$f":"IF(M113=Lists!$J$11,IF(COUNTIF('Section 3'!$G$15:$G$24,Lists!$H$3)>0,0,1),IF(M113=Lists!$J$10,IF(COUNTIF('Section 3'!$G$15:$G$24,Lists!$H$7)>0,0,1),0))","v":0},0,0]
[null,null,{"$f":"IF(F114=\"\",\"\",MAX($C$16:C113)+1)","v":""},null,null,"",{"$nulls":4},"",{"$nulls":4},"",null,"N",0,{"$f":"IF(C114=\"\",0,IF(OR(D114=0,E114=0,F114=0,G114=0,H114=0,I114=0,K114=0,K114=\"\",L114=0,M114=0,AND(L114=Lists!$I$3,J114=0)),1,0))","v":0},{"$f":"IF(E114=0,0,IF(COUNTIF(Lists!$B$3:$B$203,E114)>0,0,1))","v":0},0,{"$f":"IF(M114=Lists!$J$6,IF(COUNTIF('Section 3'!$G$15:$G$24,Lists!$H$5)>0,0,1), 0)","v":0},{"$f":"IF(M114=Lists!$J$8,IF(COUNTIF('Section 3'!$G$15:$G$24,Lists!$H$6)>0,0,1), 0)","v":0},{"$f":"IF(M114=Lists!$J$9,IF(COUNTIF('Section 3'!$G$15:$G$24,Lists!$H$4)>0,0,1), 0)","v":0},{"$f":"IF(M114=Lists!$J$11,IF(COUNTIF('Section 3'!$G$15:$G$24,Lists!$H$3)>0,0,1),IF(M114=Lists!$J$10,IF(COUNTIF('Section 3'!$G$15:$G$24,Lists!$H$7)>0,0,1),0))","v":0},0,0]
[{"$f":"IF(COUNTA(F45:F115)>0,0,1)","v":0},null,{"$f":"IF(F115=\"\",\"\",MAX($C$16:C114)+1)","v":""},null,null,"",{"$nulls":4},"",{"$nulls":4},"",null,{"$f":"IF(C115=\"\",\"N\",\"Y\")","v":"N"},{"$f":"IF(OR(D115=0,AND(D115>=StartDate,D115<=EndDate)),0,1)","v":0},{"$f":"IF(C115=\"\",0,IF(OR(D115=0,E115=0,F115=0,G115=0,H115=0,I115=0,K115=0,K115=\"\",L115=0,M115=0,AND(L115=Lists!$I$3,J115=0)),1,0))","v":0},{"$f":"IF(E115=0,0,IF(COUNTIF(Lists!$B$3:$B$203,E115)>0,0,1))","v":0},0,{"$f":"IF(M115=Lists!$J$6,IF(COUNTIF('Section 3'!$G$15:$G$24,Lists!$H$5)>0,0,1), 0)","v":0},{"$f":"IF(M115=Lists!$J$8,IF(COUNTIF('Section 3'!$G$15:$G$24,Lists!$H$6)>0,0,1), 0)","v":0},{"$f":"IF(M115=Lists!$J$9,IF(COUNTIF('Section 3'!$G$15:$G$24,Lists!$H$4)>0,0,1), 0)","v":0},{"$f":"IF(M115=Lists!$J$11,IF(COUNTIF('Section 3'!$G$15:$G$24,Lists!$H$3)>0,0,1),IF(M115=Lists!$J$10,IF(COUNTIF('Section 3'!$G$15:$G$24,Lists!$H$7)>0,0,1),0))","v":0},0,0]
[{"$nulls":4},"x",{"$nulls":6},"x","x"]
[{"$nulls":4},{"$f":"Lists!B3","v":"Afghanistan"},{"$nulls":6},{"$f":"Lists!I3","v":"New"},{"$f":"Lists!J5","v":"In-House Trans"}]
[{"$nulls":4},{"$f":"Lists!B4","v":"Albania"},{"$nulls":6},{"$f":"Lists!I4","v":"Heels"},{"$f":"Lists!J6","v":"2nd Party Trans"}]
[{"$nulls":4},{"$f":"Lists!B5","v":"Algeria"},{"$nulls":7},{"$f":"Lists!J7","v":"In-House Dest"}]
[{"$nulls":4},{"$f":"Lists!B6","v":"Andorra"},{"$nulls":7},{"$f":"Lists!J8","v":"2nd Party Dest"}]
[{"$nulls":4},{"$f":"Lists!B7","v":"Angola"},{"$nulls":7},{"$f":"Lists!J9","v":"QPS"}]
[{"$nulls":4},{"$f":"Lists!B8","v":"Antigua and Barbuda"},{"$nulls":7},{"$f":"Lists!J12","v":"Pre-Plant Critical Use"}]
[{"$nulls":4},{"$f":"Lists!B9","v":"Argentina"},{"$nulls":7},{"$f":"Lists!J13","v":"Post-Harvest Critical Use"}]
[{"$nulls":4},{"$f":"Lists!B10","v":"Armenia"},{"$nulls":7},{"$f":"Lists!J10","v":"Emergency Use"}]
[{"$nulls":4},{"$f":"Lists!B11","v":"Australia"},{"$nulls":7},{"$f":"Lists!J11","v":"Global Lab"}]
[{"$nulls":4},{"$f":"Lists!B12","v":"Austria"},{"$nulls":7},{"$f":"Lists!K5","v":"Future Shipment"}]
[{"$nulls":4},{"$f":"Lists!B13","v":"Azerbaijan"},{"$nulls":7},{"$f":"Lists!K6","v":"Transformation"}]
[{"$nulls":4},{"$f":"Lists!B14","v":"Bahamas"},{"$nulls":7},{"$f":"Lists!K7","v":"Destruction"}]
[{"$nulls":4},{"$f":"Lists!B15","v":"Bahrain"},{"$nulls":7},{"$f":"Lists!K8","v":"Non-Emissive Use "}]
[{"$nulls":4},{"$f":"Lists!B16","v":"Bangladesh"}]
[{"$nulls":4},{"$f":"Lists!B17","v":"Barbados"}]
[{"$nulls":4},{"$f":"Lists!B18","v":"Belarus"}]
[{"$nulls":4},{"$f":"Lists!B19","v":"Belgium"}]
[{"$nulls":4},{"$f":"Lists!B20","v":"Belize"}]
[{"$nulls":4},{"$f":"Lists!B21","v":"Benin"}]
[{"$nulls":4},{"$f":"Lists!B22","v":"Bermuda"}]
[{"$nulls":4},{"$f":"Lists!B23","v":"Bhutan"}]
[{"$nulls":4},{"$f":"Lists!B24","v":"Bolivia (Plurinational State of)"}]
[{"$nulls":4},{"$f":"Lists!B25","v":"Bosnia and Herzegovina"}]
[{"$nulls":4},{"$f":"Lists!B26","v":"Botswana"}]
[{"$nulls":4},{"$f":"Lists!B27","v":"Brazil"}]
[{"$nulls":4},{"$f":"Lists!B28","v":"Brunei Darussalam"}]
[{"$nulls":4},{"$f":"Lists!B29","v":"British Virgin Islands"}]
[{"$nulls":4},{"$f":"Lists!B30","v":"Bulgaria"}]
[{"$nulls":4},{"$f":"Lists!B31","v":"Burkina Faso"}]
[{"$nulls":4},{"$f":"Lists!B32","v":"Burundi"}]
[{"$nulls":4},{"$f":"Lists!B33","v":"Cambodia"}]
[{"$nulls":4},{"$f":"Lists!B34","v":"Cameroon"}]
[{"$nulls":4},{"$f":"Lists!B35","v":"Canada"}]
[{"$nulls":4},{"$f":"Lists!B36","v":"Cape Verde"}]
[{"$nulls":4},{"$f":"Lists!B37","v":"Central African Republic"}]
[{"$nulls":4},{"$f":"Lists!B38","v":"Chad"}]
[{"$nulls":4},{"$f":"Lists!B39","v":"Chile"}]
[{"$nulls":4},{"$f":"Lists!B40","v":"China"}]
[{"$nulls":4},{"$f":"Lists!B41","v":"Colombia"}]
[{"$nulls":4},{"$f":"Lists!B42","v":"Comoros"}]
[{"$nulls":4},{"$f":"Lists!B43","v":"Congo"}]
[{"$nulls":4},{"$f":"Lists!B44","v":"Cook Islands"}]
[{"$nulls":4},{"$f":"Lists!B45","v":"Costa Rica"}]
[{"$nulls":4},{"$f":"Lists!B46","v":"Côte d'Ivoire"}]
[{"$nulls":4},{"$f":"Lists!B47","v":"Croatia"}]
[{"$nulls":4},{"$f":"Lists!B48","v":"Cuba"}]
[{"$nulls":4},{"$f":"Lists!B49","v":"Cyprus"}]
[{"$nulls":4},{"$f":"Lists!B50","v":"Czech Republic"}]
[{"$nulls":4},{"$f":"Lists!B51","v":"Democratic Republic of the Congo"}]
[{"$nulls":4},{"$f":"Lists!B52","v":"Denmark"}]
[{"$nulls":4},{"$f":"Lists!B53","v":"Djibouti"}]
[{"$nulls":4},{"$f":"Lists!B54","v":"Dominica"}]
[{"$nulls":4},{"$f":"Lists!B55","v":"Dominican Republic"}]
[{"$nulls":4},{"$f":"Lists!B56","v":"Ecuador"}]
[{"$nulls":4},{"$f":"Lists!B57","v":"Egypt"}]
[{"$nulls":4},{"$f":"Lists!B58","v":"El Salvador"}]
[{"$nulls":4},{"$f":"Lists!B59","v":"Equatorial Guinea"}]
[{"$nulls":4},{"$f":"Lists!B60","v":"Eritrea"}]
[{"$nulls":4},{"$f":"Lists!B61","v":"Estonia"}]
[{"$nulls":4},{"$f":"Lists!B62","v":"Ethiopia"}]
[{"$nulls":4},{"$f":"Lists!B63","v":"European Union"}]
[{"$nulls":4},{"$f":"Lists!B64","v":"Fiji"}]
[{"$nulls":4},{"$f":"Lists!B65","v":"Finland"}]
[{"$nulls":4},{"$f":"Lists!B66","v":"France"}]
[{"$nulls":4},{"$f":"Lists!B67","v":"Gabon"}]
[{"$nulls":4},{"$f":"Lists!B68","v":"Gambia"}]
[{"$nulls":4},{"$f":"Lists!B69","v":"Georgia"}]
[{"$nulls":4},{"$f":"Lists!B70","v":"Germany"}]
[{"$nulls":4},{"$f":"Lists!B71","v":"Ghana"}]
[{"$nulls":4},{"$f":"Lists!B72","v":"Greece"}]
[{"$nulls":4},{"$f":"Lists!B73","v":"Grenada"}]
[{"$nulls":4},{"$f":"Lists!B74","v":"Guatemala"}]
[{"$nulls":4},{"$f":"Lists!B75","v":"Guinea"}]
[{"$nulls":4},{"$f":"Lists!B76","v":"Guinea-Bissau"}]
[{"$nulls":4},{"$f":"Lists!B77","v":"Guyana"}]
[{"$nulls":4},{"$f":"Lists!B78","v":"Haiti"}]
[{"$nulls":4},{"$f":"Lists!B79","v":"Holy See"}]
[{"$nulls":4},{"$f":"Lists!B80","v":"Honduras"}]
[{"$nulls":4},{"$f":"Lists!B81","v":"Hong Kong"}]
[{"$nulls":4},{"$f":"Lists!B82","v":"Hungary"}]
[{"$nulls":4},{"$f":"Lists!B83","v":"Iceland"}]
[{"$nulls":4},{"$f":"Lists!B84","v":"India"}]
[{"$nulls":4},{"$f":"Lists!B85","v":"Indonesia"}]
[{"$nulls":4},{"$f":"Lists!B86","v":"Iran (Islamic Republic of)"}]
[{"$nulls":4},{"$f":"Lists!B87","v":"Iraq"}]
[{"$nulls":4},{"$f":"Lists!B88","v":"Ireland"}]
[{"$nulls":4},{"$f":"Lists!B89","v":"Israel"}]
[{"$nulls":4},{"$f":"Lists!B90","v":"Italy"}]
[{"$nulls":4},{"$f":"Lists!B91","v":"Jamaica"}]
[{"$nulls":4},{"$f":"Lists!B92","v":"Japan"}]
[{"$nulls":4},{"$f":"Lists!B93","v":"Jordan"}]
[{"$nulls":4},{"$f":"Lists!B94","v":"Kazakhstan"}]
[{"$nulls":4},{"$f":"Lists!B95","v":"Kenya"}]
[{"$nulls":4},{"$f":"Lists!B96","v":"Kiribati"}]
[{"$nulls":4},{"$f":"Lists!B97","v":"Kuwait"}]
[{"$nulls":4},{"$f":"Lists!B98","v":"Kyrgyzstan"}]
[{"$nulls":4},{"$f":"Lists!B99","v":"Lao People's Democratic Republic"}]
[{"$nulls":4},{"$f":"Lists!B100","v":"Latvia"}]
[{"$nulls":4},{"$f":"Lists!B101","v":"Lebanon"}]
[{"$nulls":4},{"$f":"Lists!B102","v":"Lesotho"}]
[{"$nulls":4},{"$f":"Lists!B103","v":"Liberia"}]
[{"$nulls":4},{"$f":"Lists!B104","v":"Libya"}]
[{"$nulls":4},{"$f":"Lists!B105","v":"Liechtenstein"}]
[{"$nulls":4},{"$f":"Lists!B106","v":"Lithuania"}]
[{"$nulls":4},{"$f":"Lists!B107","v":"Luxembourg"}]
[{"$nulls":4},{"$f":"Lists!B108","v":"Madagascar"}]
[{"$nulls":4},{"$f":"Lists!B109","v":"Malawi"}]
[{"$nulls":4},{"$f":"Lists!B110","v":"Malaysia"}]
[{"$nulls":4},{"$f":"Lists!B111","v":"Maldives"}]
[{"$nulls":4},{"$f":"Lists!B112","v":"Mali"}]
[{"$nulls":4},{"$f":"Lists!B113","v":"Malta"}]
[{"$nulls":4},{"$f":"Lists!B114","v":"Marshall Islands"}]
[{"$nulls":4},{"$f":"Lists!B115","v":"Mauritania"}]
[{"$nulls":4},{"$f":"Lists!B116","v":"Mauritius"}]
[{"$nulls":4},{"$f":"Lists!B117","v":"Mexico"}]
[{"$nulls":4},{"$f":"Lists!B118","v":"Micronesia (Federated States of)"}]
[{"$nulls":4},{"$f":"Lists!B119","v":"Monaco"}]
[{"$nulls":4},{"$f":"Lists!B120","v":"Mongolia"}]
[{"$nulls":4},{"$f":"Lists!B121","v":"Montenegro"}]
[{"$nulls":4},{"$f":"Lists!B122","v":"Morocco"}]
[{"$nulls":4},{"$f":"Lists!B123","v":"Mozambique"}]
[{"$nulls":4},{"$f":"Lists!B124","v":"Myanmar"}]
[{"$nulls":4},{"$f":"Lists!B125","v":"Namibia"}]
[{"$nulls":4},{"$f":"Lists!B126","v":"Nauru"}]
[{"$nulls":4},{"$f":"Lists!B127","v":"Nepal"}]
[{"$nulls":4},{"$f":"Lists!B128","v":"Netherlands"}]
[{"$nulls":4},{"$f":"Lists!B129","v":"New Zealand"}]
[{"$nulls":4},{"$f":"Lists!B130","v":"Nicaragua"}]
[{"$nulls":4},{"$f":"Lists!B131","v":"Niger"}]
[{"$nulls":4},{"$f":"Lists!B132","v":"Nigeria"}]
[{"$nulls":4},{"$f":"Lists!B133","v":"Niue"}]
[{"$nulls":4},{"$f":"Lists!B134","v":"North Korea (Democratic People's Republic of Korea)"}]
[{"$nulls":4},{"$f":"Lists!B135","v":"Norway"}]
[{"$nulls":4},{"$f":"Lists!B136","v":"Oman"}]
[{"$nulls":4},{"$f":"Lists!B137","v":"Pakistan"}]
[{"$nulls":4},{"$f":"Lists!B138","v":"Palau"}]
[{"$nulls":4},{"$f":"Lists!B139","v":"Panama"}]
[{"$nulls":4},{"$f":"Lists!B140","v":"Papua New Guinea"}]
[{"$nulls":4},{"$f":"Lists!B141","v":"Paraguay"}]
[{"$nulls":4},{"$f":"Lists!B142","v":"Peru"}]
[{"$nulls":4},{"$f":"Lists!B143","v":"Philippines"}]
[{"$nulls":4},{"$f":"Lists!B144","v":"Poland"}]
[{"$nulls":4},{"$f":"Lists!B145","v":"Portugal"}]
[{"$nulls":4},{"$f":"Lists!B146","v":"Qatar"}]
[{"$nulls":4},{"$f":"Lists!B147","v":"Republic of Moldova"}]
[{"$nulls":4},{"$f":"Lists!B148","v":"Romania"}]
[{"$nulls":4},{"$f":"Lists!B149","v":"Russian Federation"}]
[{"$nulls":4},{"$f":"Lists!B150","v":"Rwanda"}]
[{"$nulls":4},{"$f":"Lists!B151","v":"Saint Kitts and Nevis"}]
[{"$nulls":4},{"$f":"Lists!B152","v":"Saint Lucia"}]
[{"$nulls":4},{"$f":"Lists!B153","v":"Saint Vincent and the Grenadines"}]
[{"$nulls":4},{"$f":"Lists!B154","v":"Samoa"}]
[{"$nulls":4},{"$f":"Lists!B155","v":"San Marino"}]
[{"$nulls":4},{"$f":"Lists!B156","v":"Sao Tome and Principe"}]
[{"$nulls":4},{"$f":"Lists!B157","v":"Saudi Arabia"}]
[{"$nulls":4},{"$f":"Lists!B158","v":"Senegal"}]
[{"$nulls":4},{"$f":"Lists!B159","v":"Serbia"}]
[{"$nulls":4},{"$f":"Lists!B160","v":"Seychelles"}]
[{"$nulls":4},{"$f":"Lists!B161","v":"Sierra Leone"}]
[{"$nulls":4},{"$f":"Lists!B162","v":"Singapore"}]
[{"$nulls":4},{"$f":"Lists!B163","v":"Slovakia"}]
[{"$nulls":4},{"$f":"Lists!B164","v":"Slovenia"}]
[{"$nulls":4},{"$f":"Lists!B165","v":"Solomon Islands"}]
[{"$nulls":4},{"$f":"Lists!B166","v":"Somalia (Federal Republic of)"}]
[{"$nulls":4},{"$f":"Lists!B167","v":"South Africa"}]
[{"$nulls":4},{"$f":"Lists!B168","v":"South Korea (Republic of Korea)"}]
[{"$nulls":4},{"$f":"Lists!B169","v":"South Sudan"}]
[{"$nulls":4},{"$f":"Lists!B170","v":"Spain"}]
[{"$nulls":4},{"$f":"Lists!B171","v":"Sri Lanka"}]
[{"$nulls":4},{"$f":"Lists!B172","v":"Sudan"}]
[{"$nulls":4},{"$f":"Lists!B173","v":"Suriname"}]
[{"$nulls":4},{"$f":"Lists!B174","v":"Swaziland"}]
[{"$nulls":4},{"$f":"Lists!B175","v":"Sweden"}]
[{"$nulls":4},{"$f":"Lists!B176","v":"Switzerland"}]
[{"$nulls":4},{"$f":"Lists!B177","v":"Syrian Arab Republic"}]
[{"$nulls":4},{"$f":"Lists!B178","v":"Tahiti"}]
[{"$nulls":4},{"$f":"Lists!B179","v":"Taiwan"}]
[{"$nulls":4},{"$f":"Lists!B180","v":"Tajikistan"}]
[{"$nulls":4},{"$f":"Lists!B181","v":"Thailand"}]
[{"$nulls":4},{"$f":"Lists!B182","v":"The Former Yugoslav Republic of Macedonia"}]
[{"$nulls":4},{"$f":"Lists!B183","v":"Timor-Leste"}]
[{"$nulls":4},{"$f":"Lists!B184","v":"Togo"}]
[{"$nulls":4},{"$f":"Lists!B185","v":"Tonga"}]
[{"$nulls":4},{"$f":"Lists!B186","v":"Trinidad and Tobago"}]
[{"$nulls":4},{"$f":"Lists!B187","v":"Tunisia"}]
[{"$nulls":4},{"$f":"Lists!B188","v":"Turkey"}]
[{"$nulls":4},{"$f":"Lists!B189","v":"Turkmenistan"}]
[{"$nulls":4},{"$f":"Lists!B190","v":"Tuvalu"}]
[{"$nulls":4},{"$f":"Lists!B191","v":"Uganda"}]
[{"$nulls":4},{"$f":"Lists!B192","v":"Ukraine"}]
[{"$nulls":4},{"$f":"Lists!B193","v":"United Arab Emirates"}]
[{"$nulls":4},{"$f":"Lists!B194","v":"United Kingdom of Great Britain and Northern Ireland"}]
[{"$nulls":4},{"$f":"Lists!B195","v":"United Republic of Tanzania"}]
[{"$nulls":4},{"$f":"Lists!#REF!","v":{"$error":"#REF!"}}]
[{"$nulls":4},{"$f":"Lists!B196","v":"Uruguay"}]
[{"$nulls":4},{"$f":"Lists!B197","v":"Uzbekistan"}]

{"sheet":"Section 3","index":3,"n_rows":32,"n_cols":17,"rows_kept":32,"merged":[[8,3,8,6],[9,3,9,6],[10,3,10,6],[11,3,11,4],[12,3,12,4],[13,3,13,4],[14,3,14,4],[15,3,15,4],[16,3,16,4],[17,3,17,4],[18,3,18,4],[19,3,19,4],[20,3,20,4],[21,3,21,4],[22,3,22,4],[23,3,23,4]]}
[]
[{"$nulls":3},"U.S. Environmental Protection Agency"]
[{"$nulls":3},"Methyl Bromide Importer Quarterly Report"]
[]
[{"$nulls":3},"Company Name:",{"$f":"IF('Section 1'!D9=0,\"\",'Section 1'!D9)","v":""}]
[{"$nulls":3},"Reporting Period:",{"$f":"IF(OR('Section 1'!D11=0,'Section 1'!D12=0),\"\",\"Quarter \"&'Section 1'!D12&\", \"&'Section 1'!D11)","v":""}]
[]
[{"$nulls":3},"Section 3: Shipment/Sales Data"]
[{"$nulls":3},"Identify the recipient company(s) of the methyl bromide imported for second party transformation, second party destruction, QPS, global lab, and/or emergency uses, and the amount shipped to or purchased by each recipient company during the quarter. "]
[{"$nulls":3},"Note: Due to a potential time lag between the date of import and the date of shipment, it is recognized that for a given quarter the information in Section 3 may not match the information reported in Section 2 for second party transformation, second party destruction, and QPS; however, it is expected that all material imported for second party transformation, second party destruction, and QPS will eventually be shipped to a second party and must be reported as such in the applicable quarterly report. "]
[{"$nulls":3},"As a reminder, a copy of the transformation verification, destruction verification, QPS certification, and/or essential use certification from each second party for whom material was produced must be provided to EPA along with the submission of this report."]
[{"$nulls":3},"Recipient Company Name",null,"Quantity","Purpose"]
[{"$nulls":3},"Text",null,"kg","Selection"]
[{"$nulls":3},"Company A",null,{"v":500,"d":"500.00"},"Global Lab",null,null,"ActiveRow?","Sec 2 Global Lab/EU Inclusion","Sec 2 Inclusion TransDestrQPS","2nd party trans","2nd part dest","QPS","Valid Purpose","Completeness check"]
[{"$f":"IF(D15=0,\"\",1)","v":""},{"$nulls":8},{"$f":"IF(A15=\"\",\"N\",\"Y\")","v":"N"},{"$f":"IF(G15=Lists!$H$3,IF(COUNTIF('Section 2'!$M$16:$M$115,Lists!$J$11)>0,0,1),IF(G15=Lists!$H$7,IF(COUNTIF('Section 2'!$M$16:$M$115,Lists!$J$10)>0,0,1),0))","v":0},{"$f":"SUM(M15:O15)","v":0},{"$f":"IF(G15=Lists!$H$5,IF(COUNTIF('Section 2'!$M$16:$M$115,Lists!$J$6)>0,0,1), 0)","v":0},{"$f":"IF(G15=Lists!$H$6,IF(COUNTIF('Section 2'!$M$16:$M$115,Lists!$J$8)>0,0,1), 0)","v":0},{"$f":"IF(G15=Lists!$H$4,IF(COUNTIF('Section 2'!$M$16:$M$115,Lists!$J$9)>0,0,1), 0)","v":0},{"$f":"IF(G15=0,0,IF(COUNTIF(MeBrPurpose,G15)>0,0,1))","v":0},{"$f":"IF(D15=\"\",0,IF(OR(F15=0,G15=0),1,0))","v":0}]
[{"$f":"IF(D16=0,\"\",MAX($A$15:A15)+1)","v":""},{"$nulls":8},{"$f":"IF(A16=\"\",\"N\",\"Y\")","v":"N"},{"$f":"IF(G16=Lists!$H$3,IF(COUNTIF('Section 2'!$M$16:$M$115,Lists!$J$11)>0,0,1),IF(G16=Lists!$H$7,IF(COUNTIF('Section 2'!$M$16:$M$115,Lists!$J$10)>0,0,1),0))","v":0},{"$f":"SUM(M16:O16)","v":0},{"$f":"IF(G16=Lists!$H$5,IF(COUNTIF('Section 2'!$M$16:$M$115,Lists!$J$6)>0,0,1), 0)","v":0},{"$f":"IF(G16=Lists!$H$6,IF(COUNTIF('Section 2'!$M$16:$M$115,Lists!$J$8)>0,0,1), 0)","v":0},{"$f":"IF(G16=Lists!$H$4,IF(COUNTIF('Section 2'!$M$16:$M$115,Lists!$J$9)>0,0,1), 0)","v":0},0,{"$f":"IF(D16=\"\",0,IF(OR(F16=0,G16=0),1,0))","v":0}]
[{"$f":"IF(D17=0,\"\",MAX($A$15:A16)+1)","v":""},{"$nulls":8},"N",{"$f":"IF(G17=Lists!$H$3,IF(COUNTIF('Section 2'!$M$16:$M$115,Lists!$J$11)>0,0,1),IF(G17=Lists!$H$7,IF(COUNTIF('Section 2'!$M$16:$M$115,Lists!$J$10)>0,0,1),0))","v":0},0,{"$f":"IF(G17=Lists!$H$5,IF(COUNTIF('Section 2'!$M$16:$M$115,Lists!$J$6)>0,0,1), 0)","v":0},{"$f":"IF(G17=Lists!$H$6,IF(COUNTIF('Section 2'!$M$16:$M$115,Lists!$J$8)>0,0,1), 0)","v":0},{"$f":"IF(G17=Lists!$H$4,IF(COUNTIF('Section 2'!$M$16:$M$115,Lists!$J$9)>0,0,1), 0)","v":0},0,0]
[{"$f":"IF(D18=0,\"\",MAX($A$15:A17)+1)","v":""},{"$nulls":8},"N",{"$f":"IF(G18=Lists!$H$3,IF(COUNTIF('Section 2'!$M$16:$M$115,Lists!$J$11)>0,0,1),IF(G18=Lists!$H$7,IF(COUNTIF('Section 2'!$M$16:$M$115,Lists!$J$10)>0,0,1),0))","v":0},0,{"$f":"IF(G18=Lists!$H$5,IF(COUNTIF('Section 2'!$M$16:$M$115,Lists!$J$6)>0,0,1), 0)","v":0},{"$f":"IF(G18=Lists!$H$6,IF(COUNTIF('Section 2'!$M$16:$M$115,Lists!$J$8)>0,0,1), 0)","v":0},{"$f":"IF(G18=Lists!$H$4,IF(COUNTIF('Section 2'!$M$16:$M$115,Lists!$J$9)>0,0,1), 0)","v":0},0,0]
[{"$f":"IF(D19=0,\"\",MAX($A$15:A18)+1)","v":""},{"$nulls":8},"N",{"$f":"IF(G19=Lists!$H$3,IF(COUNTIF('Section 2'!$M$16:$M$115,Lists!$J$11)>0,0,1),IF(G19=Lists!$H$7,IF(COUNTIF('Section 2'!$M$16:$M$115,Lists!$J$10)>0,0,1),0))","v":0},0,{"$f":"IF(G19=Lists!$H$5,IF(COUNTIF('Section 2'!$M$16:$M$115,Lists!$J$6)>0,0,1), 0)","v":0},{"$f":"IF(G19=Lists!$H$6,IF(COUNTIF('Section 2'!$M$16:$M$115,Lists!$J$8)>0,0,1), 0)","v":0},{"$f":"IF(G19=Lists!$H$4,IF(COUNTIF('Section 2'!$M$16:$M$115,Lists!$J$9)>0,0,1), 0)","v":0},0,0]
[{"$f":"IF(D20=0,\"\",MAX($A$15:A19)+1)","v":""},{"$nulls":8},"N",{"$f":"IF(G20=Lists!$H$3,IF(COUNTIF('Section 2'!$M$16:$M$115,Lists!$J$11)>0,0,1),IF(G20=Lists!$H$7,IF(COUNTIF('Section 2'!$M$16:$M$115,Lists!$J$10)>0,0,1),0))","v":0},0,{"$f":"IF(G20=Lists!$H$5,IF(COUNTIF('Section 2'!$M$16:$M$115,Lists!$J$6)>0,0,1), 0)","v":0},{"$f":"IF(G20=Lists!$H$6,IF(COUNTIF('Section 2'!$M$16:$M$115,Lists!$J$8)>0,0,1), 0)","v":0},{"$f":"IF(G20=Lists!$H$4,IF(COUNTIF('Section 2'!$M$16:$M$115,Lists!$J$9)>0,0,1), 0)","v":0},0,0]
[{"$f":"IF(D21=0,\"\",MAX($A$15:A20)+1)","v":""},{"$nulls":8},"N",{"$f":"IF(G21=Lists!$H$3,IF(COUNTIF('Section 2'!$M$16:$M$115,Lists!$J$11)>0,0,1),IF(G21=Lists!$H$7,IF(COUNTIF('Section 2'!$M$16:$M$115,Lists!$J$10)>0,0,1),0))","v":0},0,{"$f":"IF(G21=Lists!$H$5,IF(COUNTIF('Section 2'!$M$16:$M$115,Lists!$J$6)>0,0,1), 0)","v":0},{"$f":"IF(G21=Lists!$H$6,IF(COUNTIF('Section 2'!$M$16:$M$115,Lists!$J$8)>0,0,1), 0)","v":0},{"$f":"IF(G21=Lists!$H$4,IF(COUNTIF('Section 2'!$M$16:$M$115,Lists!$J$9)>0,0,1), 0)","v":0},0,0]
[{"$f":"IF(D22=0,\"\",MAX($A$15:A21)+1)","v":""},{"$nulls":8},"N",{"$f":"IF(G22=Lists!$H$3,IF(COUNTIF('Section 2'!$M$16:$M$115,Lists!$J$11)>0,0,1),IF(G22=Lists!$H$7,IF(COUNTIF('Section 2'!$M$16:$M$115,Lists!$J$10)>0,0,1),0))","v":0},0,{"$f":"IF(G22=Lists!$H$5,IF(COUNTIF('Section 2'!$M$16:$M$115,Lists!$J$6)>0,0,1), 0)","v":0},{"$f":"IF(G22=Lists!$H$6,IF(COUNTIF('Section 2'!$M$16:$M$115,Lists!$J$8)>0,0,1), 0)","v":0},{"$f":"IF(G22=Lists!$H$4,IF(COUNTIF('Section 2'!$M$16:$M$115,Lists!$J$9)>0,0,1), 0)","v":0},0,0]
[{"$f":"IF(D23=0,\"\",MAX($A$15:A22)+1)","v":""},{"$nulls":8},"N",{"$f":"IF(G23=Lists!$H$3,IF(COUNTIF('Section 2'!$M$16:$M$115,Lists!$J$11)>0,0,1),IF(G23=Lists!$H$7,IF(COUNTIF('Section 2'!$M$16:$M$115,Lists!$J$10)>0,0,1),0))","v":0},0,{"$f":"IF(G23=Lists!$H$5,IF(COUNTIF('Section 2'!$M$16:$M$115,Lists!$J$6)>0,0,1), 0)","v":0},{"$f":"IF(G23=Lists!$H$6,IF(COUNTIF('Section 2'!$M$16:$M$115,Lists!$J$8)>0,0,1), 0)","v":0},{"$f":"IF(G23=Lists!$H$4,IF(COUNTIF('Section 2'!$M$16:$M$115,Lists!$J$9)>0,0,1), 0)","v":0},0,0]
[{"$f":"IF(D24=0,\"\",MAX($A$15:A23)+1)","v":""},{"$nulls":8},"N",{"$f":"IF(G24=Lists!$H$3,IF(COUNTIF('Section 2'!$M$16:$M$115,Lists!$J$11)>0,0,1),IF(G24=Lists!$H$7,IF(COUNTIF('Section 2'!$M$16:$M$115,Lists!$J$10)>0,0,1),0))","v":0},0,{"$f":"IF(G24=Lists!$H$5,IF(COUNTIF('Section 2'!$M$16:$M$115,Lists!$J$6)>0,0,1), 0)","v":0},{"$f":"IF(G24=Lists!$H$6,IF(COUNTIF('Section 2'!$M$16:$M$115,Lists!$J$8)>0,0,1), 0)","v":0},{"$f":"IF(G24=Lists!$H$4,IF(COUNTIF('Section 2'!$M$16:$M$115,Lists!$J$9)>0,0,1), 0)","v":0},0,0]
[{"$nulls":12},{"$f":"IF(G25=Lists!$H$5,IF(COUNTIFS('Section 2'!$F$16:$F$115,D25,'Section 2'!$M$16:$M$115,Lists!$J$6)>0,0,1), 0)","v":0},{"$f":"IF(G25=Lists!$H$5,IF(COUNTIFS('Section 2'!$F$16:$F$115,D25,'Section 2'!$M$16:$M$115,Lists!$J$6)>0,0,1), 0)","v":0},{"$f":"IF(G25=Lists!$H$4,IF(COUNTIFS('Section 2'!$F$16:$F$115,D25,'Section 2'!$M$16:$M$115,Lists!$J$9)>0,0,1), 0)","v":0},0]
[{"$nulls":3},0,{"$nulls":8},{"$f":"IF(G26=Lists!$H$5,IF(COUNTIFS('Section 2'!$F$16:$F$115,D26,'Section 2'!$M$16:$M$115,Lists!$J$6)>0,0,1), 0)","v":0},{"$f":"IF(G26=Lists!$H$5,IF(COUNTIFS('Section 2'!$F$16:$F$115,D26,'Section 2'!$M$16:$M$115,Lists!$J$6)>0,0,1), 0)","v":0},{"$f":"IF(G26=Lists!$H$4,IF(COUNTIFS('Section 2'!$F$16:$F$115,D26,'Section 2'!$M$16:$M$115,Lists!$J$9)>0,0,1), 0)","v":0},0]
[{"$nulls":6},"x"]
[{"$nulls":6},{"$f":"Lists!H3","v":"Global Lab"}]
[{"$nulls":6},{"$f":"Lists!H4","v":"QPS"}]
[{"$nulls":6},{"$f":"Lists!H5","v":"Transformation"}]
[{"$nulls":6},{"$f":"Lists!H6","v":"Destruction"}]
[{"$nulls":6},{"$f":"Lists!H7","v":"Emergency Use"}]

{"sheet":"Section 4","index":4,"n_rows":17,"n_cols":13,"rows_kept":17,"hidden":true,"merged":[[8,3,8,7],[11,3,11,7],[12,3,12,4],[13,3,13,4],[14,3,14,4],[15,3,15,4],[16,3,16,4]]}
[]
[{"$nulls":3},"U.S. Environmental Protection Agency"]
[{"$nulls":3},"Methyl Bromide Importer Quarterly Report"]
[]
[{"$nulls":3},"Company Name:",{"$f":"IF('Section 1'!D9=0,\"\",'Section 1'!D9)","v":""}]
[{"$nulls":3},"Reporting Period:",{"$f":"IF(OR('Section 1'!D11=0,'Section 1'!D12=0),\"\",\"Quarter \"&'Section 1'!D12&\", \"&'Section 1'!D11)","v":""}]
[]
[{"$nulls":3},"Section 4: Importers Critical Use Year-End Inventory (Quarter 4 Only)"]
[{"$nulls":3},"Identify the amount of critical use methyl bromide held by your company at the end of the control period.",{"$nulls":7},"Q4 Inventory Check","Q1-Q3 Completeness Check"]
[{"$nulls":4},"  kg owned by reporting company",{"$nulls":6},"IF(ReportQtr=4,IF(ISBLANK(D10),1,0),0)",{"$f":"IF(ReportQtr<4,IF(D10<>0,1,0),0)","v":0}]
[]
[{"$nulls":3},"Identify the name(s) of company(s) for which critical use methyl bromide is being held by the reporting entity, and the associated amounts held for each (excluding end-users)."]
[{"$nulls":3},"Company Name",null,"Pre-Plant ","Post-Harvest "]
[{"$nulls":3},"Text",null,"kg","kg",{"$nulls":3},"ActiveRow","Q4 Completeness Check","Q1-Q3 Completeness Check"]
[{"$f":"IF(D15=0,\"\",1)","v":""},{"$nulls":9},{"$f":"IF(D15=\"\",\"N\",\"Y\")","v":"N"},{"$f":"IF(K15=\"y\",IF(AND(ISBLANK(F15),ISBLANK(G15)),1,0),0)","v":0},{"$f":"IF(ReportQtr<4,IF(OR(K15=\"Y\",F15>0,G15>0),1,0),0)","v":0}]
[{"$f":"IF(D16=0,\"\",MAX($A$15:A15)+1)","v":""},{"$nulls":9},{"$f":"IF(D16=\"\",\"N\",\"Y\")","v":"N"},{"$f":"IF(K16=\"y\",IF(AND(ISBLANK(F16),ISBLANK(G16)),1,0),0)","v":0},{"$f":"IF(ReportQtr<4,IF(OR(K16=\"Y\",F16>0,G16>0),1,0),0)","v":0}]
[{"$f":"IF(D17=0,\"\",MAX($A$15:A16)+1)","v":""},{"$nulls":9},{"$f":"IF(D17=\"\",\"N\",\"Y\")","v":"N"},{"$f":"IF(K17=\"y\",IF(AND(ISBLANK(F17),ISBLANK(G17)),1,0),0)","v":0},{"$f":"IF(ReportQtr<4,IF(OR(K17=\"Y\",F17>0,G17>0),1,0),0)","v":0}]

{"sheet":"Summary","index":5,"n_rows":18,"n_cols":15,"rows_kept":18,"merged":[[8,3,8,14],[9,3,10,3],[9,4,9,13],[9,14,10,14],[14,3,14,7],[15,3,16,3],[15,4,15,7],[16,4,16,5],[16,6,16,7],[17,4,17,5],[17,6,17,7]]}
[]
[{"$nulls":3},"U.S. Environmental Protection Agency"]
[{"$nulls":3},"Methyl Bromide Importer Quarterly Report"]
[]
[{"$nulls":3},"Company Name:",{"$f":"IF('Section 1'!D9=0,\"\",'Section 1'!D9)","v":""}]
[{"$nulls":3},"Reporting Period:",{"$f":"IF(OR('Section 1'!D11=0,'Section 1'!D12=0),\"\",\"Quarter \"&'Section 1'!D12&\", \"&'Section 1'!D11)","v":""}]
[]
[{"$nulls":3},"Import Totals"]
[{"$nulls":3},"The values in the table below are calculated based on data entered in Section 2.  If the totals appear to be incorrect, please return to Section 2 to review your data."]
[{"$nulls":3},"Chemical Name","New Imports (kg)",{"$nulls":9},"Total Heel Imports (kg)"]
[{"$nulls":4},"In-House Transformation","2nd Party Transformation","In-House Destruction ","2nd Party Destruction","QPS","Pre-Plant Critical Use","Post-Harvest Critical Use","Emergency Use","Global Lab","Gross Imports"]
[1,null,null,"CH3Br",{"$f":"IF($D12=\"\",\"\",SUMIFS('Data for Summary'!$D$3:$D$102,'Data for Summary'!$C$3:$C$102,$D12,'Data for Summary'!$F$3:$F$102,Lists!$J$5, 'Data for Summary'!$E$3:$E$102, Lists!$I$3))","v":{"v":0,"d":"0.00"}},{"$f":"IF($D12=\"\",\"\",SUMIFS('Data for Summary'!$D$3:$D$102,'Data for Summary'!$C$3:$C$102,$D12,'Data for Summary'!$F$3:$F$102,Lists!$J$6, 'Data for Summary'!$E$3:$E$102, Lists!$I$3))","v":{"v":0,"d":"0.00"}},{"$f":"IF($D12=\"\",\"\",SUMIFS('Data for Summary'!$D$3:$D$102,'Data for Summary'!$C$3:$C$102,$D12,'Data for Summary'!$F$3:$F$102,Lists!$J$7, 'Data for Summary'!$E$3:$E$102, Lists!$I$3))","v":{"v":0,"d":"0.00"}},{"$f":"IF($D12=\"\",\"\",SUMIFS('Data for Summary'!$D$3:$D$102,'Data for Summary'!$C$3:$C$102,$D12,'Data for Summary'!$F$3:$F$102,Lists!$J$8, 'Data for Summary'!$E$3:$E$102, Lists!$I$3))","v":{"v":0,"d":"0.00"}},{"$f":"IF($D12=\"\",\"\",SUMIFS('Data for Summary'!$D$3:$D$102,'Data for Summary'!$C$3:$C$102,$D12,'Data for Summary'!$F$3:$F$102,Lists!$J$9, 'Data for Summary'!$E$3:$E$102, Lists!$I$3))","v":{"v":0,"d":"0.00"}},{"$f":"IF($D12=\"\",\"\",SUMIFS('Data for Summary'!$D$3:$D$102,'Data for Summary'!$C$3:$C$102,$D12,'Data for Summary'!$F$3:$F$102,Lists!$J$12, 'Data for Summary'!$E$3:$E$102, Lists!$I$3))","v":{"v":0,"d":"0.00"}},{"$f":"IF($D12=\"\",\"\",SUMIFS('Data for Summary'!$D$3:$D$102,'Data for Summary'!$C$3:$C$102,$D12,'Data for Summary'!$F$3:$F$102,Lists!$J$13, 'Data for Summary'!$E$3:$E$102, Lists!$I$3))","v":{"v":0,"d":"0.00"}},{"$f":"IF($D12=\"\",\"\",SUMIFS('Data for Summary'!$D$3:$D$102,'Data for Summary'!$C$3:$C$102,$D12,'Data for Summary'!$F$3:$F$102,Lists!$J$10, 'Data for Summary'!$E$3:$E$102, Lists!$I$3))","v":{"v":0,"d":"0.00"}},{"$f":"IF($D12=\"\",\"\",SUMIFS('Data for Summary'!$D$3:$D$102,'Data for Summary'!$C$3:$C$102,$D12,'Data for Summary'!$F$3:$F$102,Lists!$J$11, 'Data for Summary'!$E$3:$E$102, Lists!$I$3))","v":{"v":0,"d":"0.00"}},{"$f":"IF($D12=\"\",\"\",SUM(E12:M12))","v":{"v":0,"d":"0.00"}},{"$f":"IF($D12=\"\",\"\",SUMIFS('Data for Summary'!$D$3:$D$102,'Data for Summary'!$C$3:$C$102,$D12,'Data for Summary'!$E$3:$E$102,Lists!$K$3))","v":{"v":0,"d":"0.00"}}]
[]
[{"$nulls":3},"Allowance Summary"]
[{"$nulls":3},"The values in the table below are calculated based on data entered in Section 2.  If the totals appear to be incorrect, please return to Section 2 to review your data."]
[{"$nulls":3},"Chemical Name","Allowances Expended (kg)"]
[{"$nulls":4},"Pre-Plant Critical Use",null,"Post-Harvest Critical Use"]
[{"$nulls":3},"CH3Br",{"$f":"J12","v":{"v":0,"d":"0 "}},null,{"$f":"K12","v":{"v":0,"d":"0 "}}]

{"sheet":"Reference List","index":6,"n_rows":78,"n_cols":10,"rows_kept":78,"merged":[[5,2,5,9],[6,2,6,5],[6,7,6,9],[8,2,8,3],[8,7,8,9],[11,2,12,5],[14,2,14,5],[18,2,18,5],[21,2,24,4],[26,2,26,4],[27,3,27,4],[28,3,28,4],[51,9,52,9],[64,9,65,9],[71,8,72,8]]}
[]
[null,null,"U.S. Environmental Protection Agency"]
[null,null,"Methyl Bromide Importer Quarterly Report"]
[null,null,"Reference List"]
[]
[null,null,"Copying and Pasting Data: If data is pasted into this reporting form from another spreadsheet, the formatting of specific cells must be consistent with the requirements of the form in order to be accepted into EPA’s ODS tracking system. When copying and pasting data into the form, please ensure consistency with the formatting of the lists provided below."]
[null,null,"Transaction Type List: The table below lists the valid transaction types that may be used when entering data into Section 2 of this form. ",{"$nulls":4},"Country List: The table below lists the valid country names that may be used when entering data into Section 2 of this form. "]
[]
[null,null,"Transaction Type",{"$nulls":4},"Source Country "]
[null,null,"New","Heels",{"$nulls":3},"Afghanistan","Greece","Papua New Guinea"]
[{"$nulls":7},"Albania","Grenada","Paraguay"]
[null,null,"Intended Use Lists: The tables below list the valid intended uses that may be used when entering data into Section 2 of this form. ",{"$nulls":4},"Algeria","Guatemala","Peru"]
[{"$nulls":7},"Andorra","Guinea","Philippines"]
[{"$nulls":7},"Angola","Guinea-Bissau","Poland"]
[null,null,"Intended Uses - If Transaction Type = New ",{"$nulls":4},"Antigua and Barbuda","Guyana","Portugal"]
[null,null,"Global Lab","In-House Trans","2nd Party Trans","QPS",null,"Argentina","Haiti","Qatar"]
[null,null,"Emergency Use","In-House Dest","2nd Party Dest",null,null,"Armenia","Holy See","Republic of Moldova"]
[{"$nulls":7},"Australia","Honduras","Romania"]
[null,null,"Intended Uses - If Transaction Type = Heels ",{"$nulls":4},"Austria","Hong Kong","Russian Federation"]
[null,null,"Future Shipment","Transformation","Destruction","Non-Emissive Use ",null,"Azerbaijan","Hungary","Rwanda"]
[{"$nulls":7},"Bahamas","Iceland","Saint Kitts and Nevis"]
[null,null,"Commodity Code List: The table below lists commonly used methyl bromide commodity codes that may be used when entering data into Section 2 of this form.  A complete list of commodity codes can be found in the Official Harmonized Tariff Schedule.",{"$nulls":4},"Bahrain","India","Saint Lucia"]
[{"$nulls":7},"Bangladesh","Indonesia","Saint Vincent and the Grenadines"]
[{"$nulls":7},"Barbados","Iran (Islamic Republic of)","Samoa"]
[{"$nulls":7},"Belarus","Iraq","San Marino"]
[{"$nulls":7},"Belgium","Ireland","Sao Tome and Principe"]
[null,null,"Methyl Bromide Commodity Codes/Description",{"$nulls":4},"Belize","Israel","Saudi Arabia"]
[null,null,"2903.39.1520","Methyl bromide",{"$nulls":3},"Benin","Italy","Senegal"]
[null,null,"3824.77.0000","Mixtures containing methyl bromide",{"$nulls":3},"Bermuda","Jamaica","Serbia"]
[{"$nulls":7},"Bhutan","Japan","Seychelles"]
[{"$nulls":7},"Bolivia (Plurinational State of)","Jordan","Sierra Leone"]
[{"$nulls":7},"Bosnia and Herzegovina","Kazakhstan","Singapore"]
[{"$nulls":7},"Botswana","Kenya","Slovakia"]
[{"$nulls":7},"Brazil","Kiribati","Slovenia"]
[{"$nulls":7},"Brunei Darussalam","Kuwait","Solomon Islands"]
[{"$nulls":7},"British Virgin Islands","Kyrgyzstan","Somalia (Federal Republic of)"]
[{"$nulls":7},"Bulgaria","Lao People's Democratic Republic","South Africa"]
[{"$nulls":7},"Burkina Faso","Latvia","South Korea (Republic of Korea)"]
[{"$nulls":7},"Burundi","Lebanon","South Sudan"]
[{"$nulls":7},"Cambodia","Lesotho","Spain"]
[{"$nulls":7},"Cameroon","Liberia","Sri Lanka"]
[{"$nulls":7},"Canada","Libya","Sudan"]
[{"$nulls":7},"Cape Verde","Liechtenstein","Suriname"]
[{"$nulls":7},"Central African Republic","Lithuania","Swaziland"]
[{"$nulls":7},"Chad","Luxembourg","Sweden"]
[{"$nulls":7},"Chile","Madagascar","Switzerland"]
[{"$nulls":7},"China","Malawi","Syrian Arab Republic"]
[{"$nulls":7},"Colombia","Malaysia","Tahiti"]
[{"$nulls":7},"Comoros","Maldives","Taiwan"]
[{"$nulls":7},"Congo","Mali","Tajikistan"]
[{"$nulls":7},"Cook Islands","Malta","Thailand"]
[{"$nulls":7},"Costa Rica","Marshall Islands","The Former Yugoslav Republic of Macedonia"]
[{"$nulls":7},"Côte d'Ivoire","Mauritania"]
[{"$nulls":7},"Croatia","Mauritius","Timor-Leste"]
[{"$nulls":7},"Cuba","Mexico","Togo"]
[{"$nulls":7},"Cyprus","Micronesia (Federated States of)","Tonga"]
[{"$nulls":7},"Czech Republic","Monaco","Trinidad and Tobago"]
[{"$nulls":7},"Democratic Republic of the Congo","Mongolia","Tunisia"]
[{"$nulls":7},"Denmark","Montenegro","Turkey"]
[{"$nulls":7},"Djibouti","Morocco","Turkmenistan"]
[{"$nulls":7},"Dominica","Mozambique","Tuvalu"]
[{"$nulls":7},"Dominican Republic","Myanmar","Uganda"]
[{"$nulls":7},"Ecuador","Namibia","Ukraine"]
[{"$nulls":7},"Egypt","Nauru","United Arab Emirates"]
[{"$nulls":7},"El Salvador","Nepal","United Kingdom of Great Britain and Northern Ireland"]
[{"$nulls":7},"Equatorial Guinea","Netherlands"]
[{"$nulls":7},"Eritrea","New Zealand","United Republic of Tanzania"]
[{"$nulls":7},"Estonia","Nicaragua","Uruguay"]
[{"$nulls":7},"Ethiopia","Niger","Uzbekistan"]
[{"$nulls":7},"European Union","Nigeria","Vanuatu"]
[{"$nulls":7},"Fiji","Niue","Venezuela (Bolivarian Republic of)"]
[{"$nulls":7},"Finland","North Korea (Democratic People's Republic of Korea)","Viet Nam"]
[{"$nulls":7},"France",null,"Yemen"]
[{"$nulls":7},"Gabon","Norway","Zambia"]
[{"$nulls":7},"Gambia","Oman","Zimbabwe"]
[{"$nulls":7},"Georgia","Pakistan"]
[{"$nulls":7},"Germany","Palau"]
[{"$nulls":7},"Ghana","Panama"]

{"sheet":"Lists","index":7,"n_rows":203,"n_cols":19,"rows_kept":203,"hidden":true,"merged":[[0,14,0,15]]}
[{"$nulls":14},"FOR REFERENCE ONLY",null,null,"Variables for Data Submission"]
[null,"Country List","Submission Type","Reporting Year","Reporting Quarter","Quarter Start Month","Date Range","MeBr Purpose","MeBr Transaction Type","MeBr Intended Uses_New ","Intended Uses_Heels ","Date for CSV Title","Form Name for CSV Title",null,"Form Type","Form Code",null,null,"Row #"]
[null,"Afghanistan","Original Submission",2018,1,1,{"$f":"IF(SUM('Section 1'!$F$11:$F$12)>0,DATE(2018,1,1),DATE('Section 1'!$D$11,VLOOKUP('Section 1'!D12,Lists!$E$3:$F$6,2,0),1))","v":"2018-01-01"},"Global Lab","New","New","Heels",{"$f":"MONTH('Section 1'!D5)&\"-\"&DAY('Section 1'!D5)&\"-\"&YEAR('Section 1'!D5)","v":"12-6-2017"},"MeBr Importer",null,"Class I Producer","PROD1",null,"Sec2End",{"$f":"IF(MAX(OutputForCSV!A2:A101)=0,1,MAX(OutputForCSV!A2:A101))","v":1}]
[null,"Albania","Re-Submittal",2019,2,4,{"$f":"IF(SUM('Section 1'!$F$11:$F$12)>0,DATE(2030,1,1),IF('Section 1'!D12=4,DATE('Section 1'!D11+1,1,1)-1,DATE('Section 1'!$D$11,VLOOKUP('Section 1'!$D$12,Lists!$E$3:$F$6,2,0)+3,1)-1))","v":"2030-01-01"},"QPS","Heels","MeBrNewIntendedUses","HeelsIntendedUses",{"$nulls":3},"MeBr Producer","PROD3",null,"Sec3Start",{"$f":"OutputForCSV!A102","v":""}]
[null,"Algeria",null,2020,3,7,null,"Transformation",null,"In-House Trans","Future Shipment",{"$nulls":3},"Class II Producer","PROD2",null,"Sec3End",{"$f":"MAX(OutputForCSV!A102:A111)","v":0}]
[null,"Andorra",null,null,4,10,null,"Destruction",null,"2nd Party Trans","Transformation",{"$nulls":3},"Class I Importer","IMPT1",null,"Sec4Start",{"$f":"OutputForCSV!A112","v":""}]
[null,"Angola",{"$nulls":5},"Emergency Use",null,"In-House Dest","Destruction",{"$nulls":3},"MeBr Importer","IMPT3",null,"Sec4End",{"$f":"MAX(OutputForCSV!A112:A115)","v":0}]
[null,"Antigua and Barbuda",{"$nulls":7},"2nd Party Dest","Non-Emissive Use ",{"$nulls":3},"Class II Importer","IMPT2",null,"MaxTempRow",{"$f":"IF(MAX(TempOutput!A2:A115)=0,1,MAX(TempOutput!A2:A115))","v":1}]
[null,"Argentina",{"$nulls":7},"QPS",{"$nulls":4},"Class I Exporter","EXPT1",null,"Sec3PasteRow",{"$f":"IF(S3=0,2,S3+1)","v":2}]
[null,"Armenia",{"$nulls":7},"Emergency Use",{"$nulls":4},"MeBr Exporter","EXPT3",null,"Sec4PasteRow",{"$f":"ROWS(OutputForCSV!A1:A111)-COUNTIF(OutputForCSV!A2:A111,\"\")+1","v":2}]
[null,"Australia",{"$nulls":7},"Global Lab",{"$nulls":4},"Class II Exporter","EXPT2"]
[null,"Austria",{"$nulls":7},"Pre-Plant Critical Use",{"$nulls":4},"Class I Lab Supplier","LABS1"]
[null,"Azerbaijan",{"$nulls":7},"Post-Harvest Critical Use",{"$nulls":4},"Class I Destruction","DEST1"]
[null,"Bahamas",{"$nulls":12},"MeBr Destruction","DEST3"]
[null,"Bahrain",{"$nulls":12},"Class II Destruction","DEST2"]
[null,"Bangladesh",{"$nulls":12},"Class I Transformation","TRAN1"]
[null,"Barbados",{"$nulls":12},"MeBr Transformation","TRAN3"]
[null,"Belarus",{"$nulls":12},"Class II Transformation","TRAN2"]
[null,"Belgium",{"$nulls":12},"MeBr Trades","TRAD3"]
[null,"Belize",{"$nulls":12},"Class II Trades","TRAD2"]
[null,"Benin",{"$nulls":12},"Class II RACA","RACA2"]
[null,"Bermuda",{"$nulls":12},"MeBr Distributor of QPS","MBQPS"]
[null,"Bhutan",{"$nulls":12},"MeBr Pre-2005 Stocks","MB05S"]
[null,"Bolivia (Plurinational State of)",{"$nulls":12},"MeBr Sales of CU","MBCUE"]
[null,"Bosnia and Herzegovina",{"$nulls":12},"Petitions","PETIT"]
[null,"Botswana"]
[null,"Brazil"]
[null,"Brunei Darussalam"]
[null,"British Virgin Islands"]
[null,"Bulgaria"]
[null,"Burkina Faso"]
[null,"Burundi"]
[null,"Cambodia"]
[null,"Cameroon"]
[null,"Canada"]
[null,"Cape Verde"]
[null,"Central African Republic"]
[null,"Chad"]
[null,"Chile"]
[null,"China"]
[null,"Colombia"]
[null,"Comoros"]
[null,"Congo"]
[null,"Cook Islands"]
[null,"Costa Rica"]
[null,"Côte d'Ivoire"]
[null,"Croatia"]
[null,"Cuba"]
[null,"Cyprus"]
[null,"Czech Republic"]
[null,"Democratic Republic of the Congo"]
[null,"Denmark"]
[null,"Djibouti"]
[null,"Dominica"]
[null,"Dominican Republic"]
[null,"Ecuador"]
[null,"Egypt"]
[null,"El Salvador"]
[null,"Equatorial Guinea"]
[null,"Eritrea"]
[null,"Estonia"]
[null,"Ethiopia"]
[null,"European Union"]
[null,"Fiji"]
[null,"Finland"]
[null,"France"]
[null,"Gabon"]
[null,"Gambia"]
[null,"Georgia"]
[null,"Germany"]
[null,"Ghana"]
[null,"Greece"]
[null,"Grenada"]
[null,"Guatemala"]
[null,"Guinea"]
[null,"Guinea-Bissau"]
[null,"Guyana"]
[null,"Haiti"]
[null,"Holy See"]
[null,"Honduras"]
[null,"Hong Kong"]
[null,"Hungary"]
[null,"Iceland"]
[null,"India"]
[null,"Indonesia"]
[null,"Iran (Islamic Republic of)"]
[null,"Iraq"]
[null,"Ireland"]
[null,"Israel"]
[null,"Italy"]
[null,"Jamaica"]
[null,"Japan"]
[null,"Jordan"]
[null,"Kazakhstan"]
[null,"Kenya"]
[null,"Kiribati"]
[null,"Kuwait"]
[null,"Kyrgyzstan"]
[null,"Lao People's Democratic Republic"]
[null,"Latvia"]
[null,"Lebanon"]
[null,"Lesotho"]
[null,"Liberia"]
[null,"Libya"]
[null,"Liechtenstein"]
[null,"Lithuania"]
[null,"Luxembourg"]
[null,"Madagascar"]
[null,"Malawi"]
[null,"Malaysia"]
[null,"Maldives"]
[null,"Mali"]
[null,"Malta"]
[null,"Marshall Islands"]
[null,"Mauritania"]
[null,"Mauritius"]
[null,"Mexico"]
[null,"Micronesia (Federated States of)"]
[null,"Monaco"]
[null,"Mongolia"]
[null,"Montenegro"]
[null,"Morocco"]
[null,"Mozambique"]
[null,"Myanmar"]
[null,"Namibia"]
[null,"Nauru"]
[null,"Nepal"]
[null,"Netherlands"]
[null,"New Zealand"]
[null,"Nicaragua"]
[null,"Niger"]
[null,"Nigeria"]
[null,"Niue"]
[null,"North Korea (Democratic People's Republic of Korea)"]
[null,"Norway"]
[null,"Oman"]
[null,"Pakistan"]
[null,"Palau"]
[null,"Panama"]
[null,"Papua New Guinea"]
[null,"Paraguay"]
[null,"Peru"]
[null,"Philippines"]
[null,"Poland"]
[null,"Portugal"]
[null,"Qatar"]
[null,"Republic of Moldova"]
[null,"Romania"]
[null,"Russian Federation"]
[null,"Rwanda"]
[null,"Saint Kitts and Nevis"]
[null,"Saint Lucia"]
[null,"Saint Vincent and the Grenadines"]
[null,"Samoa"]
[null,"San Marino"]
[null,"Sao Tome and Principe"]
[null,"Saudi Arabia"]
[null,"Senegal"]
[null,"Serbia"]
[null,"Seychelles"]
[null,"Sierra Leone"]
[null,"Singapore"]
[null,"Slovakia"]
[null,"Slovenia"]
[null,"Solomon Islands"]
[null,"Somalia (Federal Republic of)"]
[null,"South Africa"]
[null,"South Korea (Republic of Korea)"]
[null,"South Sudan"]
[null,"Spain"]
[null,"Sri Lanka"]
[null,"Sudan"]
[null,"Suriname"]
[null,"Swaziland"]
[null,"Sweden"]
[null,"Switzerland"]
[null,"Syrian Arab Republic"]
[null,"Tahiti"]
[null,"Taiwan"]
[null,"Tajikistan"]
[null,"Thailand"]
[null,"The Former Yugoslav Republic of Macedonia"]
[null,"Timor-Leste"]
[null,"Togo"]
[null,"Tonga"]
[null,"Trinidad and Tobago"]
[null,"Tunisia"]
[null,"Turkey"]
[null,"Turkmenistan"]
[null,"Tuvalu"]
[null,"Uganda"]
[null,"Ukraine"]
[null,"United Arab Emirates"]
[null,"United Kingdom of Great Britain and Northern Ireland"]
[null,"United Republic of Tanzania"]
[null,"Uruguay"]
[null,"Uzbekistan"]
[null,"Vanuatu"]
[null,"Venezuela (Bolivarian Republic of)"]
[null,"Viet Nam"]
[null,"Yemen"]
[null,"Zambia"]
[null,"Zimbabwe"]

{"sheet":"Checks","index":8,"n_rows":30,"n_cols":5,"rows_kept":30,"hidden":true}
[]
[null,"Section","Check Description","Status (1 = Incomplete, 0 = Complete)","Check Type"]
[null,"Section 1","All",{"$f":"IF(SUM('Section 1'!F9:F13)>0,1,0)","v":1},"Error"]
[null,"Section 2","Date Range Check",{"$f":"IF(SUM('Section 2'!S16:S115)>0,1,0)","v":0},"Stopper"]
[null,"Section 2","Complete?",{"$f":"IF(SUM('Section 2'!T16:T115)>0,1,0)","v":0},"Stopper"]
[null,"Section 2","Valid Country",{"$f":"IF(SUM('Section 2'!U16:U115)>0,1,0)","v":0},"Stopper"]
[null,"Section 2","Valid Transaction Type",{"$f":"IF(SUM('Section 2'!AA16:AA115)>0,1,0)","v":0},"Stopper"]
[null,"Section 2","Valid Intended Use",{"$f":"IF(SUM('Section 2'!AB16:AB115)>0,1,0)","v":0},"Stopper"]
[null,"Section 2","Error Check",{"$f":"IF(SUM(D4:D8)>0,1,0)","v":0},"Error"]
[null,"Section 2","Filled Out?",{"$f":"IF(SUM('Section 2'!C16:C115)>0,0,1)","v":1},"Warning"]
[null,"Section 3","Complete?",{"$f":"IF(SUM('Section 3'!Q15:Q24)>0,1,0)","v":0},"Stopper"]
[null,"Section 3","Valid Chem",null,"Stopper"]
[null,"Section 3","Valid Purpose",{"$f":"IF(SUM('Section 3'!P15:P24)>0,1,0)","v":0},"Stopper"]
[null,"Section 3","Lab/EU in Section 2, also in Section 3?",{"$f":"IF(SUM('Section 2'!Z16:Z115)>0,1,0)","v":0},"Stopper"]
[null,"Section 3","Lab/EU in Section 3, also in Section 2?",{"$f":"IF(SUM('Section 3'!K15:K24)>0,1,0)","v":0},"Stopper"]
[null,"Section 3","Error Check",{"$f":"IF(SUM(D11:D15)>0,1,0)","v":0},"Error"]
[null,"Section 3","Sec2 2nd party trans/destruction, QPS reflected in Sec 3?",{"$f":"IF(SUM('Section 2'!V16:V115)>0,1,0)","v":0},"Warning"]
[null,"Section 3","Sec 3 reflected in Sec 2? (Trans/Dest/QPS)",{"$f":"IF(SUM('Section 3'!L15:L24)>0,1,0)","v":0},"Warning"]
[null,"Section 4","Reporting Quarter 4, End of Year Inventory Filled Out","Section 4'!L10","Stopper"]
[null,"Section 4","If the Reporting Quarter does not equal 4, Section 4 must be left blank (Section 4)","IF(SUM('Section 4'!M15:M17,'Section 4'!M10)>0, 1, 0)","Stopper"]
[null,"Section 4","If Company Filled Out, Either Pre or Post Harvest Must Be greater than 0","IF(SUM('Section 4'!L15:L17)>0, 1, 0)","Stopper"]
[null,"Section 4","Error Check","IF(SUM(D19:D21)>0,1,0)","Error"]
[null,"All","Error Check",{"$f":"IF(SUM(Sec1Status,Sec2Error,Sec3Error,Sec4Error)>0,1,0)","v":1},"Error"]
[]
[]
[]
[null,"Numerical Checks against Output for CSV"]
[null,"Section 2","Total Quantity of Chemical Imported",{"$f":"SUMIF('Section 2'!$R$16:$R$115,\"Y\",'Section 2'!$G$16:$G$115)-SUM(OutputForCSV!$H$2:$H$101)","v":{"v":0,"d":"0.00"}}]
[null,"Section 3","Section 3 Quantity",{"$f":"SUMIF('Section 3'!$J$15:$J$24,\"Y\",'Section 3'!$F$15:$F$24)-SUM(OutputForCSV!$F$102:$F$111)","v":{"v":0,"d":"0.00"}}]
[null,"ALL","TOTAL CHECK",{"$f":"SUM(D28:D29)","v":{"v":0,"d":"0.00"}}]

{"sheet":"OutputForCSV","index":9,"n_rows":116,"n_cols":21,"rows_kept":116,"hidden":true}
["Row #","Entry",1,"IMPT3","1",{"$f":"'Section 1'!D5","v":"2017-12-06"},{"$f":"'Section 1'!D9","v":0},{"$f":"'Section 1'!D10","v":0},{"$f":"'Section 1'!D11","v":0},{"$f":"'Section 1'!D12","v":0},{"$f":"'Section 1'!D13","v":0},{"$nulls":9},"LastColumn"]
[{"$f":"IF(D2=\"\",\"\",ROWS($A$1:A2))","v":""},1,{"$f":"IF(D2=\"\",\"\",2)","v":""},{"$f":"IFERROR(VLOOKUP($B2,'Section 2'!$C$16:$M$115,COLUMNS('Section 2'!$C$13:C$13),0),\"\")","v":""},{"$f":"IF($D2=\"\",\"\",IF(ISBLANK(VLOOKUP($B2,'Section 2'!$C$16:$M$115,COLUMNS('Section 2'!$C$13:D$13),0)),\"\",VLOOKUP($B2,'Section 2'!$C$16:$M$115,COLUMNS('Section 2'!$C$13:D$13),0)))","v":""},{"$f":"IF($D2=\"\",\"\",IF(ISBLANK(VLOOKUP($B2,'Section 2'!$C$16:$M$115,COLUMNS('Section 2'!$C$13:E$13),0)),\"\",VLOOKUP($B2,'Section 2'!$C$16:$M$115,COLUMNS('Section 2'!$C$13:E$13),0)))","v":""},{"$f":"IF($D2=\"\",\"\",IF(ISBLANK(VLOOKUP($B2,'Section 2'!$C$16:$M$115,COLUMNS('Section 2'!$C$13:F$13),0)),\"\",VLOOKUP($B2,'Section 2'!$C$16:$M$115,COLUMNS('Section 2'!$C$13:F$13),0)))","v":""},{"$f":"IF($D2=\"\",\"\",IF(ISBLANK(VLOOKUP($B2,'Section 2'!$C$16:$M$115,COLUMNS('Section 2'!$C$13:G$13),0)),\"\",VLOOKUP($B2,'Section 2'!$C$16:$M$115,COLUMNS('Section 2'!$C$13:G$13),0)))","v":""},{"$f":"IF($D2=\"\",\"\",IF(ISBLANK(VLOOKUP($B2,'Section 2'!$C$16:$M$115,COLUMNS('Section 2'!$C$13:H$13),0)),\"\",VLOOKUP($B2,'Section 2'!$C$16:$M$115,COLUMNS('Section 2'!$C$13:H$13),0)))","v":""},{"$f":"IF($D2=\"\",\"\",IF(ISBLANK(VLOOKUP($B2,'Section 2'!$C$16:$M$115,COLUMNS('Section 2'!$C$13:I$13),0)),\"\",VLOOKUP($B2,'Section 2'!$C$16:$M$115,COLUMNS('Section 2'!$C$13:I$13),0)))","v":""},{"$f":"IF($D2=\"\",\"\",IF(ISBLANK(VLOOKUP($B2,'Section 2'!$C$16:$M$115,COLUMNS('Section 2'!$C$13:J$13),0)),\"\",VLOOKUP($B2,'Section 2'!$C$16:$M$115,COLUMNS('Section 2'!$C$13:J$13),0)))","v":""},{"$f":"IF($D2=\"\",\"\",IF(ISBLANK(VLOOKUP($B2,'Section 2'!$C$16:$M$115,COLUMNS('Section 2'!$C$13:K$13),0)),\"\",VLOOKUP($B2,'Section 2'!$C$16:$M$115,COLUMNS('Section 2'!$C$13:K$13),0)))","v":""},{"$f":"IF($D2=\"\",\"\",IF(ISBLANK(VLOOKUP($B2,'Section 2'!$C$16:$M$115,COLUMNS('Section 2'!$C$13:L$13),0)),\"\",VLOOKUP($B2,'Section 2'!$C$16:$M$115,COLUMNS('Section 2'!$C$13:L$13),0)))","v":""},{"$f":"IF($D2=\"\",\"\",IF(ISBLANK(VLOOKUP($B2,'Section 2'!$C$16:$M$115,COLUMNS('Section 2'!$C$13:M$13),0)),\"\",VLOOKUP($B2,'Section 2'!$C$16:$M$115,COLUMNS('Section 2'!$C$13:M$13),0)))","v":""}]
[{"$f":"IF(D3=\"\",\"\",ROWS($A$1:A3))","v":""},2,{"$f":"IF(D3=\"\",\"\",2)","v":""},{"$f":"IFERROR(VLOOKUP($B3,'Section 2'!$C$16:$M$115,COLUMNS('Section 2'!$C$13:C$13),0),\"\")","v":""},{"$f":"IF($D3=\"\",\"\",IF(ISBLANK(VLOOKUP($B3,'Section 2'!$C$16:$M$115,COLUMNS('Section 2'!$C$13:D$13),0)),\"\",VLOOKUP($B3,'Section 2'!$C$16:$M$115,COLUMNS('Section 2'!$C$13:D$13),0)))","v":""},{"$f":"IF($D3=\"\",\"\",IF(ISBLANK(VLOOKUP($B3,'Section 2'!$C$16:$M$115,COLUMNS('Section 2'!$C$13:E$13),0)),\"\",VLOOKUP($B3,'Section 2'!$C$16:$M$115,COLUMNS('Section 2'!$C$13:E$13),0)))","v":""},{"$f":"IF($D3=\"\",\"\",IF(ISBLANK(VLOOKUP($B3,'Section 2'!$C$16:$M$115,COLUMNS('Section 2'!$C$13:F$13),0)),\"\",VLOOKUP($B3,'Section 2'!$C$16:$M$115,COLUMNS('Section 2'!$C$13:F$13),0)))","v":""},{"$f":"IF($D3=\"\",\"\",IF(ISBLANK(VLOOKUP($B3,'Section 2'!$C$16:$M$115,COLUMNS('Section 2'!$C$13:G$13),0)),\"\",VLOOKUP($B3,'Section 2'!$C$16:$M$115,COLUMNS('Section 2'!$C$13:G$13),0)))","v":""},{"$f":"IF($D3=\"\",\"\",IF(ISBLANK(VLOOKUP($B3,'Section 2'!$C$16:$M$115,COLUMNS('Section 2'!$C$13:H$13),0)),\"\",VLOOKUP($B3,'Section 2'!$C$16:$M$115,COLUMNS('Section 2'!$C$13:H$13),0)))","v":""},{"$f":"IF($D3=\"\",\"\",IF(ISBLANK(VLOOKUP($B3,'Section 2'!$C$16:$M$115,COLUMNS('Section 2'!$C$13:I$13),0)),\"\",VLOOKUP($B3,'Section 2'!$C$16:$M$115,COLUMNS('Section 2'!$C$13:I$13),0)))","v":""},{"$f":"IF($D3=\"\",\"\",IF(ISBLANK(VLOOKUP($B3,'Section 2'!$C$16:$M$115,COLUMNS('Section 2'!$C$13:J$13),0)),\"\",VLOOKUP($B3,'Section 2'!$C$16:$M$115,COLUMNS('Section 2'!$C$13:J$13),0)))","v":""},{"$f":"IF($D3=\"\",\"\",IF(ISBLANK(VLOOKUP($B3,'Section 2'!$C$16:$M$115,COLUMNS('Section 2'!$C$13:K$13),0)),\"\",VLOOKUP($B3,'Section 2'!$C$16:$M$115,COLUMNS('Section 2'!$C$13:K$13),0)))","v":""},{"$f":"IF($D3=\"\",\"\",IF(ISBLANK(VLOOKUP($B3,'Section 2'!$C$16:$M$115,COLUMNS('Section 2'!$C$13:L$13),0)),\"\",VLOOKUP($B3,'Section 2'!$C$16:$M$115,COLUMNS('Section 2'!$C$13:L$13),0)))","v":""},{"$f":"IF($D3=\"\",\"\",IF(ISBLANK(VLOOKUP($B3,'Section 2'!$C$16:$M$115,COLUMNS('Section 2'!$C$13:M$13),0)),\"\",VLOOKUP($B3,'Section 2'!$C$16:$M$115,COLUMNS('Section 2'!$C$13:M$13),0)))","v":""}]
[{"$f":"IF(D4=\"\",\"\",ROWS($A$1:A4))","v":""},3,"",{"$f":"IFERROR(VLOOKUP($B4,'Section 2'!$C$16:$M$115,COLUMNS('Section 2'!$C$13:C$13),0),\"\")","v":""},{"$f":"IF($D4=\"\",\"\",IF(ISBLANK(VLOOKUP($B4,'Section 2'!$C$16:$M$115,COLUMNS('Section 2'!$C$13:D$13),0)),\"\",VLOOKUP($B4,'Section 2'!$C$16:$M$115,COLUMNS('Section 2'!$C$13:D$13),0)))","v":""},{"$f":"IF($D4=\"\",\"\",IF(ISBLANK(VLOOKUP($B4,'Section 2'!$C$16:$M$115,COLUMNS('Section 2'!$C$13:E$13),0)),\"\",VLOOKUP($B4,'Section 2'!$C$16:$M$115,COLUMNS('Section 2'!$C$13:E$13),0)))","v":""},{"$f":"IF($D4=\"\",\"\",IF(ISBLANK(VLOOKUP($B4,'Section 2'!$C$16:$M$115,COLUMNS('Section 2'!$C$13:F$13),0)),\"\",VLOOKUP($B4,'Section 2'!$C$16:$M$115,COLUMNS('Section 2'!$C$13:F$13),0)))","v":""},{"$f":"IF($D4=\"\",\"\",IF(ISBLANK(VLOOKUP($B4,'Section 2'!$C$16:$M$115,COLUMNS('Section 2'!$C$13:G$13),0)),\"\",VLOOKUP($B4,'Section 2'!$C$16:$M$115,COLUMNS('Section 2'!$C$13:G$13),0)))","v":""},{"$f":"IF($D4=\"\",\"\",IF(ISBLANK(VLOOKUP($B4,'Section 2'!$C$16:$M$115,COLUMNS('Section 2'!$C$13:H$13),0)),\"\",VLOOKUP($B4,'Section 2'!$C$16:$M$115,COLUMNS('Section 2'!$C$13:H$13),0)))","v":""},{"$f":"IF($D4=\"\",\"\",IF(ISBLANK(VLOOKUP($B4,'Section 2'!$C$16:$M$115,COLUMNS('Section 2'!$C$13:I$13),0)),\"\",VLOOKUP($B4,'Section 2'!$C$16:$M$115,COLUMNS('Section 2'!$C$13:I$13),0)))","v":""},{"$f":"IF($D4=\"\",\"\",IF(ISBLANK(VLOOKUP($B4,'Section 2'!$C$16:$M$115,COLUMNS('Section 2'!$C$13:J$13),0)),\"\",VLOOKUP($B4,'Section 2'!$C$16:$M$115,COLUMNS('Section 2'!$C$13:J$13),0)))","v":""},{"$f":"IF($D4=\"\",\"\",IF(ISBLANK(VLOOKUP($B4,'Section 2'!$C$16:$M$115,COLUMNS('Section 2'!$C$13:K$13),0)),\"\",VLOOKUP($B4,'Section 2'!$C$16:$M$115,COLUMNS('Section 2'!$C$13:K$13),0)))","v":""},{"$f":"IF($D4=\"\",\"\",IF(ISBLANK(VLOOKUP($B4,'Section 2'!$C$16:$M$115,COLUMNS('Section 2'!$C$13:L$13),0)),\"\",VLOOKUP($B4,'Section 2'!$C$16:$M$115,COLUMNS('Section 2'!$C$13:L$13),0)))","v":""},{"$f":"IF($D4=\"\",\"\",IF(ISBLANK(VLOOKUP($B4,'Section 2'!$C$16:$M$115,COLUMNS('Section 2'!$C$13:M$13),0)),\"\",VLOOKUP($B4,'Section 2'!$C$16:$M$115,COLUMNS('Section 2'!$C$13:M$13),0)))","v":""}]
[{"$f":"IF(D5=\"\",\"\",ROWS($A$1:A5))","v":""},4,"",{"$f":"IFERROR(VLOOKUP($B5,'Section 2'!$C$16:$M$115,COLUMNS('Section 2'!$C$13:C$13),0),\"\")","v":""},{"$f":"IF($D5=\"\",\"\",IF(ISBLANK(VLOOKUP($B5,'Section 2'!$C$16:$M$115,COLUMNS('Section 2'!$C$13:D$13),0)),\"\",VLOOKUP($B5,'Section 2'!$C$16:$M$115,COLUMNS('Section 2'!$C$13:D$13),0)))","v":""},{"$f":"IF($D5=\"\",\"\",IF(ISBLANK(VLOOKUP($B5,'Section 2'!$C$16:$M$115,COLUMNS('Section 2'!$C$13:E$13),0)),\"\",VLOOKUP($B5,'Section 2'!$C$16:$M$115,COLUMNS('Section 2'!$C$13:E$13),0)))","v":""},{"$f":"IF($D5=\"\",\"\",IF(ISBLANK(VLOOKUP($B5,'Section 2'!$C$16:$M$115,COLUMNS('Section 2'!$C$13:F$13),0)),\"\",VLOOKUP($B5,'Section 2'!$C$16:$M$115,COLUMNS('Section 2'!$C$13:F$13),0)))","v":""},{"$f":"IF($D5=\"\",\"\",IF(ISBLANK(VLOOKUP($B5,'Section 2'!$C$16:$M$115,COLUMNS('Section 2'!$C$13:G$13),0)),\"\",VLOOKUP($B5,'Section 2'!$C$16:$M$115,COLUMNS('Section 2'!$C$13:G$13),0)))","v":""},{"$f":"IF($D5=\"\",\"\",IF(ISBLANK(VLOOKUP($B5,'Section 2'!$C$16:$M$115,COLUMNS('Section 2'!$C$13:H$13),0)),\"\",VLOOKUP($B5,'Section 2'!$C$16:$M$115,COLUMNS('Section 2'!$C$13:H$13),0)))","v":""},{"$f":"IF($D5=\"\",\"\",IF(ISBLANK(VLOOKUP($B5,'Section 2'!$C$16:$M$115,COLUMNS('Section 2'!$C$13:I$13),0)),\"\",VLOOKUP($B5,'Section 2'!$C$16:$M$115,COLUMNS('Section 2'!$C$13:I$13),0)))","v":""},{"$f":"IF($D5=\"\",\"\",IF(ISBLANK(VLOOKUP($B5,'Section 2'!$C$16:$M$115,COLUMNS('Section 2'!$C$13:J$13),0)),\"\",VLOOKUP($B5,'Section 2'!$C$16:$M$115,COLUMNS('Section 2'!$C$13:J$13),0)))","v":""},{"$f":"IF($D5=\"\",\"\",IF(ISBLANK(VLOOKUP($B5,'Section 2'!$C$16:$M$115,COLUMNS('Section 2'!$C$13:K$13),0)),\"\",VLOOKUP($B5,'Section 2'!$C$16:$M$115,COLUMNS('Section 2'!$C$13:K$13),0)))","v":""},{"$f":"IF($D5=\"\",\"\",IF(ISBLANK(VLOOKUP($B5,'Section 2'!$C$16:$M$115,COLUMNS('Section 2'!$C$13:L$13),0)),\"\",VLOOKUP($B5,'Section 2'!$C$16:$M$115,COLUMNS('Section 2'!$C$13:L$13),0)))","v":""},{"$f":"IF($D5=\"\",\"\",IF(ISBLANK(VLOOKUP($B5,'Section 2'!$C$16:$M$115,COLUMNS('Section 2'!$C$13:M$13),0)),\"\",VLOOKUP($B5,'Section 2'!$C$16:$M$115,COLUMNS('Section 2'!$C$13:M$13),0)))","v":""}]
[{"$f":"IF(D6=\"\",\"\",ROWS($A$1:A6))","v":""},5,"",{"$f":"IFERROR(VLOOKUP($B6,'Section 2'!$C$16:$M$115,COLUMNS('Section 2'!$C$13:C$13),0),\"\")","v":""},{"$f":"IF($D6=\"\",\"\",IF(ISBLANK(VLOOKUP($B6,'Section 2'!$C$16:$M$115,COLUMNS('Section 2'!$C$13:D$13),0)),\"\",VLOOKUP($B6,'Section 2'!$C$16:$M$115,COLUMNS('Section 2'!$C$13:D$13),0)))","v":""},{"$f":"IF($D6=\"\",\"\",IF(ISBLANK(VLOOKUP($B6,'Section 2'!$C$16:$M$115,COLUMNS('Section 2'!$C$13:E$13),0)),\"\",VLOOKUP($B6,'Section 2'!$C$16:$M$115,COLUMNS('Section 2'!$C$13:E$13),0)))","v":""},{"$f":"IF($D6=\"\",\"\",IF(ISBLANK(VLOOKUP($B6,'Section 2'!$C$16:$M$115,COLUMNS('Section 2'!$C$13:F$13),0)),\"\",VLOOKUP($B6,'Section 2'!$C$16:$M$115,COLUMNS('Section 2'!$C$13:F$13),0)))","v":""},{"$f":"IF($D6=\"\",\"\",IF(ISBLANK(VLOOKUP($B6,'Section 2'!$C$16:$M$115,COLUMNS('Section 2'!$C$13:G$13),0)),\"\",VLOOKUP($B6,'Section 2'!$C$16:$M$115,COLUMNS('Section 2'!$C$13:G$13),0)))","v":""},{"$f":"IF($D6=\"\",\"\",IF(ISBLANK(VLOOKUP($B6,'Section 2'!$C$16:$M$115,COLUMNS('Section 2'!$C$13:H$13),0)),\"\",VLOOKUP($B6,'Section 2'!$C$16:$M$115,COLUMNS('Section 2'!$C$13:H$13),0)))","v":""},{"$f":"IF($D6=\"\",\"\",IF(ISBLANK(VLOOKUP($B6,'Section 2'!$C$16:$M$115,COLUMNS('Section 2'!$C$13:I$13),0)),\"\",VLOOKUP($B6,'Section 2'!$C$16:$M$115,COLUMNS('Section 2'!$C$13:I$13),0)))","v":""},{"$f":"IF($D6=\"\",\"\",IF(ISBLANK(VLOOKUP($B6,'Section 2'!$C$16:$M$115,COLUMNS('Section 2'!$C$13:J$13),0)),\"\",VLOOKUP($B6,'Section 2'!$C$16:$M$115,COLUMNS('Section 2'!$C$13:J$13),0)))","v":""},{"$f":"IF($D6=\"\",\"\",IF(ISBLANK(VLOOKUP($B6,'Section 2'!$C$16:$M$115,COLUMNS('Section 2'!$C$13:K$13),0)),\"\",VLOOKUP($B6,'Section 2'!$C$16:$M$115,COLUMNS('Section 2'!$C$13:K$13),0)))","v":""},{"$f":"IF($D6=\"\",\"\",IF(ISBLANK(VLOOKUP($B6,'Section 2'!$C$16:$M$115,COLUMNS('Section 2'!$C$13:L$13),0)),\"\",VLOOKUP($B6,'Section 2'!$C$16:$M$115,COLUMNS('Section 2'!$C$13:L$13),0)))","v":""},{"$f":"IF($D6=\"\",\"\",IF(ISBLANK(VLOOKUP($B6,'Section 2'!$C$16:$M$115,COLUMNS('Section 2'!$C$13:M$13),0)),\"\",VLOOKUP($B6,'Section 2'!$C$16:$M$115,COLUMNS('Section 2'!$C$13:M$13),0)))","v":""}]
[{"$f":"IF(D7=\"\",\"\",ROWS($A$1:A7))","v":""},6,"",{"$f":"IFERROR(VLOOKUP($B7,'Section 2'!$C$16:$M$115,COLUMNS('Section 2'!$C$13:C$13),0),\"\")","v":""},{"$f":"IF($D7=\"\",\"\",IF(ISBLANK(VLOOKUP($B7,'Section 2'!$C$16:$M$115,COLUMNS('Section 2'!$C$13:D$13),0)),\"\",VLOOKUP($B7,'Section 2'!$C$16:$M$115,COLUMNS('Section 2'!$C$13:D$13),0)))","v":""},{"$f":"IF($D7=\"\",\"\",IF(ISBLANK(VLOOKUP($B7,'Section 2'!$C$16:$M$115,COLUMNS('Section 2'!$C$13:E$13),0)),\"\",VLOOKUP($B7,'Section 2'!$C$16:$M$115,COLUMNS('Section 2'!$C$13:E$13),0)))","v":""},{"$f":"IF($D7=\"\",\"\",IF(ISBLANK(VLOOKUP($B7,'Section 2'!$C$16:$M$115,COLUMNS('Section 2'!$C$13:F$13),0)),\"\",VLOOKUP($B7,'Section 2'!$C$16:$M$115,COLUMNS('Section 2'!$C$13:F$13),0)))","v":""},{"$f":"IF($D7=\"\",\"\",IF(ISBLANK(VLOOKUP($B7,'Section 2'!$C$16:$M$115,COLUMNS('Section 2'!$C$13:G$13),0)),\"\",VLOOKUP($B7,'Section 2'!$C$16:$M$115,COLUMNS('Section 2'!$C$13:G$13),0)))","v":""},{"$f":"IF($D7=\"\",\"\",IF(ISBLANK(VLOOKUP($B7,'Section 2'!$C$16:$M$115,COLUMNS('Section 2'!$C$13:H$13),0)),\"\",VLOOKUP($B7,'Section 2'!$C$16:$M$115,COLUMNS('Section 2'!$C$13:H$13),0)))","v":""},{"$f":"IF($D7=\"\",\"\",IF(ISBLANK(VLOOKUP($B7,'Section 2'!$C$16:$M$115,COLUMNS('Section 2'!$C$13:I$13),0)),\"\",VLOOKUP($B7,'Section 2'!$C$16:$M$115,COLUMNS('Section 2'!$C$13:I$13),0)))","v":""},{"$f":"IF($D7=\"\",\"\",IF(ISBLANK(VLOOKUP($B7,'Section 2'!$C$16:$M$115,COLUMNS('Section 2'!$C$13:J$13),0)),\"\",VLOOKUP($B7,'Section 2'!$C$16:$M$115,COLUMNS('Section 2'!$C$13:J$13),0)))","v":""},{"$f":"IF($D7=\"\",\"\",IF(ISBLANK(VLOOKUP($B7,'Section 2'!$C$16:$M$115,COLUMNS('Section 2'!$C$13:K$13),0)),\"\",VLOOKUP($B7,'Section 2'!$C$16:$M$115,COLUMNS('Section 2'!$C$13:K$13),0)))","v":""},{"$f":"IF($D7=\"\",\"\",IF(ISBLANK(VLOOKUP($B7,'Section 2'!$C$16:$M$115,COLUMNS('Section 2'!$C$13:L$13),0)),\"\",VLOOKUP($B7,'Section 2'!$C$16:$M$115,COLUMNS('Section 2'!$C$13:L$13),0)))","v":""},{"$f":"IF($D7=\"\",\"\",IF(ISBLANK(VLOOKUP($B7,'Section 2'!$C$16:$M$115,COLUMNS('Section 2'!$C$13:M$13),0)),\"\",VLOOKUP($B7,'Section 2'!$C$16:$M$115,COLUMNS('Section 2'!$C$13:M$13),0)))","v":""}]
[{"$f":"IF(D8=\"\",\"\",ROWS($A$1:A8))","v":""},7,"",{"$f":"IFERROR(VLOOKUP($B8,'Section 2'!$C$16:$M$115,COLUMNS('Section 2'!$C$13:C$13),0),\"\")","v":""},{"$f":"IF($D8=\"\",\"\",IF(ISBLANK(VLOOKUP($B8,'Section 2'!$C$16:$M$115,COLUMNS('Section 2'!$C$13:D$13),0)),\"\",VLOOKUP($B8,'Section 2'!$C$16:$M$115,COLUMNS('Section 2'!$C$13:D$13),0)))","v":""},{"$f":"IF($D8=\"\",\"\",IF(ISBLANK(VLOOKUP($B8,'Section 2'!$C$16:$M$115,COLUMNS('Section 2'!$C$13:E$13),0)),\"\",VLOOKUP($B8,'Section 2'!$C$16:$M$115,COLUMNS('Section 2'!$C$13:E$13),0)))","v":""},{"$f":"IF($D8=\"\",\"\",IF(ISBLANK(VLOOKUP($B8,'Section 2'!$C$16:$M$115,COLUMNS('Section 2'!$C$13:F$13),0)),\"\",VLOOKUP($B8,'Section 2'!$C$16:$M$115,COLUMNS('Section 2'!$C$13:F$13),0)))","v":""},{"$f":"IF($D8=\"\",\"\",IF(ISBLANK(VLOOKUP($B8,'Section 2'!$C$16:$M$115,COLUMNS('Section 2'!$C$13:G$13),0)),\"\",VLOOKUP($B8,'Section 2'!$C$16:$M$115,COLUMNS('Section 2'!$C$13:G$13),0)))","v":""},{"$f":"IF($D8=\"\",\"\",IF(ISBLANK(VLOOKUP($B8,'Section 2'!$C$16:$M$115,COLUMNS('Section 2'!$C$13:H$13),0)),\"\",VLOOKUP($B8,'Section 2'!$C$16:$M$115,COLUMNS('Section 2'!$C$13:H$13),0)))","v":""},{"$f":"IF($D8=\"\",\"\",IF(ISBLANK(VLOOKUP($B8,'Section 2'!$C$16:$M$115,COLUMNS('Section 2'!$C$13:I$13),0)),\"\",VLOOKUP($B8,'Section 2'!$C$16:$M$115,COLUMNS('Section 2'!$C$13:I$13),0)))","v":""},{"$f":"IF($D8=\"\",\"\",IF(ISBLANK(VLOOKUP($B8,'Section 2'!$C$16:$M$115,COLUMNS('Section 2'!$C$13:J$13),0)),\"\",VLOOKUP($B8,'Section 2'!$C$16:$M$115,COLUMNS('Section 2'!$C$13:J$13),0)))","v":""},{"$f":"IF($D8=\"\",\"\",IF(ISBLANK(VLOOKUP($B8,'Section 2'!$C$16:$M$115,COLUMNS('Section 2'!$C$13:K$13),0)),\"\",VLOOKUP($B8,'Section 2'!$C$16:$M$115,COLUMNS('Section 2'!$C$13:K$13),0)))","v":""},{"$f":"IF($D8=\"\",\"\",IF(ISBLANK(VLOOKUP($B8,'Section 2'!$C$16:$M$115,COLUMNS('Section 2'!$C$13:L$13),0)),\"\",VLOOKUP($B8,'Section 2'!$C$16:$M$115,COLUMNS('Section 2'!$C$13:L$13),0)))","v":""},{"$f":"IF($D8=\"\",\"\",IF(ISBLANK(VLOOKUP($B8,'Section 2'!$C$16:$M$115,COLUMNS('Section 2'!$C$13:M$13),0)),\"\",VLOOKUP($B8,'Section 2'!$C$16:$M$115,COLUMNS('Section 2'!$C$13:M$13),0)))","v":""}]
[{"$f":"IF(D9=\"\",\"\",ROWS($A$1:A9))","v":""},8,"",{"$f":"IFERROR(VLOOKUP($B9,'Section 2'!$C$16:$M$115,COLUMNS('Section 2'!$C$13:C$13),0),\"\")","v":""},{"$f":"IF($D9=\"\",\"\",IF(ISBLANK(VLOOKUP($B9,'Section 2'!$C$16:$M$115,COLUMNS('Section 2'!$C$13:D$13),0)),\"\",VLOOKUP($B9,'Section 2'!$C$16:$M$115,COLUMNS('Section 2'!$C$13:D$13),0)))","v":""},{"$f":"IF($D9=\"\",\"\",IF(ISBLANK(VLOOKUP($B9,'Section 2'!$C$16:$M$115,COLUMNS('Section 2'!$C$13:E$13),0)),\"\",VLOOKUP($B9,'Section 2'!$C$16:$M$115,COLUMNS('Section 2'!$C$13:E$13),0)))","v":""},{"$f":"IF($D9=\"\",\"\",IF(ISBLANK(VLOOKUP($B9,'Section 2'!$C$16:$M$115,COLUMNS('Section 2'!$C$13:F$13),0)),\"\",VLOOKUP($B9,'Section 2'!$C$16:$M$115,COLUMNS('Section 2'!$C$13:F$13),0)))","v":""},{"$f":"IF($D9=\"\",\"\",IF(ISBLANK(VLOOKUP($B9,'Section 2'!$C$16:$M$115,COLUMNS('Section 2'!$C$13:G$13),0)),\"\",VLOOKUP($B9,'Section 2'!$C$16:$M$115,COLUMNS('Section 2'!$C$13:G$13),0)))","v":""},{"$f":"IF($D9=\"\",\"\",IF(ISBLANK(VLOOKUP($B9,'Section 2'!$C$16:$M$115,COLUMNS('Section 2'!$C$13:H$13),0)),\"\",VLOOKUP($B9,'Section 2'!$C$16:$M$115,COLUMNS('Section 2'!$C$13:H$13),0)))","v":""},{"$f":"IF($D9=\"\",\"\",IF(ISBLANK(VLOOKUP($B9,'Section 2'!$C$16:$M$115,COLUMNS('Section 2'!$C$13:I$13),0)),\"\",VLOOKUP($B9,'Section 2'!$C$16:$M$115,COLUMNS('Section 2'!$C$13:I$13),0)))","v":""},{"$f":"IF($D9=\"\",\"\",IF(ISBLANK(VLOOKUP($B9,'Section 2'!$C$16:$M$115,COLUMNS('Section 2'!$C$13:J$13),0)),\"\",VLOOKUP($B9,'Section 2'!$C$16:$M$115,COLUMNS('Section 2'!$C$13:J$13),0)))","v":""},{"$f":"IF($D9=\"\",\"\",IF(ISBLANK(VLOOKUP($B9,'Section 2'!$C$16:$M$115,COLUMNS('Section 2'!$C$13:K$13),0)),\"\",VLOOKUP($B9,'Section 2'!$C$16:$M$115,COLUMNS('Section 2'!$C$13:K$13),0)))","v":""},{"$f":"IF($D9=\"\",\"\",IF(ISBLANK(VLOOKUP($B9,'Section 2'!$C$16:$M$115,COLUMNS('Section 2'!$C$13:L$13),0)),\"\",VLOOKUP($B9,'Section 2'!$C$16:$M$115,COLUMNS('Section 2'!$C$13:L$13),0)))","v":""},{"$f":"IF($D9=\"\",\"\",IF(ISBLANK(VLOOKUP($B9,'Section 2'!$C$16:$M$115,COLUMNS('Section 2'!$C$13:M$13),0)),\"\",VLOOKUP($B9,'Section 2'!$C$16:$M$115,COLUMNS('Section 2'!$C$13:M$13),0)))","v":""}]
[{"$f":"IF(D10=\"\",\"\",ROWS($A$1:A10))","v":""},9,"",{"$f":"IFERROR(VLOOKUP($B10,'Section 2'!$C$16:$M$115,COLUMNS('Section 2'!$C$13:C$13),0),\"\")","v":""},{"$f":"IF($D10=\"\",\"\",IF(ISBLANK(VLOOKUP($B10,'Section 2'!$C$16:$M$115,COLUMNS('Section 2'!$C$13:D$13),0)),\"\",VLOOKUP($B10,'Section 2'!$C$16:$M$115,COLUMNS('Section 2'!$C$13:D$13),0)))","v":""},{"$f":"IF($D10=\"\",\"\",IF(ISBLANK(VLOOKUP($B10,'Section 2'!$C$16:$M$115,COLUMNS('Section 2'!$C$13:E$13),0)),\"\",VLOOKUP($B10,'Section 2'!$C$16:$M$115,COLUMNS('Section 2'!$C$13:E$13),0)))","v":""},{"$f":"IF($D10=\"\",\"\",IF(ISBLANK(VLOOKUP($B10,'Section 2'!$C$16:$M$115,COLUMNS('Section 2'!$C$13:F$13),0)),\"\",VLOOKUP($B10,'Section 2'!$C$16:$M$115,COLUMNS('Section 2'!$C$13:F$13),0)))","v":""},{"$f":"IF($D10=\"\",\"\",IF(ISBLANK(VLOOKUP($B10,'Section 2'!$C$16:$M$115,COLUMNS('Section 2'!$C$13:G$13),0)),\"\",VLOOKUP($B10,'Section 2'!$C$16:$M$115,COLUMNS('Section 2'!$C$13:G$13),0)))","v":""},{"$f":"IF($D10=\"\",\"\",IF(ISBLANK(VLOOKUP($B10,'Section 2'!$C$16:$M$115,COLUMNS('Section 2'!$C$13:H$13),0)),\"\",VLOOKUP($B10,'Section 2'!$C$16:$M$115,COLUMNS('Section 2'!$C$13:H$13),0)))","v":""},{"$f":"IF($D10=\"\",\"\",IF(ISBLANK(VLOOKUP($B10,'Section 2'!$C$16:$M$115,COLUMNS('Section 2'!$C$13:I$13),0)),\"\",VLOOKUP($B10,'Section 2'!$C$16:$M$115,COLUMNS('Section 2'!$C$13:I$13),0)))","v":""},{"$f":"IF($D10=\"\",\"\",IF(ISBLANK(VLOOKUP($B10,'Section 2'!$C$16:$M$115,COLUMNS('Section 2'!$C$13:J$13),0)),\"\",VLOOKUP($B10,'Section 2'!$C$16:$M$115,COLUMNS('Section 2'!$C$13:J$13),0)))","v":""},{"$f":"IF($D10=\"\",\"\",IF(ISBLANK(VLOOKUP($B10,'Section 2'!$C$16:$M$115,COLUMNS('Section 2'!$C$13:K$13),0)),\"\",VLOOKUP($B10,'Section 2'!$C$16:$M$115,COLUMNS('Section 2'!$C$13:K$13),0)))","v":""},{"$f":"IF($D10=\"\",\"\",IF(ISBLANK(VLOOKUP($B10,'Section 2'!$C$16:$M$115,COLUMNS('Section 2'!$C$13:L$13),0)),\"\",VLOOKUP($B10,'Section 2'!$C$16:$M$115,COLUMNS('Section 2'!$C$13:L$13),0)))","v":""},{"$f":"IF($D10=\"\",\"\",IF(ISBLANK(VLOOKUP($B10,'Section 2'!$C$16:$M$115,COLUMNS('Section 2'!$C$13:M$13),0)),\"\",VLOOKUP($B10,'Section 2'!$C$16:$M$115,COLUMNS('Section 2'!$C$13:M$13),0)))","v":""}]
[{"$f":"IF(D11=\"\",\"\",ROWS($A$1:A11))","v":""},10,"",{"$f":"IFERROR(VLOOKUP($B11,'Section 2'!$C$16:$M$115,COLUMNS('Section 2'!$C$13:C$13),0),\"\")","v":""},{"$f":"IF($D11=\"\",\"\",IF(ISBLANK(VLOOKUP($B11,'Section 2'!$C$16:$M$115,COLUMNS('Section 2'!$C$13:D$13),0)),\"\",VLOOKUP($B11,'Section 2'!$C$16:$M$115,COLUMNS('Section 2'!$C$13:D$13),0)))","v":""},{"$f":"IF($D11=\"\",\"\",IF(ISBLANK(VLOOKUP($B11,'Section 2'!$C$16:$M$115,COLUMNS('Section 2'!$C$13:E$13),0)),\"\",VLOOKUP($B11,'Section 2'!$C$16:$M$115,COLUMNS('Section 2'!$C$13:E$13),0)))","v":""},{"$f":"IF($D11=\"\",\"\",IF(ISBLANK(VLOOKUP($B11,'Section 2'!$C$16:$M$115,COLUMNS('Section 2'!$C$13:F$13),0)),\"\",VLOOKUP($B11,'Section 2'!$C$16:$M$115,COLUMNS('Section 2'!$C$13:F$13),0)))","v":""},{"$f":"IF($D11=\"\",\"\",IF(ISBLANK(VLOOKUP($B11,'Section 2'!$C$16:$M$115,COLUMNS('Section 2'!$C$13:G$13),0)),\"\",VLOOKUP($B11,'Section 2'!$C$16:$M$115,COLUMNS('Section 2'!$C$13:G$13),0)))","v":""},{"$f":"IF($D11=\"\",\"\",IF(ISBLANK(VLOOKUP($B11,'Section 2'!$C$16:$M$115,COLUMNS('Section 2'!$C$13:H$13),0)),\"\",VLOOKUP($B11,'Section 2'!$C$16:$M$115,COLUMNS('Section 2'!$C$13:H$13),0)))","v":""},{"$f":"IF($D11=\"\",\"\",IF(ISBLANK(VLOOKUP($B11,'Section 2'!$C$16:$M$115,COLUMNS('Section 2'!$C$13:I$13),0)),\"\",VLOOKUP($B11,'Section 2'!$C$16:$M$115,COLUMNS('Section 2'!$C$13:I$13),0)))","v":""},{"$f":"IF($D11=\"\",\"\",IF(ISBLANK(VLOOKUP($B11,'Section 2'!$C$16:$M$115,COLUMNS('Section 2'!$C$13:J$13),0)),\"\",VLOOKUP($B11,'Section 2'!$C$16:$M$115,COLUMNS('Section 2'!$C$13:J$13),0)))","v":""},{"$f":"IF($D11=\"\",\"\",IF(ISBLANK(VLOOKUP($B11,'Section 2'!$C$16:$M$115,COLUMNS('Section 2'!$C$13:K$13),0)),\"\",VLOOKUP($B11,'Section 2'!$C$16:$M$115,COLUMNS('Section 2'!$C$13:K$13),0)))","v":""},{"$f":"IF($D11=\"\",\"\",IF(ISBLANK(VLOOKUP($B11,'Section 2'!$C$16:$M$115,COLUMNS('Section 2'!$C$13:L$13),0)),\"\",VLOOKUP($B11,'Section 2'!$C$16:$M$115,COLUMNS('Section 2'!$C$13:L$13),0)))","v":""},{"$f":"IF($D11=\"\",\"\",IF(ISBLANK(VLOOKUP($B11,'Section 2'!$C$16:$M$115,COLUMNS('Section 2'!$C$13:M$13),0)),\"\",VLOOKUP($B11,'Section 2'!$C$16:$M$115,COLUMNS('Section 2'!$C$13:M$13),0)))","v":""}]
[{"$f":"IF(D12=\"\",\"\",ROWS($A$1:A12))","v":""},11,"",{"$f":"IFERROR(VLOOKUP($B12,'Section 2'!$C$16:$M$115,COLUMNS('Section 2'!$C$13:C$13),0),\"\")","v":""},{"$f":"IF($D12=\"\",\"\",IF(ISBLANK(VLOOKUP($B12,'Section 2'!$C$16:$M$115,COLUMNS('Section 2'!$C$13:D$13),0)),\"\",VLOOKUP($B12,'Section 2'!$C$16:$M$115,COLUMNS('Section 2'!$C$13:D$13),0)))","v":""},{"$f":"IF($D12=\"\",\"\",IF(ISBLANK(VLOOKUP($B12,'Section 2'!$C$16:$M$115,COLUMNS('Section 2'!$C$13:E$13),0)),\"\",VLOOKUP($B12,'Section 2'!$C$16:$M$115,COLUMNS('Section 2'!$C$13:E$13),0)))","v":""},{"$f":"IF($D12=\"\",\"\",IF(ISBLANK(VLOOKUP($B12,'Section 2'!$C$16:$M$115,COLUMNS('Section 2'!$C$13:F$13),0)),\"\",VLOOKUP($B12,'Section 2'!$C$16:$M$115,COLUMNS('Section 2'!$C$13:F$13),0)))","v":""},{"$f":"IF($D12=\"\",\"\",IF(ISBLANK(VLOOKUP($B12,'Section 2'!$C$16:$M$115,COLUMNS('Section 2'!$C$13:G$13),0)),\"\",VLOOKUP($B12,'Section 2'!$C$16:$M$115,COLUMNS('Section 2'!$C$13:G$13),0)))","v":""},{"$f":"IF($D12=\"\",\"\",IF(ISBLANK(VLOOKUP($B12,'Section 2'!$C$16:$M$115,COLUMNS('Section 2'!$C$13:H$13),0)),\"\",VLOOKUP($B12,'Section 2'!$C$16:$M$115,COLUMNS('Section 2'!$C$13:H$13),0)))","v":""},{"$f":"IF($D12=\"\",\"\",IF(ISBLANK(VLOOKUP($B12,'Section 2'!$C$16:$M$115,COLUMNS('Section 2'!$C$13:I$13),0)),\"\",VLOOKUP($B12,'Section 2'!$C$16:$M$115,COLUMNS('Section 2'!$C$13:I$13),0)))","v":""},{"$f":"IF($D12=\"\",\"\",IF(ISBLANK(VLOOKUP($B12,'Section 2'!$C$16:$M$115,COLUMNS('Section 2'!$C$13:J$13),0)),\"\",VLOOKUP($B12,'Section 2'!$C$16:$M$115,COLUMNS('Section 2'!$C$13:J$13),0)))","v":""},{"$f":"IF($D12=\"\",\"\",IF(ISBLANK(VLOOKUP($B12,'Section 2'!$C$16:$M$115,COLUMNS('Section 2'!$C$13:K$13),0)),\"\",VLOOKUP($B12,'Section 2'!$C$16:$M$115,COLUMNS('Section 2'!$C$13:K$13),0)))","v":""},{"$f":"IF($D12=\"\",\"\",IF(ISBLANK(VLOOKUP($B12,'Section 2'!$C$16:$M$115,COLUMNS('Section 2'!$C$13:L$13),0)),\"\",VLOOKUP($B12,'Section 2'!$C$16:$M$115,COLUMNS('Section 2'!$C$13:L$13),0)))","v":""},{"$f":"IF($D12=\"\",\"\",IF(ISBLANK(VLOOKUP($B12,'Section 2'!$C$16:$M$115,COLUMNS('Section 2'!$C$13:M$13),0)),\"\",VLOOKUP($B12,'Section 2'!$C$16:$M$115,COLUMNS('Section 2'!$C$13:M$13),0)))","v":""}]
[{"$f":"IF(D13=\"\",\"\",ROWS($A$1:A13))","v":""},12,"",{"$f":"IFERROR(VLOOKUP($B13,'Section 2'!$C$16:$M$115,COLUMNS('Section 2'!$C$13:C$13),0),\"\")","v":""},{"$f":"IF($D13=\"\",\"\",IF(ISBLANK(VLOOKUP($B13,'Section 2'!$C$16:$M$115,COLUMNS('Section 2'!$C$13:D$13),0)),\"\",VLOOKUP($B13,'Section 2'!$C$16:$M$115,COLUMNS('Section 2'!$C$13:D$13),0)))","v":""},{"$f":"IF($D13=\"\",\"\",IF(ISBLANK(VLOOKUP($B13,'Section 2'!$C$16:$M$115,COLUMNS('Section 2'!$C$13:E$13),0)),\"\",VLOOKUP($B13,'Section 2'!$C$16:$M$115,COLUMNS('Section 2'!$C$13:E$13),0)))","v":""},{"$f":"IF($D13=\"\",\"\",IF(ISBLANK(VLOOKUP($B13,'Section 2'!$C$16:$M$115,COLUMNS('Section 2'!$C$13:F$13),0)),\"\",VLOOKUP($B13,'Section 2'!$C$16:$M$115,COLUMNS('Section 2'!$C$13:F$13),0)))","v":""},{"$f":"IF($D13=\"\",\"\",IF(ISBLANK(VLOOKUP($B13,'Section 2'!$C$16:$M$115,COLUMNS('Section 2'!$C$13:G$13),0)),\"\",VLOOKUP($B13,'Section 2'!$C$16:$M$115,COLUMNS('Section 2'!$C$13:G$13),0)))","v":""},{"$f":"IF($D13=\"\",\"\",IF(ISBLANK(VLOOKUP($B13,'Section 2'!$C$16:$M$115,COLUMNS('Section 2'!$C$13:H$13),0)),\"\",VLOOKUP($B13,'Section 2'!$C$16:$M$115,COLUMNS('Section 2'!$C$13:H$13),0)))","v":""},{"$f":"IF($D13=\"\",\"\",IF(ISBLANK(VLOOKUP($B13,'Section 2'!$C$16:$M$115,COLUMNS('Section 2'!$C$13:I$13),0)),\"\",VLOOKUP($B13,'Section 2'!$C$16:$M$115,COLUMNS('Section 2'!$C$13:I$13),0)))","v":""},{"$f":"IF($D13=\"\",\"\",IF(ISBLANK(VLOOKUP($B13,'Section 2'!$C$16:$M$115,COLUMNS('Section 2'!$C$13:J$13),0)),\"\",VLOOKUP($B13,'Section 2'!$C$16:$M$115,COLUMNS('Section 2'!$C$13:J$13),0)))","v":""},{"$f":"IF($D13=\"\",\"\",IF(ISBLANK(VLOOKUP($B13,'Section 2'!$C$16:$M$115,COLUMNS('Section 2'!$C$13:K$13),0)),\"\",VLOOKUP($B13,'Section 2'!$C$16:$M$115,COLUMNS('Section 2'!$C$13:K$13),0)))","v":""},{"$f":"IF($D13=\"\",\"\",IF(ISBLANK(VLOOKUP($B13,'Section 2'!$C$16:$M$115,COLUMNS('Section 2'!$C$13:L$13),0)),\"\",VLOOKUP($B13,'Section 2'!$C$16:$M$115,COLUMNS('Section 2'!$C$13:L$13),0)))","v":""},{"$f":"IF($D13=\"\",\"\",IF(ISBLANK(VLOOKUP($B13,'Section 2'!$C$16:$M$115,COLUMNS('Section 2'!$C$13:M$13),0)),\"\",VLOOKUP($B13,'Section 2'!$C$16:$M$115,COLUMNS('Section 2'!$C$13:M$13),0)))","v":""}]
[{"$f":"IF(D14=\"\",\"\",ROWS($A$1:A14))","v":""},13,"",{"$f":"IFERROR(VLOOKUP($B14,'Section 2'!$C$16:$M$115,COLUMNS('Section 2'!$C$13:C$13),0),\"\")","v":""},{"$f":"IF($D14=\"\",\"\",IF(ISBLANK(VLOOKUP($B14,'Section 2'!$C$16:$M$115,COLUMNS('Section 2'!$C$13:D$13),0)),\"\",VLOOKUP($B14,'Section 2'!$C$16:$M$115,COLUMNS('Section 2'!$C$13:D$13),0)))","v":""},{"$f":"IF($D14=\"\",\"\",IF(ISBLANK(VLOOKUP($B14,'Section 2'!$C$16:$M$115,COLUMNS('Section 2'!$C$13:E$13),0)),\"\",VLOOKUP($B14,'Section 2'!$C$16:$M$115,COLUMNS('Section 2'!$C$13:E$13),0)))","v":""},{"$f":"IF($D14=\"\",\"\",IF(ISBLANK(VLOOKUP($B14,'Section 2'!$C$16:$M$115,COLUMNS('Section 2'!$C$13:F$13),0)),\"\",VLOOKUP($B14,'Section 2'!$C$16:$M$115,COLUMNS('Section 2'!$C$13:F$13),0)))","v":""},{"$f":"IF($D14=\"\",\"\",IF(ISBLANK(VLOOKUP($B14,'Section 2'!$C$16:$M$115,COLUMNS('Section 2'!$C$13:G$13),0)),\"\",VLOOKUP($B14,'Section 2'!$C$16:$M$115,COLUMNS('Section 2'!$C$13:G$13),0)))","v":""},{"$f":"IF($D14=\"\",\"\",IF(ISBLANK(VLOOKUP($B14,'Section 2'!$C$16:$M$115,COLUMNS('Section 2'!$C$13:H$13),0)),\"\",VLOOKUP($B14,'Section 2'!$C$16:$M$115,COLUMNS('Section 2'!$C$13:H$13),0)))","v":""},{"$f":"IF($D14=\"\",\"\",IF(ISBLANK(VLOOKUP($B14,'Section 2'!$C$16:$M$115,COLUMNS('Section 2'!$C$13:I$13),0)),\"\",VLOOKUP($B14,'Section 2'!$C$16:$M$115,COLUMNS('Section 2'!$C$13:I$13),0)))","v":""},{"$f":"IF($D14=\"\",\"\",IF(ISBLANK(VLOOKUP($B14,'Section 2'!$C$16:$M$115,COLUMNS('Section 2'!$C$13:J$13),0)),\"\",VLOOKUP($B14,'Section 2'!$C$16:$M$115,COLUMNS('Section 2'!$C$13:J$13),0)))","v":""},{"$f":"IF($D14=\"\",\"\",IF(ISBLANK(VLOOKUP($B14,'Section 2'!$C$16:$M$115,COLUMNS('Section 2'!$C$13:K$13),0)),\"\",VLOOKUP($B14,'Section 2'!$C$16:$M$115,COLUMNS('Section 2'!$C$13:K$13),0)))","v":""},{"$f":"IF($D14=\"\",\"\",IF(ISBLANK(VLOOKUP($B14,'Section 2'!$C$16:$M$115,COLUMNS('Section 2'!$C$13:L$13),0)),\"\",VLOOKUP($B14,'Section 2'!$C$16:$M$115,COLUMNS('Section 2'!$C$13:L$13),0)))","v":""},{"$f":"IF($D14=\"\",\"\",IF(ISBLANK(VLOOKUP($B14,'Section 2'!$C$16:$M$115,COLUMNS('Section 2'!$C$13:M$13),0)),\"\",VLOOKUP($B14,'Section 2'!$C$16:$M$115,COLUMNS('Section 2'!$C$13:M$13),0)))","v":""}]
[{"$f":"IF(D15=\"\",\"\",ROWS($A$1:A15))","v":""},14,"",{"$f":"IFERROR(VLOOKUP($B15,'Section 2'!$C$16:$M$115,COLUMNS('Section 2'!$C$13:C$13),0),\"\")","v":""},{"$f":"IF($D15=\"\",\"\",IF(ISBLANK(VLOOKUP($B15,'Section 2'!$C$16:$M$115,COLUMNS('Section 2'!$C$13:D$13),0)),\"\",VLOOKUP($B15,'Section 2'!$C$16:$M$115,COLUMNS('Section 2'!$C$13:D$13),0)))","v":""},{"$f":"IF($D15=\"\",\"\",IF(ISBLANK(VLOOKUP($B15,'Section 2'!$C$16:$M$115,COLUMNS('Section 2'!$C$13:E$13),0)),\"\",VLOOKUP($B15,'Section 2'!$C$16:$M$115,COLUMNS('Section 2'!$C$13:E$13),0)))","v":""},{"$f":"IF($D15=\"\",\"\",IF(ISBLANK(VLOOKUP($B15,'Section 2'!$C$16:$M$115,COLUMNS('Section 2'!$C$13:F$13),0)),\"\",VLOOKUP($B15,'Section 2'!$C$16:$M$115,COLUMNS('Section 2'!$C$13:F$13),0)))","v":""},{"$f":"IF($D15=\"\",\"\",IF(ISBLANK(VLOOKUP($B15,'Section 2'!$C$16:$M$115,COLUMNS('Section 2'!$C$13:G$13),0)),\"\",VLOOKUP($B15,'Section 2'!$C$16:$M$115,COLUMNS('Section 2'!$C$13:G$13),0)))","v":""},{"$f":"IF($D15=\"\",\"\",IF(ISBLANK(VLOOKUP($B15,'Section 2'!$C$16:$M$115,COLUMNS('Section 2'!$C$13:H$13),0)),\"\",VLOOKUP($B15,'Section 2'!$C$16:$M$115,COLUMNS('Section 2'!$C$13:H$13),0)))","v":""},{"$f":"IF($D15=\"\",\"\",IF(ISBLANK(VLOOKUP($B15,'Section 2'!$C$16:$M$115,COLUMNS('Section 2'!$C$13:I$13),0)),\"\",VLOOKUP($B15,'Section 2'!$C$16:$M$115,COLUMNS('Section 2'!$C$13:I$13),0)))","v":""},{"$f":"IF($D15=\"\",\"\",IF(ISBLANK(VLOOKUP($B15,'Section 2'!$C$16:$M$115,COLUMNS('Section 2'!$C$13:J$13),0)),\"\",VLOOKUP($B15,'Section 2'!$C$16:$M$115,COLUMNS('Section 2'!$C$13:J$13),0)))","v":""},{"$f":"IF($D15=\"\",\"\",IF(ISBLANK(VLOOKUP($B15,'Section 2'!$C$16:$M$115,COLUMNS('Section 2'!$C$13:K$13),0)),\"\",VLOOKUP($B15,'Section 2'!$C$16:$M$115,COLUMNS('Section 2'!$C$13:K$13),0)))","v":""},{"$f":"IF($D15=\"\",\"\",IF(ISBLANK(VLOOKUP($B15,'Section 2'!$C$16:$M$115,COLUMNS('Section 2'!$C$13:L$13),0)),\"\",VLOOKUP($B15,'Section 2'!$C$16:$M$115,COLUMNS('Section 2'!$C$13:L$13),0)))","v":""},{"$f":"IF($D15=\"\",\"\",IF(ISBLANK(VLOOKUP($B15,'Section 2'!$C$16:$M$115,COLUMNS('Section 2'!$C$13:M$13),0)),\"\",VLOOKUP($B15,'Section 2'!$C$16:$M$115,COLUMNS('Section 2'!$C$13:M$13),0)))","v":""}]
[{"$f":"IF(D16=\"\",\"\",ROWS($A$1:A16))","v":""},15,"",{"$f":"IFERROR(VLOOKUP($B16,'Section 2'!$C$16:$M$115,COLUMNS('Section 2'!$C$13:C$13),0),\"\")","v":""},{"$f":"IF($D16=\"\",\"\",IF(ISBLANK(VLOOKUP($B16,'Section 2'!$C$16:$M$115,COLUMNS('Section 2'!$C$13:D$13),0)),\"\",VLOOKUP($B16,'Section 2'!$C$16:$M$115,COLUMNS('Section 2'!$C$13:D$13),0)))","v":""},{"$f":"IF($D16=\"\",\"\",IF(ISBLANK(VLOOKUP($B16,'Section 2'!$C$16:$M$115,COLUMNS('Section 2'!$C$13:E$13),0)),\"\",VLOOKUP($B16,'Section 2'!$C$16:$M$115,COLUMNS('Section 2'!$C$13:E$13),0)))","v":""},{"$f":"IF($D16=\"\",\"\",IF(ISBLANK(VLOOKUP($B16,'Section 2'!$C$16:$M$115,COLUMNS('Section 2'!$C$13:F$13),0)),\"\",VLOOKUP($B16,'Section 2'!$C$16:$M$115,COLUMNS('Section 2'!$C$13:F$13),0)))","v":""},{"$f":"IF($D16=\"\",\"\",IF(ISBLANK(VLOOKUP($B16,'Section 2'!$C$16:$M$115,COLUMNS('Section 2'!$C$13:G$13),0)),\"\",VLOOKUP($B16,'Section 2'!$C$16:$M$115,COLUMNS('Section 2'!$C$13:G$13),0)))","v":""},{"$f":"IF($D16=\"\",\"\",IF(ISBLANK(VLOOKUP($B16,'Section 2'!$C$16:$M$115,COLUMNS('Section 2'!$C$13:H$13),0)),\"\",VLOOKUP($B16,'Section 2'!$C$16:$M$115,COLUMNS('Section 2'!$C$13:H$13),0)))","v":""},{"$f":"IF($D16=\"\",\"\",IF(ISBLANK(VLOOKUP($B16,'Section 2'!$C$16:$M$115,COLUMNS('Section 2'!$C$13:I$13),0)),\"\",VLOOKUP($B16,'Section 2'!$C$16:$M$115,COLUMNS('Section 2'!$C$13:I$13),0)))","v":""},{"$f":"IF($D16=\"\",\"\",IF(ISBLANK(VLOOKUP($B16,'Section 2'!$C$16:$M$115,COLUMNS('Section 2'!$C$13:J$13),0)),\"\",VLOOKUP($B16,'Section 2'!$C$16:$M$115,COLUMNS('Section 2'!$C$13:J$13),0)))","v":""},{"$f":"IF($D16=\"\",\"\",IF(ISBLANK(VLOOKUP($B16,'Section 2'!$C$16:$M$115,COLUMNS('Section 2'!$C$13:K$13),0)),\"\",VLOOKUP($B16,'Section 2'!$C$16:$M$115,COLUMNS('Section 2'!$C$13:K$13),0)))","v":""},{"$f":"IF($D16=\"\",\"\",IF(ISBLANK(VLOOKUP($B16,'Section 2'!$C$16:$M$115,COLUMNS('Section 2'!$C$13:L$13),0)),\"\",VLOOKUP($B16,'Section 2'!$C$16:$M$115,COLUMNS('Section 2'!$C$13:L$13),0)))","v":""},{"$f":"IF($D16=\"\",\"\",IF(ISBLANK(VLOOKUP($B16,'Section 2'!$C$16:$M$115,COLUMNS('Section 2'!$C$13:M$13),0)),\"\",VLOOKUP($B16,'Section 2'!$C$16:$M$115,COLUMNS('Section 2'!$C$13:M$13),0)))","v":""}]
[{"$f":"IF(D17=\"\",\"\",ROWS($A$1:A17))","v":""},16,"",{"$f":"IFERROR(VLOOKUP($B17,'Section 2'!$C$16:$M$115,COLUMNS('Section 2'!$C$13:C$13),0),\"\")","v":""},{"$f":"IF($D17=\"\",\"\",IF(ISBLANK(VLOOKUP($B17,'Section 2'!$C$16:$M$115,COLUMNS('Section 2'!$C$13:D$13),0)),\"\",VLOOKUP($B17,'Section 2'!$C$16:$M$115,COLUMNS('Section 2'!$C$13:D$13),0)))","v":""},{"$f":"IF($D17=\"\",\"\",IF(ISBLANK(VLOOKUP($B17,'Section 2'!$C$16:$M$115,COLUMNS('Section 2'!$C$13:E$13),0)),\"\",VLOOKUP($B17,'Section 2'!$C$16:$M$115,COLUMNS('Section 2'!$C$13:E$13),0)))","v":""},{"$f":"IF($D17=\"\",\"\",IF(ISBLANK(VLOOKUP($B17,'Section 2'!$C$16:$M$115,COLUMNS('Section 2'!$C$13:F$13),0)),\"\",VLOOKUP($B17,'Section 2'!$C$16:$M$115,COLUMNS('Section 2'!$C$13:F$13),0)))","v":""},{"$f":"IF($D17=\"\",\"\",IF(ISBLANK(VLOOKUP($B17,'Section 2'!$C$16:$M$115,COLUMNS('Section 2'!$C$13:G$13),0)),\"\",VLOOKUP($B17,'Section 2'!$C$16:$M$115,COLUMNS('Section 2'!$C$13:G$13),0)))","v":""},{"$f":"IF($D17=\"\",\"\",IF(ISBLANK(VLOOKUP($B17,'Section 2'!$C$16:$M$115,COLUMNS('Section 2'!$C$13:H$13),0)),\"\",VLOOKUP($B17,'Section 2'!$C$16:$M$115,COLUMNS('Section 2'!$C$13:H$13),0)))","v":""},{"$f":"IF($D17=\"\",\"\",IF(ISBLANK(VLOOKUP($B17,'Section 2'!$C$16:$M$115,COLUMNS('Section 2'!$C$13:I$13),0)),\"\",VLOOKUP($B17,'Section 2'!$C$16:$M$115,COLUMNS('Section 2'!$C$13:I$13),0)))","v":""},{"$f":"IF($D17=\"\",\"\",IF(ISBLANK(VLOOKUP($B17,'Section 2'!$C$16:$M$115,COLUMNS('Section 2'!$C$13:J$13),0)),\"\",VLOOKUP($B17,'Section 2'!$C$16:$M$115,COLUMNS('Section 2'!$C$13:J$13),0)))","v":""},{"$f":"IF($D17=\"\",\"\",IF(ISBLANK(VLOOKUP($B17,'Section 2'!$C$16:$M$115,COLUMNS('Section 2'!$C$13:K$13),0)),\"\",VLOOKUP($B17,'Section 2'!$C$16:$M$115,COLUMNS('Section 2'!$C$13:K$13),0)))","v":""},{"$f":"IF($D17=\"\",\"\",IF(ISBLANK(VLOOKUP($B17,'Section 2'!$C$16:$M$115,COLUMNS('Section 2'!$C$13:L$13),0)),\"\",VLOOKUP($B17,'Section 2'!$C$16:$M$115,COLUMNS('Section 2'!$C$13:L$13),0)))","v":""},{"$f":"IF($D17=\"\",\"\",IF(ISBLANK(VLOOKUP($B17,'Section 2'!$C$16:$M$115,COLUMNS('Section 2'!$C$13:M$13),0)),\"\",VLOOKUP($B17,'Section 2'!$C$16:$M$115,COLUMNS('Section 2'!$C$13:M$13),0)))","v":""}]
[{"$f":"IF(D18=\"\",\"\",ROWS($A$1:A18))","v":""},17,"",{"$f":"IFERROR(VLOOKUP($B18,'Section 2'!$C$16:$M$115,COLUMNS('Section 2'!$C$13:C$13),0),\"\")","v":""},{"$f":"IF($D18=\"\",\"\",IF(ISBLANK(VLOOKUP($B18,'Section 2'!$C$16:$M$115,COLUMNS('Section 2'!$C$13:D$13),0)),\"\",VLOOKUP($B18,'Section 2'!$C$16:$M$115,COLUMNS('Section 2'!$C$13:D$13),0)))","v":""},{"$f":"IF($D18=\"\",\"\",IF(ISBLANK(VLOOKUP($B18,'Section 2'!$C$16:$M$115,COLUMNS('Section 2'!$C$13:E$13),0)),\"\",VLOOKUP($B18,'Section 2'!$C$16:$M$115,COLUMNS('Section 2'!$C$13:E$13),0)))","v":""},{"$f":"IF($D18=\"\",\"\",IF(ISBLANK(VLOOKUP($B18,'Section 2'!$C$16:$M$115,COLUMNS('Section 2'!$C$13:F$13),0)),\"\",VLOOKUP($B18,'Section 2'!$C$16:$M$115,COLUMNS('Section 2'!$C$13:F$13),0)))","v":""},{"$f":"IF($D18=\"\",\"\",IF(ISBLANK(VLOOKUP($B18,'Section 2'!$C$16:$M$115,COLUMNS('Section 2'!$C$13:G$13),0)),\"\",VLOOKUP($B18,'Section 2'!$C$16:$M$115,COLUMNS('Section 2'!$C$13:G$13),0)))","v":""},{"$f":"IF($D18=\"\",\"\",IF(ISBLANK(VLOOKUP($B18,'Section 2'!$C$16:$M$115,COLUMNS('Section 2'!$C$13:H$13),0)),\"\",VLOOKUP($B18,'Section 2'!$C$16:$M$115,COLUMNS('Section 2'!$C$13:H$13),0)))","v":""},{"$f":"IF($D18=\"\",\"\",IF(ISBLANK(VLOOKUP($B18,'Section 2'!$C$16:$M$115,COLUMNS('Section 2'!$C$13:I$13),0)),\"\",VLOOKUP($B18,'Section 2'!$C$16:$M$115,COLUMNS('Section 2'!$C$13:I$13),0)))","v":""},{"$f":"IF($D18=\"\",\"\",IF(ISBLANK(VLOOKUP($B18,'Section 2'!$C$16:$M$115,COLUMNS('Section 2'!$C$13:J$13),0)),\"\",VLOOKUP($B18,'Section 2'!$C$16:$M$115,COLUMNS('Section 2'!$C$13:J$13),0)))","v":""},{"$f":"IF($D18=\"\",\"\",IF(ISBLANK(VLOOKUP($B18,'Section 2'!$C$16:$M$115,COLUMNS('Section 2'!$C$13:K$13),0)),\"\",VLOOKUP($B18,'Section 2'!$C$16:$M$115,COLUMNS('Section 2'!$C$13:K$13),0)))","v":""},{"$f":"IF($D18=\"\",\"\",IF(ISBLANK(VLOOKUP($B18,'Section 2'!$C$16:$M$115,COLUMNS('Section 2'!$C$13:L$13),0)),\"\",VLOOKUP($B18,'Section 2'!$C$16:$M$115,COLUMNS('Section 2'!$C$13:L$13),0)))","v":""},{"$f":"IF($D18=\"\",\"\",IF(ISBLANK(VLOOKUP($B18,'Section 2'!$C$16:$M$115,COLUMNS('Section 2'!$C$13:M$13),0)),\"\",VLOOKUP($B18,'Section 2'!$C$16:$M$115,COLUMNS('Section 2'!$C$13:M$13),0)))","v":""}]
[{"$f":"IF(D19=\"\",\"\",ROWS($A$1:A19))","v":""},18,"",{"$f":"IFERROR(VLOOKUP($B19,'Section 2'!$C$16:$M$115,COLUMNS('Section 2'!$C$13:C$13),0),\"\")","v":""},{"$f":"IF($D19=\"\",\"\",IF(ISBLANK(VLOOKUP($B19,'Section 2'!$C$16:$M$115,COLUMNS('Section 2'!$C$13:D$13),0)),\"\",VLOOKUP($B19,'Section 2'!$C$16:$M$115,COLUMNS('Section 2'!$C$13:D$13),0)))","v":""},{"$f":"IF($D19=\"\",\"\",IF(ISBLANK(VLOOKUP($B19,'Section 2'!$C$16:$M$115,COLUMNS('Section 2'!$C$13:E$13),0)),\"\",VLOOKUP($B19,'Section 2'!$C$16:$M$115,COLUMNS('Section 2'!$C$13:E$13),0)))","v":""},{"$f":"IF($D19=\"\",\"\",IF(ISBLANK(VLOOKUP($B19,'Section 2'!$C$16:$M$115,COLUMNS('Section 2'!$C$13:F$13),0)),\"\",VLOOKUP($B19,'Section 2'!$C$16:$M$115,COLUMNS('Section 2'!$C$13:F$13),0)))","v":""},{"$f":"IF($D19=\"\",\"\",IF(ISBLANK(VLOOKUP($B19,'Section 2'!$C$16:$M$115,COLUMNS('Section 2'!$C$13:G$13),0)),\"\",VLOOKUP($B19,'Section 2'!$C$16:$M$115,COLUMNS('Section 2'!$C$13:G$13),0)))","v":""},{"$f":"IF($D19=\"\",\"\",IF(ISBLANK(VLOOKUP($B19,'Section 2'!$C$16:$M$115,COLUMNS('Section 2'!$C$13:H$13),0)),\"\",VLOOKUP($B19,'Section 2'!$C$16:$M$115,COLUMNS('Section 2'!$C$13:H$13),0)))","v":""},{"$f":"IF($D19=\"\",\"\",IF(ISBLANK(VLOOKUP($B19,'Section 2'!$C$16:$M$115,COLUMNS('Section 2'!$C$13:I$13),0)),\"\",VLOOKUP($B19,'Section 2'!$C$16:$M$115,COLUMNS('Section 2'!$C$13:I$13),0)))","v":""},{"$f":"IF($D19=\"\",\"\",IF(ISBLANK(VLOOKUP($B19,'Section 2'!$C$16:$M$115,COLUMNS('Section 2'!$C$13:J$13),0)),\"\",VLOOKUP($B19,'Section 2'!$C$16:$M$115,COLUMNS('Section 2'!$C$13:J$13),0)))","v":""},{"$f":"IF($D19=\"\",\"\",IF(ISBLANK(VLOOKUP($B19,'Section 2'!$C$16:$M$115,COLUMNS('Section 2'!$C$13:K$13),0)),\"\",VLOOKUP($B19,'Section 2'!$C$16:$M$115,COLUMNS('Section 2'!$C$13:K$13),0)))","v":""},{"$f":"IF($D19=\"\",\"\",IF(ISBLANK(VLOOKUP($B19,'Section 2'!$C$16:$M$115,COLUMNS('Section 2'!$C$13:L$13),0)),\"\",VLOOKUP($B19,'Section 2'!$C$16:$M$115,COLUMNS('Section 2'!$C$13:L$13),0)))","v":""},{"$f":"IF($D19=\"\",\"\",IF(ISBLANK(VLOOKUP($B19,'Section 2'!$C$16:$M$115,COLUMNS('Section 2'!$C$13:M$13),0)),\"\",VLOOKUP($B19,'Section 2'!$C$16:$M$115,COLUMNS('Section 2'!$C$13:M$13),0)))","v":""}]
[{"$f":"IF(D20=\"\",\"\",ROWS($A$1:A20))","v":""},19,"",{"$f":"IFERROR(VLOOKUP($B20,'Section 2'!$C$16:$M$115,COLUMNS('Section 2'!$C$13:C$13),0),\"\")","v":""},{"$f":"IF($D20=\"\",\"\",IF(ISBLANK(VLOOKUP($B20,'Section 2'!$C$16:$M$115,COLUMNS('Section 2'!$C$13:D$13),0)),\"\",VLOOKUP($B20,'Section 2'!$C$16:$M$115,COLUMNS('Section 2'!$C$13:D$13),0)))","v":""},{"$f":"IF($D20=\"\",\"\",IF(ISBLANK(VLOOKUP($B20,'Section 2'!$C$16:$M$115,COLUMNS('Section 2'!$C$13:E$13),0)),\"\",VLOOKUP($B20,'Section 2'!$C$16:$M$115,COLUMNS('Section 2'!$C$13:E$13),0)))","v":""},{"$f":"IF($D20=\"\",\"\",IF(ISBLANK(VLOOKUP($B20,'Section 2'!$C$16:$M$115,COLUMNS('Section 2'!$C$13:F$13),0)),\"\",VLOOKUP($B20,'Section 2'!$C$16:$M$115,COLUMNS('Section 2'!$C$13:F$13),0)))","v":""},{"$f":"IF($D20=\"\",\"\",IF(ISBLANK(VLOOKUP($B20,'Section 2'!$C$16:$M$115,COLUMNS('Section 2'!$C$13:G$13),0)),\"\",VLOOKUP($B20,'Section 2'!$C$16:$M$115,COLUMNS('Section 2'!$C$13:G$13),0)))","v":""},{"$f":"IF($D20=\"\",\"\",IF(ISBLANK(VLOOKUP($B20,'Section 2'!$C$16:$M$115,COLUMNS('Section 2'!$C$13:H$13),0)),\"\",VLOOKUP($B20,'Section 2'!$C$16:$M$115,COLUMNS('Section 2'!$C$13:H$13),0)))","v":""},{"$f":"IF($D20=\"\",\"\",IF(ISBLANK(VLOOKUP($B20,'Section 2'!$C$16:$M$115,COLUMNS('Section 2'!$C$13:I$13),0)),\"\",VLOOKUP($B20,'Section 2'!$C$16:$M$115,COLUMNS('Section 2'!$C$13:I$13),0)))","v":""},{"$f":"IF($D20=\"\",\"\",IF(ISBLANK(VLOOKUP($B20,'Section 2'!$C$16:$M$115,COLUMNS('Section 2'!$C$13:J$13),0)),\"\",VLOOKUP($B20,'Section 2'!$C$16:$M$115,COLUMNS('Section 2'!$C$13:J$13),0)))","v":""},{"$f":"IF($D20=\"\",\"\",IF(ISBLANK(VLOOKUP($B20,'Section 2'!$C$16:$M$115,COLUMNS('Section 2'!$C$13:K$13),0)),\"\",VLOOKUP($B20,'Section 2'!$C$16:$M$115,COLUMNS('Section 2'!$C$13:K$13),0)))","v":""},{"$f":"IF($D20=\"\",\"\",IF(ISBLANK(VLOOKUP($B20,'Section 2'!$C$16:$M$115,COLUMNS('Section 2'!$C$13:L$13),0)),\"\",VLOOKUP($B20,'Section 2'!$C$16:$M$115,COLUMNS('Section 2'!$C$13:L$13),0)))","v":""},{"$f":"IF($D20=\"\",\"\",IF(ISBLANK(VLOOKUP($B20,'Section 2'!$C$16:$M$115,COLUMNS('Section 2'!$C$13:M$13),0)),\"\",VLOOKUP($B20,'Section 2'!$C$16:$M$115,COLUMNS('Section 2'!$C$13:M$13),0)))","v":""}]
[{"$f":"IF(D21=\"\",\"\",ROWS($A$1:A21))","v":""},20,"",{"$f":"IFERROR(VLOOKUP($B21,'Section 2'!$C$16:$M$115,COLUMNS('Section 2'!$C$13:C$13),0),\"\")","v":""},{"$f":"IF($D21=\"\",\"\",IF(ISBLANK(VLOOKUP($B21,'Section 2'!$C$16:$M$115,COLUMNS('Section 2'!$C$13:D$13),0)),\"\",VLOOKUP($B21,'Section 2'!$C$16:$M$115,COLUMNS('Section 2'!$C$13:D$13),0)))","v":""},{"$f":"IF($D21=\"\",\"\",IF(ISBLANK(VLOOKUP($B21,'Section 2'!$C$16:$M$115,COLUMNS('Section 2'!$C$13:E$13),0)),\"\",VLOOKUP($B21,'Section 2'!$C$16:$M$115,COLUMNS('Section 2'!$C$13:E$13),0)))","v":""},{"$f":"IF($D21=\"\",\"\",IF(ISBLANK(VLOOKUP($B21,'Section 2'!$C$16:$M$115,COLUMNS('Section 2'!$C$13:F$13),0)),\"\",VLOOKUP($B21,'Section 2'!$C$16:$M$115,COLUMNS('Section 2'!$C$13:F$13),0)))","v":""},{"$f":"IF($D21=\"\",\"\",IF(ISBLANK(VLOOKUP($B21,'Section 2'!$C$16:$M$115,COLUMNS('Section 2'!$C$13:G$13),0)),\"\",VLOOKUP($B21,'Section 2'!$C$16:$M$115,COLUMNS('Section 2'!$C$13:G$13),0)))","v":""},{"$f":"IF($D21=\"\",\"\",IF(ISBLANK(VLOOKUP($B21,'Section 2'!$C$16:$M$115,COLUMNS('Section 2'!$C$13:H$13),0)),\"\",VLOOKUP($B21,'Section 2'!$C$16:$M$115,COLUMNS('Section 2'!$C$13:H$13),0)))","v":""},{"$f":"IF($D21=\"\",\"\",IF(ISBLANK(VLOOKUP($B21,'Section 2'!$C$16:$M$115,COLUMNS('Section 2'!$C$13:I$13),0)),\"\",VLOOKUP($B21,'Section 2'!$C$16:$M$115,COLUMNS('Section 2'!$C$13:I$13),0)))","v":""},{"$f":"IF($D21=\"\",\"\",IF(ISBLANK(VLOOKUP($B21,'Section 2'!$C$16:$M$115,COLUMNS('Section 2'!$C$13:J$13),0)),\"\",VLOOKUP($B21,'Section 2'!$C$16:$M$115,COLUMNS('Section 2'!$C$13:J$13),0)))","v":""},{"$f":"IF($D21=\"\",\"\",IF(ISBLANK(VLOOKUP($B21,'Section 2'!$C$16:$M$115,COLUMNS('Section 2'!$C$13:K$13),0)),\"\",VLOOKUP($B21,'Section 2'!$C$16:$M$115,COLUMNS('Section 2'!$C$13:K$13),0)))","v":""},{"$f":"IF($D21=\"\",\"\",IF(ISBLANK(VLOOKUP($B21,'Section 2'!$C$16:$M$115,COLUMNS('Section 2'!$C$13:L$13),0)),\"\",VLOOKUP($B21,'Section 2'!$C$16:$M$115,COLUMNS('Section 2'!$C$13:L$13),0)))","v":""},{"$f":"IF($D21=\"\",\"\",IF(ISBLANK(VLOOKUP($B21,'Section 2'!$C$16:$M$115,COLUMNS('Section 2'!$C$13:M$13),0)),\"\",VLOOKUP($B21,'Section 2'!$C$16:$M$115,COLUMNS('Section 2'!$C$13:M$13),0)))","v":""}]
[{"$f":"IF(D22=\"\",\"\",ROWS($A$1:A22))","v":""},21,"",{"$f":"IFERROR(VLOOKUP($B22,'Section 2'!$C$16:$M$115,COLUMNS('Section 2'!$C$13:C$13),0),\"\")","v":""},{"$f":"IF($D22=\"\",\"\",IF(ISBLANK(VLOOKUP($B22,'Section 2'!$C$16:$M$115,COLUMNS('Section 2'!$C$13:D$13),0)),\"\",VLOOKUP($B22,'Section 2'!$C$16:$M$115,COLUMNS('Section 2'!$C$13:D$13),0)))","v":""},{"$f":"IF($D22=\"\",\"\",IF(ISBLANK(VLOOKUP($B22,'Section 2'!$C$16:$M$115,COLUMNS('Section 2'!$C$13:E$13),0)),\"\",VLOOKUP($B22,'Section 2'!$C$16:$M$115,COLUMNS('Section 2'!$C$13:E$13),0)))","v":""},{"$f":"IF($D22=\"\",\"\",IF(ISBLANK(VLOOKUP($B22,'Section 2'!$C$16:$M$115,COLUMNS('Section 2'!$C$13:F$13),0)),\"\",VLOOKUP($B22,'Section 2'!$C$16:$M$115,COLUMNS('Section 2'!$C$13:F$13),0)))","v":""},{"$f":"IF($D22=\"\",\"\",IF(ISBLANK(VLOOKUP($B22,'Section 2'!$C$16:$M$115,COLUMNS('Section 2'!$C$13:G$13),0)),\"\",VLOOKUP($B22,'Section 2'!$C$16:$M$115,COLUMNS('Section 2'!$C$13:G$13),0)))","v":""},{"$f":"IF($D22=\"\",\"\",IF(ISBLANK(VLOOKUP($B22,'Section 2'!$C$16:$M$115,COLUMNS('Section 2'!$C$13:H$13),0)),\"\",VLOOKUP($B22,'Section 2'!$C$16:$M$115,COLUMNS('Section 2'!$C$13:H$13),0)))","v":""},{"$f":"IF($D22=\"\",\"\",IF(ISBLANK(VLOOKUP($B22,'Section 2'!$C$16:$M$115,COLUMNS('Section 2'!$C$13:I$13),0)),\"\",VLOOKUP($B22,'Section 2'!$C$16:$M$115,COLUMNS('Section 2'!$C$13:I$13),0)))","v":""},{"$f":"IF($D22=\"\",\"\",IF(ISBLANK(VLOOKUP($B22,'Section 2'!$C$16:$M$115,COLUMNS('Section 2'!$C$13:J$13),0)),\"\",VLOOKUP($B22,'Section 2'!$C$16:$M$115,COLUMNS('Section 2'!$C$13:J$13),0)))","v":""},{"$f":"IF($D22=\"\",\"\",IF(ISBLANK(VLOOKUP($B22,'Section 2'!$C$16:$M$115,COLUMNS('Section 2'!$C$13:K$13),0)),\"\",VLOOKUP($B22,'Section 2'!$C$16:$M$115,COLUMNS('Section 2'!$C$13:K$13),0)))","v":""},{"$f":"IF($D22=\"\",\"\",IF(ISBLANK(VLOOKUP($B22,'Section 2'!$C$16:$M$115,COLUMNS('Section 2'!$C$13:L$13),0)),\"\",VLOOKUP($B22,'Section 2'!$C$16:$M$115,COLUMNS('Section 2'!$C$13:L$13),0)))","v":""},{"$f":"IF($D22=\"\",\"\",IF(ISBLANK(VLOOKUP($B22,'Section 2'!$C$16:$M$115,COLUMNS('Section 2'!$C$13:M$13),0)),\"\",VLOOKUP($B22,'Section 2'!$C$16:$M$115,COLUMNS('Section 2'!$C$13:M$13),0)))","v":""}]
[{"$f":"IF(D23=\"\",\"\",ROWS($A$1:A23))","v":""},22,"",{"$f":"IFERROR(VLOOKUP($B23,'Section 2'!$C$16:$M$115,COLUMNS('Section 2'!$C$13:C$13),0),\"\")","v":""},{"$f":"IF($D23=\"\",\"\",IF(ISBLANK(VLOOKUP($B23,'Section 2'!$C$16:$M$115,COLUMNS('Section 2'!$C$13:D$13),0)),\"\",VLOOKUP($B23,'Section 2'!$C$16:$M$115,COLUMNS('Section 2'!$C$13:D$13),0)))","v":""},{"$f":"IF($D23=\"\",\"\",IF(ISBLANK(VLOOKUP($B23,'Section 2'!$C$16:$M$115,COLUMNS('Section 2'!$C$13:E$13),0)),\"\",VLOOKUP($B23,'Section 2'!$C$16:$M$115,COLUMNS('Section 2'!$C$13:E$13),0)))","v":""},{"$f":"IF($D23=\"\",\"\",IF(ISBLANK(VLOOKUP($B23,'Section 2'!$C$16:$M$115,COLUMNS('Section 2'!$C$13:F$13),0)),\"\",VLOOKUP($B23,'Section 2'!$C$16:$M$115,COLUMNS('Section 2'!$C$13:F$13),0)))","v":""},{"$f":"IF($D23=\"\",\"\",IF(ISBLANK(VLOOKUP($B23,'Section 2'!$C$16:$M$115,COLUMNS('Section 2'!$C$13:G$13),0)),\"\",VLOOKUP($B23,'Section 2'!$C$16:$M$115,COLUMNS('Section 2'!$C$13:G$13),0)))","v":""},{"$f":"IF($D23=\"\",\"\",IF(ISBLANK(VLOOKUP($B23,'Section 2'!$C$16:$M$115,COLUMNS('Section 2'!$C$13:H$13),0)),\"\",VLOOKUP($B23,'Section 2'!$C$16:$M$115,COLUMNS('Section 2'!$C$13:H$13),0)))","v":""},{"$f":"IF($D23=\"\",\"\",IF(ISBLANK(VLOOKUP($B23,'Section 2'!$C$16:$M$115,COLUMNS('Section 2'!$C$13:I$13),0)),\"\",VLOOKUP($B23,'Section 2'!$C$16:$M$115,COLUMNS('Section 2'!$C$13:I$13),0)))","v":""},{"$f":"IF($D23=\"\",\"\",IF(ISBLANK(VLOOKUP($B23,'Section 2'!$C$16:$M$115,COLUMNS('Section 2'!$C$13:J$13),0)),\"\",VLOOKUP($B23,'Section 2'!$C$16:$M$115,COLUMNS('Section 2'!$C$13:J$13),0)))","v":""},{"$f":"IF($D23=\"\",\"\",IF(ISBLANK(VLOOKUP($B23,'Section 2'!$C$16:$M$115,COLUMNS('Section 2'!$C$13:K$13),0)),\"\",VLOOKUP($B23,'Section 2'!$C$16:$M$115,COLUMNS('Section 2'!$C$13:K$13),0)))","v":""},{"$f":"IF($D23=\"\",\"\",IF(ISBLANK(VLOOKUP($B23,'Section 2'!$C$16:$M$115,COLUMNS('Section 2'!$C$13:L$13),0)),\"\",VLOOKUP($B23,'Section 2'!$C$16:$M$115,COLUMNS('Section 2'!$C$13:L$13),0)))","v":""},{"$f":"IF($D23=\"\",\"\",IF(ISBLANK(VLOOKUP($B23,'Section 2'!$C$16:$M$115,COLUMNS('Section 2'!$C$13:M$13),0)),\"\",VLOOKUP($B23,'Section 2'!$C$16:$M$115,COLUMNS('Section 2'!$C$13:M$13),0)))","v":""}]
[{"$f":"IF(D24=\"\",\"\",ROWS($A$1:A24))","v":""},23,"",{"$f":"IFERROR(VLOOKUP($B24,'Section 2'!$C$16:$M$115,COLUMNS('Section 2'!$C$13:C$13),0),\"\")","v":""},{"$f":"IF($D24=\"\",\"\",IF(ISBLANK(VLOOKUP($B24,'Section 2'!$C$16:$M$115,COLUMNS('Section 2'!$C$13:D$13),0)),\"\",VLOOKUP($B24,'Section 2'!$C$16:$M$115,COLUMNS('Section 2'!$C$13:D$13),0)))","v":""},{"$f":"IF($D24=\"\",\"\",IF(ISBLANK(VLOOKUP($B24,'Section 2'!$C$16:$M$115,COLUMNS('Section 2'!$C$13:E$13),0)),\"\",VLOOKUP($B24,'Section 2'!$C$16:$M$115,COLUMNS('Section 2'!$C$13:E$13),0)))","v":""},{"$f":"IF($D24=\"\",\"\",IF(ISBLANK(VLOOKUP($B24,'Section 2'!$C$16:$M$115,COLUMNS('Section 2'!$C$13:F$13),0)),\"\",VLOOKUP($B24,'Section 2'!$C$16:$M$115,COLUMNS('Section 2'!$C$13:F$13),0)))","v":""},{"$f":"IF($D24=\"\",\"\",IF(ISBLANK(VLOOKUP($B24,'Section 2'!$C$16:$M$115,COLUMNS('Section 2'!$C$13:G$13),0)),\"\",VLOOKUP($B24,'Section 2'!$C$16:$M$115,COLUMNS('Section 2'!$C$13:G$13),0)))","v":""},{"$f":"IF($D24=\"\",\"\",IF(ISBLANK(VLOOKUP($B24,'Section 2'!$C$16:$M$115,COLUMNS('Section 2'!$C$13:H$13),0)),\"\",VLOOKUP($B24,'Section 2'!$C$16:$M$115,COLUMNS('Section 2'!$C$13:H$13),0)))","v":""},{"$f":"IF($D24=\"\",\"\",IF(ISBLANK(VLOOKUP($B24,'Section 2'!$C$16:$M$115,COLUMNS('Section 2'!$C$13:I$13),0)),\"\",VLOOKUP($B24,'Section 2'!$C$16:$M$115,COLUMNS('Section 2'!$C$13:I$13),0)))","v":""},{"$f":"IF($D24=\"\",\"\",IF(ISBLANK(VLOOKUP($B24,'Section 2'!$C$16:$M$115,COLUMNS('Section 2'!$C$13:J$13),0)),\"\",VLOOKUP($B24,'Section 2'!$C$16:$M$115,COLUMNS('Section 2'!$C$13:J$13),0)))","v":""},{"$f":"IF($D24=\"\",\"\",IF(ISBLANK(VLOOKUP($B24,'Section 2'!$C$16:$M$115,COLUMNS('Section 2'!$C$13:K$13),0)),\"\",VLOOKUP($B24,'Section 2'!$C$16:$M$115,COLUMNS('Section 2'!$C$13:K$13),0)))","v":""},{"$f":"IF($D24=\"\",\"\",IF(ISBLANK(VLOOKUP($B24,'Section 2'!$C$16:$M$115,COLUMNS('Section 2'!$C$13:L$13),0)),\"\",VLOOKUP($B24,'Section 2'!$C$16:$M$115,COLUMNS('Section 2'!$C$13:L$13),0)))","v":""},{"$f":"IF($D24=\"\",\"\",IF(ISBLANK(VLOOKUP($B24,'Section 2'!$C$16:$M$115,COLUMNS('Section 2'!$C$13:M$13),0)),\"\",VLOOKUP($B24,'Section 2'!$C$16:$M$115,COLUMNS('Section 2'!$C$13:M$13),0)))","v":""}]
[{"$f":"IF(D25=\"\",\"\",ROWS($A$1:A25))","v":""},24,"",{"$f":"IFERROR(VLOOKUP($B25,'Section 2'!$C$16:$M$115,COLUMNS('Section 2'!$C$13:C$13),0),\"\")","v":""},{"$f":"IF($D25=\"\",\"\",IF(ISBLANK(VLOOKUP($B25,'Section 2'!$C$16:$M$115,COLUMNS('Section 2'!$C$13:D$13),0)),\"\",VLOOKUP($B25,'Section 2'!$C$16:$M$115,COLUMNS('Section 2'!$C$13:D$13),0)))","v":""},{"$f":"IF($D25=\"\",\"\",IF(ISBLANK(VLOOKUP($B25,'Section 2'!$C$16:$M$115,COLUMNS('Section 2'!$C$13:E$13),0)),\"\",VLOOKUP($B25,'Section 2'!$C$16:$M$115,COLUMNS('Section 2'!$C$13:E$13),0)))","v":""},{"$f":"IF($D25=\"\",\"\",IF(ISBLANK(VLOOKUP($B25,'Section 2'!$C$16:$M$115,COLUMNS('Section 2'!$C$13:F$13),0)),\"\",VLOOKUP($B25,'Section 2'!$C$16:$M$115,COLUMNS('Section 2'!$C$13:F$13),0)))","v":""},{"$f":"IF($D25=\"\",\"\",IF(ISBLANK(VLOOKUP($B25,'Section 2'!$C$16:$M$115,COLUMNS('Section 2'!$C$13:G$13),0)),\"\",VLOOKUP($B25,'Section 2'!$C$16:$M$115,COLUMNS('Section 2'!$C$13:G$13),0)))","v":""},{"$f":"IF($D25=\"\",\"\",IF(ISBLANK(VLOOKUP($B25,'Section 2'!$C$16:$M$115,COLUMNS('Section 2'!$C$13:H$13),0)),\"\",VLOOKUP($B25,'Section 2'!$C$16:$M$115,COLUMNS('Section 2'!$C$13:H$13),0)))","v":""},{"$f":"IF($D25=\"\",\"\",IF(ISBLANK(VLOOKUP($B25,'Section 2'!$C$16:$M$115,COLUMNS('Section 2'!$C$13:I$13),0)),\"\",VLOOKUP($B25,'Section 2'!$C$16:$M$115,COLUMNS('Section 2'!$C$13:I$13),0)))","v":""},{"$f":"IF($D25=\"\",\"\",IF(ISBLANK(VLOOKUP($B25,'Section 2'!$C$16:$M$115,COLUMNS('Section 2'!$C$13:J$13),0)),\"\",VLOOKUP($B25,'Section 2'!$C$16:$M$115,COLUMNS('Section 2'!$C$13:J$13),0)))","v":""},{"$f":"IF($D25=\"\",\"\",IF(ISBLANK(VLOOKUP($B25,'Section 2'!$C$16:$M$115,COLUMNS('Section 2'!$C$13:K$13),0)),\"\",VLOOKUP($B25,'Section 2'!$C$16:$M$115,COLUMNS('Section 2'!$C$13:K$13),0)))","v":""},{"$f":"IF($D25=\"\",\"\",IF(ISBLANK(VLOOKUP($B25,'Section 2'!$C$16:$M$115,COLUMNS('Section 2'!$C$13:L$13),0)),\"\",VLOOKUP($B25,'Section 2'!$C$16:$M$115,COLUMNS('Section 2'!$C$13:L$13),0)))","v":""},{"$f":"IF($D25=\"\",\"\",IF(ISBLANK(VLOOKUP($B25,'Section 2'!$C$16:$M$115,COLUMNS('Section 2'!$C$13:M$13),0)),\"\",VLOOKUP($B25,'Section 2'!$C$16:$M$115,COLUMNS('Section 2'!$C$13:M$13),0)))","v":""}]
[{"$f":"IF(D26=\"\",\"\",ROWS($A$1:A26))","v":""},25,"",{"$f":"IFERROR(VLOOKUP($B26,'Section 2'!$C$16:$M$115,COLUMNS('Section 2'!$C$13:C$13),0),\"\")","v":""},{"$f":"IF($D26=\"\",\"\",IF(ISBLANK(VLOOKUP($B26,'Section 2'!$C$16:$M$115,COLUMNS('Section 2'!$C$13:D$13),0)),\"\",VLOOKUP($B26,'Section 2'!$C$16:$M$115,COLUMNS('Section 2'!$C$13:D$13),0)))","v":""},{"$f":"IF($D26=\"\",\"\",IF(ISBLANK(VLOOKUP($B26,'Section 2'!$C$16:$M$115,COLUMNS('Section 2'!$C$13:E$13),0)),\"\",VLOOKUP($B26,'Section 2'!$C$16:$M$115,COLUMNS('Section 2'!$C$13:E$13),0)))","v":""},{"$f":"IF($D26=\"\",\"\",IF(ISBLANK(VLOOKUP($B26,'Section 2'!$C$16:$M$115,COLUMNS('Section 2'!$C$13:F$13),0)),\"\",VLOOKUP($B26,'Section 2'!$C$16:$M$115,COLUMNS('Section 2'!$C$13:F$13),0)))","v":""},{"$f":"IF($D26=\"\",\"\",IF(ISBLANK(VLOOKUP($B26,'Section 2'!$C$16:$M$115,COLUMNS('Section 2'!$C$13:G$13),0)),\"\",VLOOKUP($B26,'Section 2'!$C$16:$M$115,COLUMNS('Section 2'!$C$13:G$13),0)))","v":""},{"$f":"IF($D26=\"\",\"\",IF(ISBLANK(VLOOKUP($B26,'Section 2'!$C$16:$M$115,COLUMNS('Section 2'!$C$13:H$13),0)),\"\",VLOOKUP($B26,'Section 2'!$C$16:$M$115,COLUMNS('Section 2'!$C$13:H$13),0)))","v":""},{"$f":"IF($D26=\"\",\"\",IF(ISBLANK(VLOOKUP($B26,'Section 2'!$C$16:$M$115,COLUMNS('Section 2'!$C$13:I$13),0)),\"\",VLOOKUP($B26,'Section 2'!$C$16:$M$115,COLUMNS('Section 2'!$C$13:I$13),0)))","v":""},{"$f":"IF($D26=\"\",\"\",IF(ISBLANK(VLOOKUP($B26,'Section 2'!$C$16:$M$115,COLUMNS('Section 2'!$C$13:J$13),0)),\"\",VLOOKUP($B26,'Section 2'!$C$16:$M$115,COLUMNS('Section 2'!$C$13:J$13),0)))","v":""},{"$f":"IF($D26=\"\",\"\",IF(ISBLANK(VLOOKUP($B26,'Section 2'!$C$16:$M$115,COLUMNS('Section 2'!$C$13:K$13),0)),\"\",VLOOKUP($B26,'Section 2'!$C$16:$M$115,COLUMNS('Section 2'!$C$13:K$13),0)))","v":""},{"$f":"IF($D26=\"\",\"\",IF(ISBLANK(VLOOKUP($B26,'Section 2'!$C$16:$M$115,COLUMNS('Section 2'!$C$13:L$13),0)),\"\",VLOOKUP($B26,'Section 2'!$C$16:$M$115,COLUMNS('Section 2'!$C$13:L$13),0)))","v":""},{"$f":"IF($D26=\"\",\"\",IF(ISBLANK(VLOOKUP($B26,'Section 2'!$C$16:$M$115,COLUMNS('Section 2'!$C$13:M$13),0)),\"\",VLOOKUP($B26,'Section 2'!$C$16:$M$115,COLUMNS('Section 2'!$C$13:M$13),0)))","v":""}]
[{"$f":"IF(D27=\"\",\"\",ROWS($A$1:A27))","v":""},26,"",{"$f":"IFERROR(VLOOKUP($B27,'Section 2'!$C$16:$M$115,COLUMNS('Section 2'!$C$13:C$13),0),\"\")","v":""},{"$f":"IF($D27=\"\",\"\",IF(ISBLANK(VLOOKUP($B27,'Section 2'!$C$16:$M$115,COLUMNS('Section 2'!$C$13:D$13),0)),\"\",VLOOKUP($B27,'Section 2'!$C$16:$M$115,COLUMNS('Section 2'!$C$13:D$13),0)))","v":""},{"$f":"IF($D27=\"\",\"\",IF(ISBLANK(VLOOKUP($B27,'Section 2'!$C$16:$M$115,COLUMNS('Section 2'!$C$13:E$13),0)),\"\",VLOOKUP($B27,'Section 2'!$C$16:$M$115,COLUMNS('Section 2'!$C$13:E$13),0)))","v":""},{"$f":"IF($D27=\"\",\"\",IF(ISBLANK(VLOOKUP($B27,'Section 2'!$C$16:$M$115,COLUMNS('Section 2'!$C$13:F$13),0)),\"\",VLOOKUP($B27,'Section 2'!$C$16:$M$115,COLUMNS('Section 2'!$C$13:F$13),0)))","v":""},{"$f":"IF($D27=\"\",\"\",IF(ISBLANK(VLOOKUP($B27,'Section 2'!$C$16:$M$115,COLUMNS('Section 2'!$C$13:G$13),0)),\"\",VLOOKUP($B27,'Section 2'!$C$16:$M$115,COLUMNS('Section 2'!$C$13:G$13),0)))","v":""},{"$f":"IF($D27=\"\",\"\",IF(ISBLANK(VLOOKUP($B27,'Section 2'!$C$16:$M$115,COLUMNS('Section 2'!$C$13:H$13),0)),\"\",VLOOKUP($B27,'Section 2'!$C$16:$M$115,COLUMNS('Section 2'!$C$13:H$13),0)))","v":""},{"$f":"IF($D27=\"\",\"\",IF(ISBLANK(VLOOKUP($B27,'Section 2'!$C$16:$M$115,COLUMNS('Section 2'!$C$13:I$13),0)),\"\",VLOOKUP($B27,'Section 2'!$C$16:$M$115,COLUMNS('Section 2'!$C$13:I$13),0)))","v":""},{"$f":"IF($D27=\"\",\"\",IF(ISBLANK(VLOOKUP($B27,'Section 2'!$C$16:$M$115,COLUMNS('Section 2'!$C$13:J$13),0)),\"\",VLOOKUP($B27,'Section 2'!$C$16:$M$115,COLUMNS('Section 2'!$C$13:J$13),0)))","v":""},{"$f":"IF($D27=\"\",\"\",IF(ISBLANK(VLOOKUP($B27,'Section 2'!$C$16:$M$115,COLUMNS('Section 2'!$C$13:K$13),0)),\"\",VLOOKUP($B27,'Section 2'!$C$16:$M$115,COLUMNS('Section 2'!$C$13:K$13),0)))","v":""},{"$f":"IF($D27=\"\",\"\",IF(ISBLANK(VLOOKUP($B27,'Section 2'!$C$16:$M$115,COLUMNS('Section 2'!$C$13:L$13),0)),\"\",VLOOKUP($B27,'Section 2'!$C$16:$M$115,COLUMNS('Section 2'!$C$13:L$13),0)))","v":""},{"$f":"IF($D27=\"\",\"\",IF(ISBLANK(VLOOKUP($B27,'Section 2'!$C$16:$M$115,COLUMNS('Section 2'!$C$13:M$13),0)),\"\",VLOOKUP($B27,'Section 2'!$C$16:$M$115,COLUMNS('Section 2'!$C$13:M$13),0)))","v":""}]
[{"$f":"IF(D28=\"\",\"\",ROWS($A$1:A28))","v":""},27,"",{"$f":"IFERROR(VLOOKUP($B28,'Section 2'!$C$16:$M$115,COLUMNS('Section 2'!$C$13:C$13),0),\"\")","v":""},{"$f":"IF($D28=\"\",\"\",IF(ISBLANK(VLOOKUP($B28,'Section 2'!$C$16:$M$115,COLUMNS('Section 2'!$C$13:D$13),0)),\"\",VLOOKUP($B28,'Section 2'!$C$16:$M$115,COLUMNS('Section 2'!$C$13:D$13),0)))","v":""},{"$f":"IF($D28=\"\",\"\",IF(ISBLANK(VLOOKUP($B28,'Section 2'!$C$16:$M$115,COLUMNS('Section 2'!$C$13:E$13),0)),\"\",VLOOKUP($B28,'Section 2'!$C$16:$M$115,COLUMNS('Section 2'!$C$13:E$13),0)))","v":""},{"$f":"IF($D28=\"\",\"\",IF(ISBLANK(VLOOKUP($B28,'Section 2'!$C$16:$M$115,COLUMNS('Section 2'!$C$13:F$13),0)),\"\",VLOOKUP($B28,'Section 2'!$C$16:$M$115,COLUMNS('Section 2'!$C$13:F$13),0)))","v":""},{"$f":"IF($D28=\"\",\"\",IF(ISBLANK(VLOOKUP($B28,'Section 2'!$C$16:$M$115,COLUMNS('Section 2'!$C$13:G$13),0)),\"\",VLOOKUP($B28,'Section 2'!$C$16:$M$115,COLUMNS('Section 2'!$C$13:G$13),0)))","v":""},{"$f":"IF($D28=\"\",\"\",IF(ISBLANK(VLOOKUP($B28,'Section 2'!$C$16:$M$115,COLUMNS('Section 2'!$C$13:H$13),0)),\"\",VLOOKUP($B28,'Section 2'!$C$16:$M$115,COLUMNS('Section 2'!$C$13:H$13),0)))","v":""},{"$f":"IF($D28=\"\",\"\",IF(ISBLANK(VLOOKUP($B28,'Section 2'!$C$16:$M$115,COLUMNS('Section 2'!$C$13:I$13),0)),\"\",VLOOKUP($B28,'Section 2'!$C$16:$M$115,COLUMNS('Section 2'!$C$13:I$13),0)))","v":""},{"$f":"IF($D28=\"\",\"\",IF(ISBLANK(VLOOKUP($B28,'Section 2'!$C$16:$M$115,COLUMNS('Section 2'!$C$13:J$13),0)),\"\",VLOOKUP($B28,'Section 2'!$C$16:$M$115,COLUMNS('Section 2'!$C$13:J$13),0)))","v":""},{"$f":"IF($D28=\"\",\"\",IF(ISBLANK(VLOOKUP($B28,'Section 2'!$C$16:$M$115,COLUMNS('Section 2'!$C$13:K$13),0)),\"\",VLOOKUP($B28,'Section 2'!$C$16:$M$115,COLUMNS('Section 2'!$C$13:K$13),0)))","v":""},{"$f":"IF($D28=\"\",\"\",IF(ISBLANK(VLOOKUP($B28,'Section 2'!$C$16:$M$115,COLUMNS('Section 2'!$C$13:L$13),0)),\"\",VLOOKUP($B28,'Section 2'!$C$16:$M$115,COLUMNS('Section 2'!$C$13:L$13),0)))","v":""},{"$f":"IF($D28=\"\",\"\",IF(ISBLANK(VLOOKUP($B28,'Section 2'!$C$16:$M$115,COLUMNS('Section 2'!$C$13:M$13),0)),\"\",VLOOKUP($B28,'Section 2'!$C$16:$M$115,COLUMNS('Section 2'!$C$13:M$13),0)))","v":""}]
[{"$f":"IF(D29=\"\",\"\",ROWS($A$1:A29))","v":""},28,"",{"$f":"IFERROR(VLOOKUP($B29,'Section 2'!$C$16:$M$115,COLUMNS('Section 2'!$C$13:C$13),0),\"\")","v":""},{"$f":"IF($D29=\"\",\"\",IF(ISBLANK(VLOOKUP($B29,'Section 2'!$C$16:$M$115,COLUMNS('Section 2'!$C$13:D$13),0)),\"\",VLOOKUP($B29,'Section 2'!$C$16:$M$115,COLUMNS('Section 2'!$C$13:D$13),0)))","v":""},{"$f":"IF($D29=\"\",\"\",IF(ISBLANK(VLOOKUP($B29,'Section 2'!$C$16:$M$115,COLUMNS('Section 2'!$C$13:E$13),0)),\"\",VLOOKUP($B29,'Section 2'!$C$16:$M$115,COLUMNS('Section 2'!$C$13:E$13),0)))","v":""},{"$f":"IF($D29=\"\",\"\",IF(ISBLANK(VLOOKUP($B29,'Section 2'!$C$16:$M$115,COLUMNS('Section 2'!$C$13:F$13),0)),\"\",VLOOKUP($B29,'Section 2'!$C$16:$M$115,COLUMNS('Section 2'!$C$13:F$13),0)))","v":""},{"$f":"IF($D29=\"\",\"\",IF(ISBLANK(VLOOKUP($B29,'Section 2'!$C$16:$M$115,COLUMNS('Section 2'!$C$13:G$13),0)),\"\",VLOOKUP($B29,'Section 2'!$C$16:$M$115,COLUMNS('Section 2'!$C$13:G$13),0)))","v":""},{"$f":"IF($D29=\"\",\"\",IF(ISBLANK(VLOOKUP($B29,'Section 2'!$C$16:$M$115,COLUMNS('Section 2'!$C$13:H$13),0)),\"\",VLOOKUP($B29,'Section 2'!$C$16:$M$115,COLUMNS('Section 2'!$C$13:H$13),0)))","v":""},{"$f":"IF($D29=\"\",\"\",IF(ISBLANK(VLOOKUP($B29,'Section 2'!$C$16:$M$115,COLUMNS('Section 2'!$C$13:I$13),0)),\"\",VLOOKUP($B29,'Section 2'!$C$16:$M$115,COLUMNS('Section 2'!$C$13:I$13),0)))","v":""},{"$f":"IF($D29=\"\",\"\",IF(ISBLANK(VLOOKUP($B29,'Section 2'!$C$16:$M$115,COLUMNS('Section 2'!$C$13:J$13),0)),\"\",VLOOKUP($B29,'Section 2'!$C$16:$M$115,COLUMNS('Section 2'!$C$13:J$13),0)))","v":""},{"$f":"IF($D29=\"\",\"\",IF(ISBLANK(VLOOKUP($B29,'Section 2'!$C$16:$M$115,COLUMNS('Section 2'!$C$13:K$13),0)),\"\",VLOOKUP($B29,'Section 2'!$C$16:$M$115,COLUMNS('Section 2'!$C$13:K$13),0)))","v":""},{"$f":"IF($D29=\"\",\"\",IF(ISBLANK(VLOOKUP($B29,'Section 2'!$C$16:$M$115,COLUMNS('Section 2'!$C$13:L$13),0)),\"\",VLOOKUP($B29,'Section 2'!$C$16:$M$115,COLUMNS('Section 2'!$C$13:L$13),0)))","v":""},{"$f":"IF($D29=\"\",\"\",IF(ISBLANK(VLOOKUP($B29,'Section 2'!$C$16:$M$115,COLUMNS('Section 2'!$C$13:M$13),0)),\"\",VLOOKUP($B29,'Section 2'!$C$16:$M$115,COLUMNS('Section 2'!$C$13:M$13),0)))","v":""}]
[{"$f":"IF(D30=\"\",\"\",ROWS($A$1:A30))","v":""},29,"",{"$f":"IFERROR(VLOOKUP($B30,'Section 2'!$C$16:$M$115,COLUMNS('Section 2'!$C$13:C$13),0),\"\")","v":""},{"$f":"IF($D30=\"\",\"\",IF(ISBLANK(VLOOKUP($B30,'Section 2'!$C$16:$M$115,COLUMNS('Section 2'!$C$13:D$13),0)),\"\",VLOOKUP($B30,'Section 2'!$C$16:$M$115,COLUMNS('Section 2'!$C$13:D$13),0)))","v":""},{"$f":"IF($D30=\"\",\"\",IF(ISBLANK(VLOOKUP($B30,'Section 2'!$C$16:$M$115,COLUMNS('Section 2'!$C$13:E$13),0)),\"\",VLOOKUP($B30,'Section 2'!$C$16:$M$115,COLUMNS('Section 2'!$C$13:E$13),0)))","v":""},{"$f":"IF($D30=\"\",\"\",IF(ISBLANK(VLOOKUP($B30,'Section 2'!$C$16:$M$115,COLUMNS('Section 2'!$C$13:F$13),0)),\"\",VLOOKUP($B30,'Section 2'!$C$16:$M$115,COLUMNS('Section 2'!$C$13:F$13),0)))","v":""},{"$f":"IF($D30=\"\",\"\",IF(ISBLANK(VLOOKUP($B30,'Section 2'!$C$16:$M$115,COLUMNS('Section 2'!$C$13:G$13),0)),\"\",VLOOKUP($B30,'Section 2'!$C$16:$M$115,COLUMNS('Section 2'!$C$13:G$13),0)))","v":""},{"$f":"IF($D30=\"\",\"\",IF(ISBLANK(VLOOKUP($B30,'Section 2'!$C$16:$M$115,COLUMNS('Section 2'!$C$13:H$13),0)),\"\",VLOOKUP($B30,'Section 2'!$C$16:$M$115,COLUMNS('Section 2'!$C$13:H$13),0)))","v":""},{"$f":"IF($D30=\"\",\"\",IF(ISBLANK(VLOOKUP($B30,'Section 2'!$C$16:$M$115,COLUMNS('Section 2'!$C$13:I$13),0)),\"\",VLOOKUP($B30,'Section 2'!$C$16:$M$115,COLUMNS('Section 2'!$C$13:I$13),0)))","v":""},{"$f":"IF($D30=\"\",\"\",IF(ISBLANK(VLOOKUP($B30,'Section 2'!$C$16:$M$115,COLUMNS('Section 2'!$C$13:J$13),0)),\"\",VLOOKUP($B30,'Section 2'!$C$16:$M$115,COLUMNS('Section 2'!$C$13:J$13),0)))","v":""},{"$f":"IF($D30=\"\",\"\",IF(ISBLANK(VLOOKUP($B30,'Section 2'!$C$16:$M$115,COLUMNS('Section 2'!$C$13:K$13),0)),\"\",VLOOKUP($B30,'Section 2'!$C$16:$M$115,COLUMNS('Section 2'!$C$13:K$13),0)))","v":""},{"$f":"IF($D30=\"\",\"\",IF(ISBLANK(VLOOKUP($B30,'Section 2'!$C$16:$M$115,COLUMNS('Section 2'!$C$13:L$13),0)),\"\",VLOOKUP($B30,'Section 2'!$C$16:$M$115,COLUMNS('Section 2'!$C$13:L$13),0)))","v":""},{"$f":"IF($D30=\"\",\"\",IF(ISBLANK(VLOOKUP($B30,'Section 2'!$C$16:$M$115,COLUMNS('Section 2'!$C$13:M$13),0)),\"\",VLOOKUP($B30,'Section 2'!$C$16:$M$115,COLUMNS('Section 2'!$C$13:M$13),0)))","v":""}]
[{"$f":"IF(D31=\"\",\"\",ROWS($A$1:A31))","v":""},30,"",{"$f":"IFERROR(VLOOKUP($B31,'Section 2'!$C$16:$M$115,COLUMNS('Section 2'!$C$13:C$13),0),\"\")","v":""},{"$f":"IF($D31=\"\",\"\",IF(ISBLANK(VLOOKUP($B31,'Section 2'!$C$16:$M$115,COLUMNS('Section 2'!$C$13:D$13),0)),\"\",VLOOKUP($B31,'Section 2'!$C$16:$M$115,COLUMNS('Section 2'!$C$13:D$13),0)))","v":""},{"$f":"IF($D31=\"\",\"\",IF(ISBLANK(VLOOKUP($B31,'Section 2'!$C$16:$M$115,COLUMNS('Section 2'!$C$13:E$13),0)),\"\",VLOOKUP($B31,'Section 2'!$C$16:$M$115,COLUMNS('Section 2'!$C$13:E$13),0)))","v":""},{"$f":"IF($D31=\"\",\"\",IF(ISBLANK(VLOOKUP($B31,'Section 2'!$C$16:$M$115,COLUMNS('Section 2'!$C$13:F$13),0)),\"\",VLOOKUP($B31,'Section 2'!$C$16:$M$115,COLUMNS('Section 2'!$C$13:F$13),0)))","v":""},{"$f":"IF($D31=\"\",\"\",IF(ISBLANK(VLOOKUP($B31,'Section 2'!$C$16:$M$115,COLUMNS('Section 2'!$C$13:G$13),0)),\"\",VLOOKUP($B31,'Section 2'!$C$16:$M$115,COLUMNS('Section 2'!$C$13:G$13),0)))","v":""},{"$f":"IF($D31=\"\",\"\",IF(ISBLANK(VLOOKUP($B31,'Section 2'!$C$16:$M$115,COLUMNS('Section 2'!$C$13:H$13),0)),\"\",VLOOKUP($B31,'Section 2'!$C$16:$M$115,COLUMNS('Section 2'!$C$13:H$13),0)))","v":""},{"$f":"IF($D31=\"\",\"\",IF(ISBLANK(VLOOKUP($B31,'Section 2'!$C$16:$M$115,COLUMNS('Section 2'!$C$13:I$13),0)),\"\",VLOOKUP($B31,'Section 2'!$C$16:$M$115,COLUMNS('Section 2'!$C$13:I$13),0)))","v":""},{"$f":"IF($D31=\"\",\"\",IF(ISBLANK(VLOOKUP($B31,'Section 2'!$C$16:$M$115,COLUMNS('Section 2'!$C$13:J$13),0)),\"\",VLOOKUP($B31,'Section 2'!$C$16:$M$115,COLUMNS('Section 2'!$C$13:J$13),0)))","v":""},{"$f":"IF($D31=\"\",\"\",IF(ISBLANK(VLOOKUP($B31,'Section 2'!$C$16:$M$115,COLUMNS('Section 2'!$C$13:K$13),0)),\"\",VLOOKUP($B31,'Section 2'!$C$16:$M$115,COLUMNS('Section 2'!$C$13:K$13),0)))","v":""},{"$f":"IF($D31=\"\",\"\",IF(ISBLANK(VLOOKUP($B31,'Section 2'!$C$16:$M$115,COLUMNS('Section 2'!$C$13:L$13),0)),\"\",VLOOKUP($B31,'Section 2'!$C$16:$M$115,COLUMNS('Section 2'!$C$13:L$13),0)))","v":""},{"$f":"IF($D31=\"\",\"\",IF(ISBLANK(VLOOKUP($B31,'Section 2'!$C$16:$M$115,COLUMNS('Section 2'!$C$13:M$13),0)),\"\",VLOOKUP($B31,'Section 2'!$C$16:$M$115,COLUMNS('Section 2'!$C$13:M$13),0)))","v":""}]
[{"$f":"IF(D32=\"\",\"\",ROWS($A$1:A32))","v":""},31,"",{"$f":"IFERROR(VLOOKUP($B32,'Section 2'!$C$16:$M$115,COLUMNS('Section 2'!$C$13:C$13),0),\"\")","v":""},{"$f":"IF($D32=\"\",\"\",IF(ISBLANK(VLOOKUP($B32,'Section 2'!$C$16:$M$115,COLUMNS('Section 2'!$C$13:D$13),0)),\"\",VLOOKUP($B32,'Section 2'!$C$16:$M$115,COLUMNS('Section 2'!$C$13:D$13),0)))","v":""},{"$f":"IF($D32=\"\",\"\",IF(ISBLANK(VLOOKUP($B32,'Section 2'!$C$16:$M$115,COLUMNS('Section 2'!$C$13:E$13),0)),\"\",VLOOKUP($B32,'Section 2'!$C$16:$M$115,COLUMNS('Section 2'!$C$13:E$13),0)))","v":""},{"$f":"IF($D32=\"\",\"\",IF(ISBLANK(VLOOKUP($B32,'Section 2'!$C$16:$M$115,COLUMNS('Section 2'!$C$13:F$13),0)),\"\",VLOOKUP($B32,'Section 2'!$C$16:$M$115,COLUMNS('Section 2'!$C$13:F$13),0)))","v":""},{"$f":"IF($D32=\"\",\"\",IF(ISBLANK(VLOOKUP($B32,'Section 2'!$C$16:$M$115,COLUMNS('Section 2'!$C$13:G$13),0)),\"\",VLOOKUP($B32,'Section 2'!$C$16:$M$115,COLUMNS('Section 2'!$C$13:G$13),0)))","v":""},{"$f":"IF($D32=\"\",\"\",IF(ISBLANK(VLOOKUP($B32,'Section 2'!$C$16:$M$115,COLUMNS('Section 2'!$C$13:H$13),0)),\"\",VLOOKUP($B32,'Section 2'!$C$16:$M$115,COLUMNS('Section 2'!$C$13:H$13),0)))","v":""},{"$f":"IF($D32=\"\",\"\",IF(ISBLANK(VLOOKUP($B32,'Section 2'!$C$16:$M$115,COLUMNS('Section 2'!$C$13:I$13),0)),\"\",VLOOKUP($B32,'Section 2'!$C$16:$M$115,COLUMNS('Section 2'!$C$13:I$13),0)))","v":""},{"$f":"IF($D32=\"\",\"\",IF(ISBLANK(VLOOKUP($B32,'Section 2'!$C$16:$M$115,COLUMNS('Section 2'!$C$13:J$13),0)),\"\",VLOOKUP($B32,'Section 2'!$C$16:$M$115,COLUMNS('Section 2'!$C$13:J$13),0)))","v":""},{"$f":"IF($D32=\"\",\"\",IF(ISBLANK(VLOOKUP($B32,'Section 2'!$C$16:$M$115,COLUMNS('Section 2'!$C$13:K$13),0)),\"\",VLOOKUP($B32,'Section 2'!$C$16:$M$115,COLUMNS('Section 2'!$C$13:K$13),0)))","v":""},{"$f":"IF($D32=\"\",\"\",IF(ISBLANK(VLOOKUP($B32,'Section 2'!$C$16:$M$115,COLUMNS('Section 2'!$C$13:L$13),0)),\"\",VLOOKUP($B32,'Section 2'!$C$16:$M$115,COLUMNS('Section 2'!$C$13:L$13),0)))","v":""},{"$f":"IF($D32=\"\",\"\",IF(ISBLANK(VLOOKUP($B32,'Section 2'!$C$16:$M$115,COLUMNS('Section 2'!$C$13:M$13),0)),\"\",VLOOKUP($B32,'Section 2'!$C$16:$M$115,COLUMNS('Section 2'!$C$13:M$13),0)))","v":""}]
[{"$f":"IF(D33=\"\",\"\",ROWS($A$1:A33))","v":""},32,"",{"$f":"IFERROR(VLOOKUP($B33,'Section 2'!$C$16:$M$115,COLUMNS('Section 2'!$C$13:C$13),0),\"\")","v":""},{"$f":"IF($D33=\"\",\"\",IF(ISBLANK(VLOOKUP($B33,'Section 2'!$C$16:$M$115,COLUMNS('Section 2'!$C$13:D$13),0)),\"\",VLOOKUP($B33,'Section 2'!$C$16:$M$115,COLUMNS('Section 2'!$C$13:D$13),0)))","v":""},{"$f":"IF($D33=\"\",\"\",IF(ISBLANK(VLOOKUP($B33,'Section 2'!$C$16:$M$115,COLUMNS('Section 2'!$C$13:E$13),0)),\"\",VLOOKUP($B33,'Section 2'!$C$16:$M$115,COLUMNS('Section 2'!$C$13:E$13),0)))","v":""},{"$f":"IF($D33=\"\",\"\",IF(ISBLANK(VLOOKUP($B33,'Section 2'!$C$16:$M$115,COLUMNS('Section 2'!$C$13:F$13),0)),\"\",VLOOKUP($B33,'Section 2'!$C$16:$M$115,COLUMNS('Section 2'!$C$13:F$13),0)))","v":""},{"$f":"IF($D33=\"\",\"\",IF(ISBLANK(VLOOKUP($B33,'Section 2'!$C$16:$M$115,COLUMNS('Section 2'!$C$13:G$13),0)),\"\",VLOOKUP($B33,'Section 2'!$C$16:$M$115,COLUMNS('Section 2'!$C$13:G$13),0)))","v":""},{"$f":"IF($D33=\"\",\"\",IF(ISBLANK(VLOOKUP($B33,'Section 2'!$C$16:$M$115,COLUMNS('Section 2'!$C$13:H$13),0)),\"\",VLOOKUP($B33,'Section 2'!$C$16:$M$115,COLUMNS('Section 2'!$C$13:H$13),0)))","v":""},{"$f":"IF($D33=\"\",\"\",IF(ISBLANK(VLOOKUP($B33,'Section 2'!$C$16:$M$115,COLUMNS('Section 2'!$C$13:I$13),0)),\"\",VLOOKUP($B33,'Section 2'!$C$16:$M$115,COLUMNS('Section 2'!$C$13:I$13),0)))","v":""},{"$f":"IF($D33=\"\",\"\",IF(ISBLANK(VLOOKUP($B33,'Section 2'!$C$16:$M$115,COLUMNS('Section 2'!$C$13:J$13),0)),\"\",VLOOKUP($B33,'Section 2'!$C$16:$M$115,COLUMNS('Section 2'!$C$13:J$13),0)))","v":""},{"$f":"IF($D33=\"\",\"\",IF(ISBLANK(VLOOKUP($B33,'Section 2'!$C$16:$M$115,COLUMNS('Section 2'!$C$13:K$13),0)),\"\",VLOOKUP($B33,'Section 2'!$C$16:$M$115,COLUMNS('Section 2'!$C$13:K$13),0)))","v":""},{"$f":"IF($D33=\"\",\"\",IF(ISBLANK(VLOOKUP($B33,'Section 2'!$C$16:$M$115,COLUMNS('Section 2'!$C$13:L$13),0)),\"\",VLOOKUP($B33,'Section 2'!$C$16:$M$115,COLUMNS('Section 2'!$C$13:L$13),0)))","v":""},{"$f":"IF($D33=\"\",\"\",IF(ISBLANK(VLOOKUP($B33,'Section 2'!$C$16:$M$115,COLUMNS('Section 2'!$C$13:M$13),0)),\"\",VLOOKUP($B33,'Section 2'!$C$16:$M$115,COLUMNS('Section 2'!$C$13:M$13),0)))","v":""}]
[{"$f":"IF(D34=\"\",\"\",ROWS($A$1:A34))","v":""},33,"",{"$f":"IFERROR(VLOOKUP($B34,'Section 2'!$C$16:$M$115,COLUMNS('Section 2'!$C$13:C$13),0),\"\")","v":""},{"$f":"IF($D34=\"\",\"\",IF(ISBLANK(VLOOKUP($B34,'Section 2'!$C$16:$M$115,COLUMNS('Section 2'!$C$13:D$13),0)),\"\",VLOOKUP($B34,'Section 2'!$C$16:$M$115,COLUMNS('Section 2'!$C$13:D$13),0)))","v":""},{"$f":"IF($D34=\"\",\"\",IF(ISBLANK(VLOOKUP($B34,'Section 2'!$C$16:$M$115,COLUMNS('Section 2'!$C$13:E$13),0)),\"\",VLOOKUP($B34,'Section 2'!$C$16:$M$115,COLUMNS('Section 2'!$C$13:E$13),0)))","v":""},{"$f":"IF($D34=\"\",\"\",IF(ISBLANK(VLOOKUP($B34,'Section 2'!$C$16:$M$115,COLUMNS('Section 2'!$C$13:F$13),0)),\"\",VLOOKUP($B34,'Section 2'!$C$16:$M$115,COLUMNS('Section 2'!$C$13:F$13),0)))","v":""},{"$f":"IF($D34=\"\",\"\",IF(ISBLANK(VLOOKUP($B34,'Section 2'!$C$16:$M$115,COLUMNS('Section 2'!$C$13:G$13),0)),\"\",VLOOKUP($B34,'Section 2'!$C$16:$M$115,COLUMNS('Section 2'!$C$13:G$13),0)))","v":""},{"$f":"IF($D34=\"\",\"\",IF(ISBLANK(VLOOKUP($B34,'Section 2'!$C$16:$M$115,COLUMNS('Section 2'!$C$13:H$13),0)),\"\",VLOOKUP($B34,'Section 2'!$C$16:$M$115,COLUMNS('Section 2'!$C$13:H$13),0)))","v":""},{"$f":"IF($D34=\"\",\"\",IF(ISBLANK(VLOOKUP($B34,'Section 2'!$C$16:$M$115,COLUMNS('Section 2'!$C$13:I$13),0)),\"\",VLOOKUP($B34,'Section 2'!$C$16:$M$115,COLUMNS('Section 2'!$C$13:I$13),0)))","v":""},{"$f":"IF($D34=\"\",\"\",IF(ISBLANK(VLOOKUP($B34,'Section 2'!$C$16:$M$115,COLUMNS('Section 2'!$C$13:J$13),0)),\"\",VLOOKUP($B34,'Section 2'!$C$16:$M$115,COLUMNS('Section 2'!$C$13:J$13),0)))","v":""},{"$f":"IF($D34=\"\",\"\",IF(ISBLANK(VLOOKUP($B34,'Section 2'!$C$16:$M$115,COLUMNS('Section 2'!$C$13:K$13),0)),\"\",VLOOKUP($B34,'Section 2'!$C$16:$M$115,COLUMNS('Section 2'!$C$13:K$13),0)))","v":""},{"$f":"IF($D34=\"\",\"\",IF(ISBLANK(VLOOKUP($B34,'Section 2'!$C$16:$M$115,COLUMNS('Section 2'!$C$13:L$13),0)),\"\",VLOOKUP($B34,'Section 2'!$C$16:$M$115,COLUMNS('Section 2'!$C$13:L$13),0)))","v":""},{"$f":"IF($D34=\"\",\"\",IF(ISBLANK(VLOOKUP($B34,'Section 2'!$C$16:$M$115,COLUMNS('Section 2'!$C$13:M$13),0)),\"\",VLOOKUP($B34,'Section 2'!$C$16:$M$115,COLUMNS('Section 2'!$C$13:M$13),0)))","v":""}]
[{"$f":"IF(D35=\"\",\"\",ROWS($A$1:A35))","v":""},34,"",{"$f":"IFERROR(VLOOKUP($B35,'Section 2'!$C$16:$M$115,COLUMNS('Section 2'!$C$13:C$13),0),\"\")","v":""},{"$f":"IF($D35=\"\",\"\",IF(ISBLANK(VLOOKUP($B35,'Section 2'!$C$16:$M$115,COLUMNS('Section 2'!$C$13:D$13),0)),\"\",VLOOKUP($B35,'Section 2'!$C$16:$M$115,COLUMNS('Section 2'!$C$13:D$13),0)))","v":""},{"$f":"IF($D35=\"\",\"\",IF(ISBLANK(VLOOKUP($B35,'Section 2'!$C$16:$M$115,COLUMNS('Section 2'!$C$13:E$13),0)),\"\",VLOOKUP($B35,'Section 2'!$C$16:$M$115,COLUMNS('Section 2'!$C$13:E$13),0)))","v":""},{"$f":"IF($D35=\"\",\"\",IF(ISBLANK(VLOOKUP($B35,'Section 2'!$C$16:$M$115,COLUMNS('Section 2'!$C$13:F$13),0)),\"\",VLOOKUP($B35,'Section 2'!$C$16:$M$115,COLUMNS('Section 2'!$C$13:F$13),0)))","v":""},{"$f":"IF($D35=\"\",\"\",IF(ISBLANK(VLOOKUP($B35,'Section 2'!$C$16:$M$115,COLUMNS('Section 2'!$C$13:G$13),0)),\"\",VLOOKUP($B35,'Section 2'!$C$16:$M$115,COLUMNS('Section 2'!$C$13:G$13),0)))","v":""},{"$f":"IF($D35=\"\",\"\",IF(ISBLANK(VLOOKUP($B35,'Section 2'!$C$16:$M$115,COLUMNS('Section 2'!$C$13:H$13),0)),\"\",VLOOKUP($B35,'Section 2'!$C$16:$M$115,COLUMNS('Section 2'!$C$13:H$13),0)))","v":""},{"$f":"IF($D35=\"\",\"\",IF(ISBLANK(VLOOKUP($B35,'Section 2'!$C$16:$M$115,COLUMNS('Section 2'!$C$13:I$13),0)),\"\",VLOOKUP($B35,'Section 2'!$C$16:$M$115,COLUMNS('Section 2'!$C$13:I$13),0)))","v":""},{"$f":"IF($D35=\"\",\"\",IF(ISBLANK(VLOOKUP($B35,'Section 2'!$C$16:$M$115,COLUMNS('Section 2'!$C$13:J$13),0)),\"\",VLOOKUP($B35,'Section 2'!$C$16:$M$115,COLUMNS('Section 2'!$C$13:J$13),0)))","v":""},{"$f":"IF($D35=\"\",\"\",IF(ISBLANK(VLOOKUP($B35,'Section 2'!$C$16:$M$115,COLUMNS('Section 2'!$C$13:K$13),0)),\"\",VLOOKUP($B35,'Section 2'!$C$16:$M$115,COLUMNS('Section 2'!$C$13:K$13),0)))","v":""},{"$f":"IF($D35=\"\",\"\",IF(ISBLANK(VLOOKUP($B35,'Section 2'!$C$16:$M$115,COLUMNS('Section 2'!$C$13:L$13),0)),\"\",VLOOKUP($B35,'Section 2'!$C$16:$M$115,COLUMNS('Section 2'!$C$13:L$13),0)))","v":""},{"$f":"IF($D35=\"\",\"\",IF(ISBLANK(VLOOKUP($B35,'Section 2'!$C$16:$M$115,COLUMNS('Section 2'!$C$13:M$13),0)),\"\",VLOOKUP($B35,'Section 2'!$C$16:$M$115,COLUMNS('Section 2'!$C$13:M$13),0)))","v":""}]
[{"$f":"IF(D36=\"\",\"\",ROWS($A$1:A36))","v":""},35,"",{"$f":"IFERROR(VLOOKUP($B36,'Section 2'!$C$16:$M$115,COLUMNS('Section 2'!$C$13:C$13),0),\"\")","v":""},{"$f":"IF($D36=\"\",\"\",IF(ISBLANK(VLOOKUP($B36,'Section 2'!$C$16:$M$115,COLUMNS('Section 2'!$C$13:D$13),0)),\"\",VLOOKUP($B36,'Section 2'!$C$16:$M$115,COLUMNS('Section 2'!$C$13:D$13),0)))","v":""},{"$f":"IF($D36=\"\",\"\",IF(ISBLANK(VLOOKUP($B36,'Section 2'!$C$16:$M$115,COLUMNS('Section 2'!$C$13:E$13),0)),\"\",VLOOKUP($B36,'Section 2'!$C$16:$M$115,COLUMNS('Section 2'!$C$13:E$13),0)))","v":""},{"$f":"IF($D36=\"\",\"\",IF(ISBLANK(VLOOKUP($B36,'Section 2'!$C$16:$M$115,COLUMNS('Section 2'!$C$13:F$13),0)),\"\",VLOOKUP($B36,'Section 2'!$C$16:$M$115,COLUMNS('Section 2'!$C$13:F$13),0)))","v":""},{"$f":"IF($D36=\"\",\"\",IF(ISBLANK(VLOOKUP($B36,'Section 2'!$C$16:$M$115,COLUMNS('Section 2'!$C$13:G$13),0)),\"\",VLOOKUP($B36,'Section 2'!$C$16:$M$115,COLUMNS('Section 2'!$C$13:G$13),0)))","v":""},{"$f":"IF($D36=\"\",\"\",IF(ISBLANK(VLOOKUP($B36,'Section 2'!$C$16:$M$115,COLUMNS('Section 2'!$C$13:H$13),0)),\"\",VLOOKUP($B36,'Section 2'!$C$16:$M$115,COLUMNS('Section 2'!$C$13:H$13),0)))","v":""},{"$f":"IF($D36=\"\",\"\",IF(ISBLANK(VLOOKUP($B36,'Section 2'!$C$16:$M$115,COLUMNS('Section 2'!$C$13:I$13),0)),\"\",VLOOKUP($B36,'Section 2'!$C$16:$M$115,COLUMNS('Section 2'!$C$13:I$13),0)))","v":""},{"$f":"IF($D36=\"\",\"\",IF(ISBLANK(VLOOKUP($B36,'Section 2'!$C$16:$M$115,COLUMNS('Section 2'!$C$13:J$13),0)),\"\",VLOOKUP($B36,'Section 2'!$C$16:$M$115,COLUMNS('Section 2'!$C$13:J$13),0)))","v":""},{"$f":"IF($D36=\"\",\"\",IF(ISBLANK(VLOOKUP($B36,'Section 2'!$C$16:$M$115,COLUMNS('Section 2'!$C$13:K$13),0)),\"\",VLOOKUP($B36,'Section 2'!$C$16:$M$115,COLUMNS('Section 2'!$C$13:K$13),0)))","v":""},{"$f":"IF($D36=\"\",\"\",IF(ISBLANK(VLOOKUP($B36,'Section 2'!$C$16:$M$115,COLUMNS('Section 2'!$C$13:L$13),0)),\"\",VLOOKUP($B36,'Section 2'!$C$16:$M$115,COLUMNS('Section 2'!$C$13:L$13),0)))","v":""},{"$f":"IF($D36=\"\",\"\",IF(ISBLANK(VLOOKUP($B36,'Section 2'!$C$16:$M$115,COLUMNS('Section 2'!$C$13:M$13),0)),\"\",VLOOKUP($B36,'Section 2'!$C$16:$M$115,COLUMNS('Section 2'!$C$13:M$13),0)))","v":""}]
[{"$f":"IF(D37=\"\",\"\",ROWS($A$1:A37))","v":""},36,"",{"$f":"IFERROR(VLOOKUP($B37,'Section 2'!$C$16:$M$115,COLUMNS('Section 2'!$C$13:C$13),0),\"\")","v":""},{"$f":"IF($D37=\"\",\"\",IF(ISBLANK(VLOOKUP($B37,'Section 2'!$C$16:$M$115,COLUMNS('Section 2'!$C$13:D$13),0)),\"\",VLOOKUP($B37,'Section 2'!$C$16:$M$115,COLUMNS('Section 2'!$C$13:D$13),0)))","v":""},{"$f":"IF($D37=\"\",\"\",IF(ISBLANK(VLOOKUP($B37,'Section 2'!$C$16:$M$115,COLUMNS('Section 2'!$C$13:E$13),0)),\"\",VLOOKUP($B37,'Section 2'!$C$16:$M$115,COLUMNS('Section 2'!$C$13:E$13),0)))","v":""},{"$f":"IF($D37=\"\",\"\",IF(ISBLANK(VLOOKUP($B37,'Section 2'!$C$16:$M$115,COLUMNS('Section 2'!$C$13:F$13),0)),\"\",VLOOKUP($B37,'Section 2'!$C$16:$M$115,COLUMNS('Section 2'!$C$13:F$13),0)))","v":""},{"$f":"IF($D37=\"\",\"\",IF(ISBLANK(VLOOKUP($B37,'Section 2'!$C$16:$M$115,COLUMNS('Section 2'!$C$13:G$13),0)),\"\",VLOOKUP($B37,'Section 2'!$C$16:$M$115,COLUMNS('Section 2'!$C$13:G$13),0)))","v":""},{"$f":"IF($D37=\"\",\"\",IF(ISBLANK(VLOOKUP($B37,'Section 2'!$C$16:$M$115,COLUMNS('Section 2'!$C$13:H$13),0)),\"\",VLOOKUP($B37,'Section 2'!$C$16:$M$115,COLUMNS('Section 2'!$C$13:H$13),0)))","v":""},{"$f":"IF($D37=\"\",\"\",IF(ISBLANK(VLOOKUP($B37,'Section 2'!$C$16:$M$115,COLUMNS('Section 2'!$C$13:I$13),0)),\"\",VLOOKUP($B37,'Section 2'!$C$16:$M$115,COLUMNS('Section 2'!$C$13:I$13),0)))","v":""},{"$f":"IF($D37=\"\",\"\",IF(ISBLANK(VLOOKUP($B37,'Section 2'!$C$16:$M$115,COLUMNS('Section 2'!$C$13:J$13),0)),\"\",VLOOKUP($B37,'Section 2'!$C$16:$M$115,COLUMNS('Section 2'!$C$13:J$13),0)))","v":""},{"$f":"IF($D37=\"\",\"\",IF(ISBLANK(VLOOKUP($B37,'Section 2'!$C$16:$M$115,COLUMNS('Section 2'!$C$13:K$13),0)),\"\",VLOOKUP($B37,'Section 2'!$C$16:$M$115,COLUMNS('Section 2'!$C$13:K$13),0)))","v":""},{"$f":"IF($D37=\"\",\"\",IF(ISBLANK(VLOOKUP($B37,'Section 2'!$C$16:$M$115,COLUMNS('Section 2'!$C$13:L$13),0)),\"\",VLOOKUP($B37,'Section 2'!$C$16:$M$115,COLUMNS('Section 2'!$C$13:L$13),0)))","v":""},{"$f":"IF($D37=\"\",\"\",IF(ISBLANK(VLOOKUP($B37,'Section 2'!$C$16:$M$115,COLUMNS('Section 2'!$C$13:M$13),0)),\"\",VLOOKUP($B37,'Section 2'!$C$16:$M$115,COLUMNS('Section 2'!$C$13:M$13),0)))","v":""}]
[{"$f":"IF(D38=\"\",\"\",ROWS($A$1:A38))","v":""},37,"",{"$f":"IFERROR(VLOOKUP($B38,'Section 2'!$C$16:$M$115,COLUMNS('Section 2'!$C$13:C$13),0),\"\")","v":""},{"$f":"IF($D38=\"\",\"\",IF(ISBLANK(VLOOKUP($B38,'Section 2'!$C$16:$M$115,COLUMNS('Section 2'!$C$13:D$13),0)),\"\",VLOOKUP($B38,'Section 2'!$C$16:$M$115,COLUMNS('Section 2'!$C$13:D$13),0)))","v":""},{"$f":"IF($D38=\"\",\"\",IF(ISBLANK(VLOOKUP($B38,'Section 2'!$C$16:$M$115,COLUMNS('Section 2'!$C$13:E$13),0)),\"\",VLOOKUP($B38,'Section 2'!$C$16:$M$115,COLUMNS('Section 2'!$C$13:E$13),0)))","v":""},{"$f":"IF($D38=\"\",\"\",IF(ISBLANK(VLOOKUP($B38,'Section 2'!$C$16:$M$115,COLUMNS('Section 2'!$C$13:F$13),0)),\"\",VLOOKUP($B38,'Section 2'!$C$16:$M$115,COLUMNS('Section 2'!$C$13:F$13),0)))","v":""},{"$f":"IF($D38=\"\",\"\",IF(ISBLANK(VLOOKUP($B38,'Section 2'!$C$16:$M$115,COLUMNS('Section 2'!$C$13:G$13),0)),\"\",VLOOKUP($B38,'Section 2'!$C$16:$M$115,COLUMNS('Section 2'!$C$13:G$13),0)))","v":""},{"$f":"IF($D38=\"\",\"\",IF(ISBLANK(VLOOKUP($B38,'Section 2'!$C$16:$M$115,COLUMNS('Section 2'!$C$13:H$13),0)),\"\",VLOOKUP($B38,'Section 2'!$C$16:$M$115,COLUMNS('Section 2'!$C$13:H$13),0)))","v":""},{"$f":"IF($D38=\"\",\"\",IF(ISBLANK(VLOOKUP($B38,'Section 2'!$C$16:$M$115,COLUMNS('Section 2'!$C$13:I$13),0)),\"\",VLOOKUP($B38,'Section 2'!$C$16:$M$115,COLUMNS('Section 2'!$C$13:I$13),0)))","v":""},{"$f":"IF($D38=\"\",\"\",IF(ISBLANK(VLOOKUP($B38,'Section 2'!$C$16:$M$115,COLUMNS('Section 2'!$C$13:J$13),0)),\"\",VLOOKUP($B38,'Section 2'!$C$16:$M$115,COLUMNS('Section 2'!$C$13:J$13),0)))","v":""},{"$f":"IF($D38=\"\",\"\",IF(ISBLANK(VLOOKUP($B38,'Section 2'!$C$16:$M$115,COLUMNS('Section 2'!$C$13:K$13),0)),\"\",VLOOKUP($B38,'Section 2'!$C$16:$M$115,COLUMNS('Section 2'!$C$13:K$13),0)))","v":""},{"$f":"IF($D38=\"\",\"\",IF(ISBLANK(VLOOKUP($B38,'Section 2'!$C$16:$M$115,COLUMNS('Section 2'!$C$13:L$13),0)),\"\",VLOOKUP($B38,'Section 2'!$C$16:$M$115,COLUMNS('Section 2'!$C$13:L$13),0)))","v":""},{"$f":"IF($D38=\"\",\"\",IF(ISBLANK(VLOOKUP($B38,'Section 2'!$C$16:$M$115,COLUMNS('Section 2'!$C$13:M$13),0)),\"\",VLOOKUP($B38,'Section 2'!$C$16:$M$115,COLUMNS('Section 2'!$C$13:M$13),0)))","v":""}]
[{"$f":"IF(D39=\"\",\"\",ROWS($A$1:A39))","v":""},38,"",{"$f":"IFERROR(VLOOKUP($B39,'Section 2'!$C$16:$M$115,COLUMNS('Section 2'!$C$13:C$13),0),\"\")","v":""},{"$f":"IF($D39=\"\",\"\",IF(ISBLANK(VLOOKUP($B39,'Section 2'!$C$16:$M$115,COLUMNS('Section 2'!$C$13:D$13),0)),\"\",VLOOKUP($B39,'Section 2'!$C$16:$M$115,COLUMNS('Section 2'!$C$13:D$13),0)))","v":""},{"$f":"IF($D39=\"\",\"\",IF(ISBLANK(VLOOKUP($B39,'Section 2'!$C$16:$M$115,COLUMNS('Section 2'!$C$13:E$13),0)),\"\",VLOOKUP($B39,'Section 2'!$C$16:$M$115,COLUMNS('Section 2'!$C$13:E$13),0)))","v":""},{"$f":"IF($D39=\"\",\"\",IF(ISBLANK(VLOOKUP($B39,'Section 2'!$C$16:$M$115,COLUMNS('Section 2'!$C$13:F$13),0)),\"\",VLOOKUP($B39,'Section 2'!$C$16:$M$115,COLUMNS('Section 2'!$C$13:F$13),0)))","v":""},{"$f":"IF($D39=\"\",\"\",IF(ISBLANK(VLOOKUP($B39,'Section 2'!$C$16:$M$115,COLUMNS('Section 2'!$C$13:G$13),0)),\"\",VLOOKUP($B39,'Section 2'!$C$16:$M$115,COLUMNS('Section 2'!$C$13:G$13),0)))","v":""},{"$f":"IF($D39=\"\",\"\",IF(ISBLANK(VLOOKUP($B39,'Section 2'!$C$16:$M$115,COLUMNS('Section 2'!$C$13:H$13),0)),\"\",VLOOKUP($B39,'Section 2'!$C$16:$M$115,COLUMNS('Section 2'!$C$13:H$13),0)))","v":""},{"$f":"IF($D39=\"\",\"\",IF(ISBLANK(VLOOKUP($B39,'Section 2'!$C$16:$M$115,COLUMNS('Section 2'!$C$13:I$13),0)),\"\",VLOOKUP($B39,'Section 2'!$C$16:$M$115,COLUMNS('Section 2'!$C$13:I$13),0)))","v":""},{"$f":"IF($D39=\"\",\"\",IF(ISBLANK(VLOOKUP($B39,'Section 2'!$C$16:$M$115,COLUMNS('Section 2'!$C$13:J$13),0)),\"\",VLOOKUP($B39,'Section 2'!$C$16:$M$115,COLUMNS('Section 2'!$C$13:J$13),0)))","v":""},{"$f":"IF($D39=\"\",\"\",IF(ISBLANK(VLOOKUP($B39,'Section 2'!$C$16:$M$115,COLUMNS('Section 2'!$C$13:K$13),0)),\"\",VLOOKUP($B39,'Section 2'!$C$16:$M$115,COLUMNS('Section 2'!$C$13:K$13),0)))","v":""},{"$f":"IF($D39=\"\",\"\",IF(ISBLANK(VLOOKUP($B39,'Section 2'!$C$16:$M$115,COLUMNS('Section 2'!$C$13:L$13),0)),\"\",VLOOKUP($B39,'Section 2'!$C$16:$M$115,COLUMNS('Section 2'!$C$13:L$13),0)))","v":""},{"$f":"IF($D39=\"\",\"\",IF(ISBLANK(VLOOKUP($B39,'Section 2'!$C$16:$M$115,COLUMNS('Section 2'!$C$13:M$13),0)),\"\",VLOOKUP($B39,'Section 2'!$C$16:$M$115,COLUMNS('Section 2'!$C$13:M$13),0)))","v":""}]
[{"$f":"IF(D40=\"\",\"\",ROWS($A$1:A40))","v":""},39,"",{"$f":"IFERROR(VLOOKUP($B40,'Section 2'!$C$16:$M$115,COLUMNS('Section 2'!$C$13:C$13),0),\"\")","v":""},{"$f":"IF($D40=\"\",\"\",IF(ISBLANK(VLOOKUP($B40,'Section 2'!$C$16:$M$115,COLUMNS('Section 2'!$C$13:D$13),0)),\"\",VLOOKUP($B40,'Section 2'!$C$16:$M$115,COLUMNS('Section 2'!$C$13:D$13),0)))","v":""},{"$f":"IF($D40=\"\",\"\",IF(ISBLANK(VLOOKUP($B40,'Section 2'!$C$16:$M$115,COLUMNS('Section 2'!$C$13:E$13),0)),\"\",VLOOKUP($B40,'Section 2'!$C$16:$M$115,COLUMNS('Section 2'!$C$13:E$13),0)))","v":""},{"$f":"IF($D40=\"\",\"\",IF(ISBLANK(VLOOKUP($B40,'Section 2'!$C$16:$M$115,COLUMNS('Section 2'!$C$13:F$13),0)),\"\",VLOOKUP($B40,'Section 2'!$C$16:$M$115,COLUMNS('Section 2'!$C$13:F$13),0)))","v":""},{"$f":"IF($D40=\"\",\"\",IF(ISBLANK(VLOOKUP($B40,'Section 2'!$C$16:$M$115,COLUMNS('Section 2'!$C$13:G$13),0)),\"\",VLOOKUP($B40,'Section 2'!$C$16:$M$115,COLUMNS('Section 2'!$C$13:G$13),0)))","v":""},{"$f":"IF($D40=\"\",\"\",IF(ISBLANK(VLOOKUP($B40,'Section 2'!$C$16:$M$115,COLUMNS('Section 2'!$C$13:H$13),0)),\"\",VLOOKUP($B40,'Section 2'!$C$16:$M$115,COLUMNS('Section 2'!$C$13:H$13),0)))","v":""},{"$f":"IF($D40=\"\",\"\",IF(ISBLANK(VLOOKUP($B40,'Section 2'!$C$16:$M$115,COLUMNS('Section 2'!$C$13:I$13),0)),\"\",VLOOKUP($B40,'Section 2'!$C$16:$M$115,COLUMNS('Section 2'!$C$13:I$13),0)))","v":""},{"$f":"IF($D40=\"\",\"\",IF(ISBLANK(VLOOKUP($B40,'Section 2'!$C$16:$M$115,COLUMNS('Section 2'!$C$13:J$13),0)),\"\",VLOOKUP($B40,'Section 2'!$C$16:$M$115,COLUMNS('Section 2'!$C$13:J$13),0)))","v":""},{"$f":"IF($D40=\"\",\"\",IF(ISBLANK(VLOOKUP($B40,'Section 2'!$C$16:$M$115,COLUMNS('Section 2'!$C$13:K$13),0)),\"\",VLOOKUP($B40,'Section 2'!$C$16:$M$115,COLUMNS('Section 2'!$C$13:K$13),0)))","v":""},{"$f":"IF($D40=\"\",\"\",IF(ISBLANK(VLOOKUP($B40,'Section 2'!$C$16:$M$115,COLUMNS('Section 2'!$C$13:L$13),0)),\"\",VLOOKUP($B40,'Section 2'!$C$16:$M$115,COLUMNS('Section 2'!$C$13:L$13),0)))","v":""},{"$f":"IF($D40=\"\",\"\",IF(ISBLANK(VLOOKUP($B40,'Section 2'!$C$16:$M$115,COLUMNS('Section 2'!$C$13:M$13),0)),\"\",VLOOKUP($B40,'Section 2'!$C$16:$M$115,COLUMNS('Section 2'!$C$13:M$13),0)))","v":""}]
[{"$f":"IF(D41=\"\",\"\",ROWS($A$1:A41))","v":""},40,"",{"$f":"IFERROR(VLOOKUP($B41,'Section 2'!$C$16:$M$115,COLUMNS('Section 2'!$C$13:C$13),0),\"\")","v":""},{"$f":"IF($D41=\"\",\"\",IF(ISBLANK(VLOOKUP($B41,'Section 2'!$C$16:$M$115,COLUMNS('Section 2'!$C$13:D$13),0)),\"\",VLOOKUP($B41,'Section 2'!$C$16:$M$115,COLUMNS('Section 2'!$C$13:D$13),0)))","v":""},{"$f":"IF($D41=\"\",\"\",IF(ISBLANK(VLOOKUP($B41,'Section 2'!$C$16:$M$115,COLUMNS('Section 2'!$C$13:E$13),0)),\"\",VLOOKUP($B41,'Section 2'!$C$16:$M$115,COLUMNS('Section 2'!$C$13:E$13),0)))","v":""},{"$f":"IF($D41=\"\",\"\",IF(ISBLANK(VLOOKUP($B41,'Section 2'!$C$16:$M$115,COLUMNS('Section 2'!$C$13:F$13),0)),\"\",VLOOKUP($B41,'Section 2'!$C$16:$M$115,COLUMNS('Section 2'!$C$13:F$13),0)))","v":""},{"$f":"IF($D41=\"\",\"\",IF(ISBLANK(VLOOKUP($B41,'Section 2'!$C$16:$M$115,COLUMNS('Section 2'!$C$13:G$13),0)),\"\",VLOOKUP($B41,'Section 2'!$C$16:$M$115,COLUMNS('Section 2'!$C$13:G$13),0)))","v":""},{"$f":"IF($D41=\"\",\"\",IF(ISBLANK(VLOOKUP($B41,'Section 2'!$C$16:$M$115,COLUMNS('Section 2'!$C$13:H$13),0)),\"\",VLOOKUP($B41,'Section 2'!$C$16:$M$115,COLUMNS('Section 2'!$C$13:H$13),0)))","v":""},{"$f":"IF($D41=\"\",\"\",IF(ISBLANK(VLOOKUP($B41,'Section 2'!$C$16:$M$115,COLUMNS('Section 2'!$C$13:I$13),0)),\"\",VLOOKUP($B41,'Section 2'!$C$16:$M$115,COLUMNS('Section 2'!$C$13:I$13),0)))","v":""},{"$f":"IF($D41=\"\",\"\",IF(ISBLANK(VLOOKUP($B41,'Section 2'!$C$16:$M$115,COLUMNS('Section 2'!$C$13:J$13),0)),\"\",VLOOKUP($B41,'Section 2'!$C$16:$M$115,COLUMNS('Section 2'!$C$13:J$13),0)))","v":""},{"$f":"IF($D41=\"\",\"\",IF(ISBLANK(VLOOKUP($B41,'Section 2'!$C$16:$M$115,COLUMNS('Section 2'!$C$13:K$13),0)),\"\",VLOOKUP($B41,'Section 2'!$C$16:$M$115,COLUMNS('Section 2'!$C$13:K$13),0)))","v":""},{"$f":"IF($D41=\"\",\"\",IF(ISBLANK(VLOOKUP($B41,'Section 2'!$C$16:$M$115,COLUMNS('Section 2'!$C$13:L$13),0)),\"\",VLOOKUP($B41,'Section 2'!$C$16:$M$115,COLUMNS('Section 2'!$C$13:L$13),0)))","v":""},{"$f":"IF($D41=\"\",\"\",IF(ISBLANK(VLOOKUP($B41,'Section 2'!$C$16:$M$115,COLUMNS('Section 2'!$C$13:M$13),0)),\"\",VLOOKUP($B41,'Section 2'!$C$16:$M$115,COLUMNS('Section 2'!$C$13:M$13),0)))","v":""}]
[{"$f":"IF(D42=\"\",\"\",ROWS($A$1:A42))","v":""},41,"",{"$f":"IFERROR(VLOOKUP($B42,'Section 2'!$C$16:$M$115,COLUMNS('Section 2'!$C$13:C$13),0),\"\")","v":""},{"$f":"IF($D42=\"\",\"\",IF(ISBLANK(VLOOKUP($B42,'Section 2'!$C$16:$M$115,COLUMNS('Section 2'!$C$13:D$13),0)),\"\",VLOOKUP($B42,'Section 2'!$C$16:$M$115,COLUMNS('Section 2'!$C$13:D$13),0)))","v":""},{"$f":"IF($D42=\"\",\"\",IF(ISBLANK(VLOOKUP($B42,'Section 2'!$C$16:$M$115,COLUMNS('Section 2'!$C$13:E$13),0)),\"\",VLOOKUP($B42,'Section 2'!$C$16:$M$115,COLUMNS('Section 2'!$C$13:E$13),0)))","v":""},{"$f":"IF($D42=\"\",\"\",IF(ISBLANK(VLOOKUP($B42,'Section 2'!$C$16:$M$115,COLUMNS('Section 2'!$C$13:F$13),0)),\"\",VLOOKUP($B42,'Section 2'!$C$16:$M$115,COLUMNS('Section 2'!$C$13:F$13),0)))","v":""},{"$f":"IF($D42=\"\",\"\",IF(ISBLANK(VLOOKUP($B42,'Section 2'!$C$16:$M$115,COLUMNS('Section 2'!$C$13:G$13),0)),\"\",VLOOKUP($B42,'Section 2'!$C$16:$M$115,COLUMNS('Section 2'!$C$13:G$13),0)))","v":""},{"$f":"IF($D42=\"\",\"\",IF(ISBLANK(VLOOKUP($B42,'Section 2'!$C$16:$M$115,COLUMNS('Section 2'!$C$13:H$13),0)),\"\",VLOOKUP($B42,'Section 2'!$C$16:$M$115,COLUMNS('Section 2'!$C$13:H$13),0)))","v":""},{"$f":"IF($D42=\"\",\"\",IF(ISBLANK(VLOOKUP($B42,'Section 2'!$C$16:$M$115,COLUMNS('Section 2'!$C$13:I$13),0)),\"\",VLOOKUP($B42,'Section 2'!$C$16:$M$115,COLUMNS('Section 2'!$C$13:I$13),0)))","v":""},{"$f":"IF($D42=\"\",\"\",IF(ISBLANK(VLOOKUP($B42,'Section 2'!$C$16:$M$115,COLUMNS('Section 2'!$C$13:J$13),0)),\"\",VLOOKUP($B42,'Section 2'!$C$16:$M$115,COLUMNS('Section 2'!$C$13:J$13),0)))","v":""},{"$f":"IF($D42=\"\",\"\",IF(ISBLANK(VLOOKUP($B42,'Section 2'!$C$16:$M$115,COLUMNS('Section 2'!$C$13:K$13),0)),\"\",VLOOKUP($B42,'Section 2'!$C$16:$M$115,COLUMNS('Section 2'!$C$13:K$13),0)))","v":""},{"$f":"IF($D42=\"\",\"\",IF(ISBLANK(VLOOKUP($B42,'Section 2'!$C$16:$M$115,COLUMNS('Section 2'!$C$13:L$13),0)),\"\",VLOOKUP($B42,'Section 2'!$C$16:$M$115,COLUMNS('Section 2'!$C$13:L$13),0)))","v":""},{"$f":"IF($D42=\"\",\"\",IF(ISBLANK(VLOOKUP($B42,'Section 2'!$C$16:$M$115,COLUMNS('Section 2'!$C$13:M$13),0)),\"\",VLOOKUP($B42,'Section 2'!$C$16:$M$115,COLUMNS('Section 2'!$C$13:M$13),0)))","v":""}]
[{"$f":"IF(D43=\"\",\"\",ROWS($A$1:A43))","v":""},42,"",{"$f":"IFERROR(VLOOKUP($B43,'Section 2'!$C$16:$M$115,COLUMNS('Section 2'!$C$13:C$13),0),\"\")","v":""},{"$f":"IF($D43=\"\",\"\",IF(ISBLANK(VLOOKUP($B43,'Section 2'!$C$16:$M$115,COLUMNS('Section 2'!$C$13:D$13),0)),\"\",VLOOKUP($B43,'Section 2'!$C$16:$M$115,COLUMNS('Section 2'!$C$13:D$13),0)))","v":""},{"$f":"IF($D43=\"\",\"\",IF(ISBLANK(VLOOKUP($B43,'Section 2'!$C$16:$M$115,COLUMNS('Section 2'!$C$13:E$13),0)),\"\",VLOOKUP($B43,'Section 2'!$C$16:$M$115,COLUMNS('Section 2'!$C$13:E$13),0)))","v":""},{"$f":"IF($D43=\"\",\"\",IF(ISBLANK(VLOOKUP($B43,'Section 2'!$C$16:$M$115,COLUMNS('Section 2'!$C$13:F$13),0)),\"\",VLOOKUP($B43,'Section 2'!$C$16:$M$115,COLUMNS('Section 2'!$C$13:F$13),0)))","v":""},{"$f":"IF($D43=\"\",\"\",IF(ISBLANK(VLOOKUP($B43,'Section 2'!$C$16:$M$115,COLUMNS('Section 2'!$C$13:G$13),0)),\"\",VLOOKUP($B43,'Section 2'!$C$16:$M$115,COLUMNS('Section 2'!$C$13:G$13),0)))","v":""},{"$f":"IF($D43=\"\",\"\",IF(ISBLANK(VLOOKUP($B43,'Section 2'!$C$16:$M$115,COLUMNS('Section 2'!$C$13:H$13),0)),\"\",VLOOKUP($B43,'Section 2'!$C$16:$M$115,COLUMNS('Section 2'!$C$13:H$13),0)))","v":""},{"$f":"IF($D43=\"\",\"\",IF(ISBLANK(VLOOKUP($B43,'Section 2'!$C$16:$M$115,COLUMNS('Section 2'!$C$13:I$13),0)),\"\",VLOOKUP($B43,'Section 2'!$C$16:$M$115,COLUMNS('Section 2'!$C$13:I$13),0)))","v":""},{"$f":"IF($D43=\"\",\"\",IF(ISBLANK(VLOOKUP($B43,'Section 2'!$C$16:$M$115,COLUMNS('Section 2'!$C$13:J$13),0)),\"\",VLOOKUP($B43,'Section 2'!$C$16:$M$115,COLUMNS('Section 2'!$C$13:J$13),0)))","v":""},{"$f":"IF($D43=\"\",\"\",IF(ISBLANK(VLOOKUP($B43,'Section 2'!$C$16:$M$115,COLUMNS('Section 2'!$C$13:K$13),0)),\"\",VLOOKUP($B43,'Section 2'!$C$16:$M$115,COLUMNS('Section 2'!$C$13:K$13),0)))","v":""},{"$f":"IF($D43=\"\",\"\",IF(ISBLANK(VLOOKUP($B43,'Section 2'!$C$16:$M$115,COLUMNS('Section 2'!$C$13:L$13),0)),\"\",VLOOKUP($B43,'Section 2'!$C$16:$M$115,COLUMNS('Section 2'!$C$13:L$13),0)))","v":""},{"$f":"IF($D43=\"\",\"\",IF(ISBLANK(VLOOKUP($B43,'Section 2'!$C$16:$M$115,COLUMNS('Section 2'!$C$13:M$13),0)),\"\",VLOOKUP($B43,'Section 2'!$C$16:$M$115,COLUMNS('Section 2'!$C$13:M$13),0)))","v":""}]
[{"$f":"IF(D44=\"\",\"\",ROWS($A$1:A44))","v":""},43,"",{"$f":"IFERROR(VLOOKUP($B44,'Section 2'!$C$16:$M$115,COLUMNS('Section 2'!$C$13:C$13),0),\"\")","v":""},{"$f":"IF($D44=\"\",\"\",IF(ISBLANK(VLOOKUP($B44,'Section 2'!$C$16:$M$115,COLUMNS('Section 2'!$C$13:D$13),0)),\"\",VLOOKUP($B44,'Section 2'!$C$16:$M$115,COLUMNS('Section 2'!$C$13:D$13),0)))","v":""},{"$f":"IF($D44=\"\",\"\",IF(ISBLANK(VLOOKUP($B44,'Section 2'!$C$16:$M$115,COLUMNS('Section 2'!$C$13:E$13),0)),\"\",VLOOKUP($B44,'Section 2'!$C$16:$M$115,COLUMNS('Section 2'!$C$13:E$13),0)))","v":""},{"$f":"IF($D44=\"\",\"\",IF(ISBLANK(VLOOKUP($B44,'Section 2'!$C$16:$M$115,COLUMNS('Section 2'!$C$13:F$13),0)),\"\",VLOOKUP($B44,'Section 2'!$C$16:$M$115,COLUMNS('Section 2'!$C$13:F$13),0)))","v":""},{"$f":"IF($D44=\"\",\"\",IF(ISBLANK(VLOOKUP($B44,'Section 2'!$C$16:$M$115,COLUMNS('Section 2'!$C$13:G$13),0)),\"\",VLOOKUP($B44,'Section 2'!$C$16:$M$115,COLUMNS('Section 2'!$C$13:G$13),0)))","v":""},{"$f":"IF($D44=\"\",\"\",IF(ISBLANK(VLOOKUP($B44,'Section 2'!$C$16:$M$115,COLUMNS('Section 2'!$C$13:H$13),0)),\"\",VLOOKUP($B44,'Section 2'!$C$16:$M$115,COLUMNS('Section 2'!$C$13:H$13),0)))","v":""},{"$f":"IF($D44=\"\",\"\",IF(ISBLANK(VLOOKUP($B44,'Section 2'!$C$16:$M$115,COLUMNS('Section 2'!$C$13:I$13),0)),\"\",VLOOKUP($B44,'Section 2'!$C$16:$M$115,COLUMNS('Section 2'!$C$13:I$13),0)))","v":""},{"$f":"IF($D44=\"\",\"\",IF(ISBLANK(VLOOKUP($B44,'Section 2'!$C$16:$M$115,COLUMNS('Section 2'!$C$13:J$13),0)),\"\",VLOOKUP($B44,'Section 2'!$C$16:$M$115,COLUMNS('Section 2'!$C$13:J$13),0)))","v":""},{"$f":"IF($D44=\"\",\"\",IF(ISBLANK(VLOOKUP($B44,'Section 2'!$C$16:$M$115,COLUMNS('Section 2'!$C$13:K$13),0)),\"\",VLOOKUP($B44,'Section 2'!$C$16:$M$115,COLUMNS('Section 2'!$C$13:K$13),0)))","v":""},{"$f":"IF($D44=\"\",\"\",IF(ISBLANK(VLOOKUP($B44,'Section 2'!$C$16:$M$115,COLUMNS('Section 2'!$C$13:L$13),0)),\"\",VLOOKUP($B44,'Section 2'!$C$16:$M$115,COLUMNS('Section 2'!$C$13:L$13),0)))","v":""},{"$f":"IF($D44=\"\",\"\",IF(ISBLANK(VLOOKUP($B44,'Section 2'!$C$16:$M$115,COLUMNS('Section 2'!$C$13:M$13),0)),\"\",VLOOKUP($B44,'Section 2'!$C$16:$M$115,COLUMNS('Section 2'!$C$13:M$13),0)))","v":""}]
[{"$f":"IF(D45=\"\",\"\",ROWS($A$1:A45))","v":""},44,"",{"$f":"IFERROR(VLOOKUP($B45,'Section 2'!$C$16:$M$115,COLUMNS('Section 2'!$C$13:C$13),0),\"\")","v":""},{"$f":"IF($D45=\"\",\"\",IF(ISBLANK(VLOOKUP($B45,'Section 2'!$C$16:$M$115,COLUMNS('Section 2'!$C$13:D$13),0)),\"\",VLOOKUP($B45,'Section 2'!$C$16:$M$115,COLUMNS('Section 2'!$C$13:D$13),0)))","v":""},{"$f":"IF($D45=\"\",\"\",IF(ISBLANK(VLOOKUP($B45,'Section 2'!$C$16:$M$115,COLUMNS('Section 2'!$C$13:E$13),0)),\"\",VLOOKUP($B45,'Section 2'!$C$16:$M$115,COLUMNS('Section 2'!$C$13:E$13),0)))","v":""},{"$f":"IF($D45=\"\",\"\",IF(ISBLANK(VLOOKUP($B45,'Section 2'!$C$16:$M$115,COLUMNS('Section 2'!$C$13:F$13),0)),\"\",VLOOKUP($B45,'Section 2'!$C$16:$M$115,COLUMNS('Section 2'!$C$13:F$13),0)))","v":""},{"$f":"IF($D45=\"\",\"\",IF(ISBLANK(VLOOKUP($B45,'Section 2'!$C$16:$M$115,COLUMNS('Section 2'!$C$13:G$13),0)),\"\",VLOOKUP($B45,'Section 2'!$C$16:$M$115,COLUMNS('Section 2'!$C$13:G$13),0)))","v":""},{"$f":"IF($D45=\"\",\"\",IF(ISBLANK(VLOOKUP($B45,'Section 2'!$C$16:$M$115,COLUMNS('Section 2'!$C$13:H$13),0)),\"\",VLOOKUP($B45,'Section 2'!$C$16:$M$115,COLUMNS('Section 2'!$C$13:H$13),0)))","v":""},{"$f":"IF($D45=\"\",\"\",IF(ISBLANK(VLOOKUP($B45,'Section 2'!$C$16:$M$115,COLUMNS('Section 2'!$C$13:I$13),0)),\"\",VLOOKUP($B45,'Section 2'!$C$16:$M$115,COLUMNS('Section 2'!$C$13:I$13),0)))","v":""},{"$f":"IF($D45=\"\",\"\",IF(ISBLANK(VLOOKUP($B45,'Section 2'!$C$16:$M$115,COLUMNS('Section 2'!$C$13:J$13),0)),\"\",VLOOKUP($B45,'Section 2'!$C$16:$M$115,COLUMNS('Section 2'!$C$13:J$13),0)))","v":""},{"$f":"IF($D45=\"\",\"\",IF(ISBLANK(VLOOKUP($B45,'Section 2'!$C$16:$M$115,COLUMNS('Section 2'!$C$13:K$13),0)),\"\",VLOOKUP($B45,'Section 2'!$C$16:$M$115,COLUMNS('Section 2'!$C$13:K$13),0)))","v":""},{"$f":"IF($D45=\"\",\"\",IF(ISBLANK(VLOOKUP($B45,'Section 2'!$C$16:$M$115,COLUMNS('Section 2'!$C$13:L$13),0)),\"\",VLOOKUP($B45,'Section 2'!$C$16:$M$115,COLUMNS('Section 2'!$C$13:L$13),0)))","v":""},{"$f":"IF($D45=\"\",\"\",IF(ISBLANK(VLOOKUP($B45,'Section 2'!$C$16:$M$115,COLUMNS('Section 2'!$C$13:M$13),0)),\"\",VLOOKUP($B45,'Section 2'!$C$16:$M$115,COLUMNS('Section 2'!$C$13:M$13),0)))","v":""}]
[{"$f":"IF(D46=\"\",\"\",ROWS($A$1:A46))","v":""},45,"",{"$f":"IFERROR(VLOOKUP($B46,'Section 2'!$C$16:$M$115,COLUMNS('Section 2'!$C$13:C$13),0),\"\")","v":""},{"$f":"IF($D46=\"\",\"\",IF(ISBLANK(VLOOKUP($B46,'Section 2'!$C$16:$M$115,COLUMNS('Section 2'!$C$13:D$13),0)),\"\",VLOOKUP($B46,'Section 2'!$C$16:$M$115,COLUMNS('Section 2'!$C$13:D$13),0)))","v":""},{"$f":"IF($D46=\"\",\"\",IF(ISBLANK(VLOOKUP($B46,'Section 2'!$C$16:$M$115,COLUMNS('Section 2'!$C$13:E$13),0)),\"\",VLOOKUP($B46,'Section 2'!$C$16:$M$115,COLUMNS('Section 2'!$C$13:E$13),0)))","v":""},{"$f":"IF($D46=\"\",\"\",IF(ISBLANK(VLOOKUP($B46,'Section 2'!$C$16:$M$115,COLUMNS('Section 2'!$C$13:F$13),0)),\"\",VLOOKUP($B46,'Section 2'!$C$16:$M$115,COLUMNS('Section 2'!$C$13:F$13),0)))","v":""},{"$f":"IF($D46=\"\",\"\",IF(ISBLANK(VLOOKUP($B46,'Section 2'!$C$16:$M$115,COLUMNS('Section 2'!$C$13:G$13),0)),\"\",VLOOKUP($B46,'Section 2'!$C$16:$M$115,COLUMNS('Section 2'!$C$13:G$13),0)))","v":""},{"$f":"IF($D46=\"\",\"\",IF(ISBLANK(VLOOKUP($B46,'Section 2'!$C$16:$M$115,COLUMNS('Section 2'!$C$13:H$13),0)),\"\",VLOOKUP($B46,'Section 2'!$C$16:$M$115,COLUMNS('Section 2'!$C$13:H$13),0)))","v":""},{"$f":"IF($D46=\"\",\"\",IF(ISBLANK(VLOOKUP($B46,'Section 2'!$C$16:$M$115,COLUMNS('Section 2'!$C$13:I$13),0)),\"\",VLOOKUP($B46,'Section 2'!$C$16:$M$115,COLUMNS('Section 2'!$C$13:I$13),0)))","v":""},{"$f":"IF($D46=\"\",\"\",IF(ISBLANK(VLOOKUP($B46,'Section 2'!$C$16:$M$115,COLUMNS('Section 2'!$C$13:J$13),0)),\"\",VLOOKUP($B46,'Section 2'!$C$16:$M$115,COLUMNS('Section 2'!$C$13:J$13),0)))","v":""},{"$f":"IF($D46=\"\",\"\",IF(ISBLANK(VLOOKUP($B46,'Section 2'!$C$16:$M$115,COLUMNS('Section 2'!$C$13:K$13),0)),\"\",VLOOKUP($B46,'Section 2'!$C$16:$M$115,COLUMNS('Section 2'!$C$13:K$13),0)))","v":""},{"$f":"IF($D46=\"\",\"\",IF(ISBLANK(VLOOKUP($B46,'Section 2'!$C$16:$M$115,COLUMNS('Section 2'!$C$13:L$13),0)),\"\",VLOOKUP($B46,'Section 2'!$C$16:$M$115,COLUMNS('Section 2'!$C$13:L$13),0)))","v":""},{"$f":"IF($D46=\"\",\"\",IF(ISBLANK(VLOOKUP($B46,'Section 2'!$C$16:$M$115,COLUMNS('Section 2'!$C$13:M$13),0)),\"\",VLOOKUP($B46,'Section 2'!$C$16:$M$115,COLUMNS('Section 2'!$C$13:M$13),0)))","v":""}]
[{"$f":"IF(D47=\"\",\"\",ROWS($A$1:A47))","v":""},46,"",{"$f":"IFERROR(VLOOKUP($B47,'Section 2'!$C$16:$M$115,COLUMNS('Section 2'!$C$13:C$13),0),\"\")","v":""},{"$f":"IF($D47=\"\",\"\",IF(ISBLANK(VLOOKUP($B47,'Section 2'!$C$16:$M$115,COLUMNS('Section 2'!$C$13:D$13),0)),\"\",VLOOKUP($B47,'Section 2'!$C$16:$M$115,COLUMNS('Section 2'!$C$13:D$13),0)))","v":""},{"$f":"IF($D47=\"\",\"\",IF(ISBLANK(VLOOKUP($B47,'Section 2'!$C$16:$M$115,COLUMNS('Section 2'!$C$13:E$13),0)),\"\",VLOOKUP($B47,'Section 2'!$C$16:$M$115,COLUMNS('Section 2'!$C$13:E$13),0)))","v":""},{"$f":"IF($D47=\"\",\"\",IF(ISBLANK(VLOOKUP($B47,'Section 2'!$C$16:$M$115,COLUMNS('Section 2'!$C$13:F$13),0)),\"\",VLOOKUP($B47,'Section 2'!$C$16:$M$115,COLUMNS('Section 2'!$C$13:F$13),0)))","v":""},{"$f":"IF($D47=\"\",\"\",IF(ISBLANK(VLOOKUP($B47,'Section 2'!$C$16:$M$115,COLUMNS('Section 2'!$C$13:G$13),0)),\"\",VLOOKUP($B47,'Section 2'!$C$16:$M$115,COLUMNS('Section 2'!$C$13:G$13),0)))","v":""},{"$f":"IF($D47=\"\",\"\",IF(ISBLANK(VLOOKUP($B47,'Section 2'!$C$16:$M$115,COLUMNS('Section 2'!$C$13:H$13),0)),\"\",VLOOKUP($B47,'Section 2'!$C$16:$M$115,COLUMNS('Section 2'!$C$13:H$13),0)))","v":""},{"$f":"IF($D47=\"\",\"\",IF(ISBLANK(VLOOKUP($B47,'Section 2'!$C$16:$M$115,COLUMNS('Section 2'!$C$13:I$13),0)),\"\",VLOOKUP($B47,'Section 2'!$C$16:$M$115,COLUMNS('Section 2'!$C$13:I$13),0)))","v":""},{"$f":"IF($D47=\"\",\"\",IF(ISBLANK(VLOOKUP($B47,'Section 2'!$C$16:$M$115,COLUMNS('Section 2'!$C$13:J$13),0)),\"\",VLOOKUP($B47,'Section 2'!$C$16:$M$115,COLUMNS('Section 2'!$C$13:J$13),0)))","v":""},{"$f":"IF($D47=\"\",\"\",IF(ISBLANK(VLOOKUP($B47,'Section 2'!$C$16:$M$115,COLUMNS('Section 2'!$C$13:K$13),0)),\"\",VLOOKUP($B47,'Section 2'!$C$16:$M$115,COLUMNS('Section 2'!$C$13:K$13),0)))","v":""},{"$f":"IF($D47=\"\",\"\",IF(ISBLANK(VLOOKUP($B47,'Section 2'!$C$16:$M$115,COLUMNS('Section 2'!$C$13:L$13),0)),\"\",VLOOKUP($B47,'Section 2'!$C$16:$M$115,COLUMNS('Section 2'!$C$13:L$13),0)))","v":""},{"$f":"IF($D47=\"\",\"\",IF(ISBLANK(VLOOKUP($B47,'Section 2'!$C$16:$M$115,COLUMNS('Section 2'!$C$13:M$13),0)),\"\",VLOOKUP($B47,'Section 2'!$C$16:$M$115,COLUMNS('Section 2'!$C$13:M$13),0)))","v":""}]
[{"$f":"IF(D48=\"\",\"\",ROWS($A$1:A48))","v":""},47,"",{"$f":"IFERROR(VLOOKUP($B48,'Section 2'!$C$16:$M$115,COLUMNS('Section 2'!$C$13:C$13),0),\"\")","v":""},{"$f":"IF($D48=\"\",\"\",IF(ISBLANK(VLOOKUP($B48,'Section 2'!$C$16:$M$115,COLUMNS('Section 2'!$C$13:D$13),0)),\"\",VLOOKUP($B48,'Section 2'!$C$16:$M$115,COLUMNS('Section 2'!$C$13:D$13),0)))","v":""},{"$f":"IF($D48=\"\",\"\",IF(ISBLANK(VLOOKUP($B48,'Section 2'!$C$16:$M$115,COLUMNS('Section 2'!$C$13:E$13),0)),\"\",VLOOKUP($B48,'Section 2'!$C$16:$M$115,COLUMNS('Section 2'!$C$13:E$13),0)))","v":""},{"$f":"IF($D48=\"\",\"\",IF(ISBLANK(VLOOKUP($B48,'Section 2'!$C$16:$M$115,COLUMNS('Section 2'!$C$13:F$13),0)),\"\",VLOOKUP($B48,'Section 2'!$C$16:$M$115,COLUMNS('Section 2'!$C$13:F$13),0)))","v":""},{"$f":"IF($D48=\"\",\"\",IF(ISBLANK(VLOOKUP($B48,'Section 2'!$C$16:$M$115,COLUMNS('Section 2'!$C$13:G$13),0)),\"\",VLOOKUP($B48,'Section 2'!$C$16:$M$115,COLUMNS('Section 2'!$C$13:G$13),0)))","v":""},{"$f":"IF($D48=\"\",\"\",IF(ISBLANK(VLOOKUP($B48,'Section 2'!$C$16:$M$115,COLUMNS('Section 2'!$C$13:H$13),0)),\"\",VLOOKUP($B48,'Section 2'!$C$16:$M$115,COLUMNS('Section 2'!$C$13:H$13),0)))","v":""},{"$f":"IF($D48=\"\",\"\",IF(ISBLANK(VLOOKUP($B48,'Section 2'!$C$16:$M$115,COLUMNS('Section 2'!$C$13:I$13),0)),\"\",VLOOKUP($B48,'Section 2'!$C$16:$M$115,COLUMNS('Section 2'!$C$13:I$13),0)))","v":""},{"$f":"IF($D48=\"\",\"\",IF(ISBLANK(VLOOKUP($B48,'Section 2'!$C$16:$M$115,COLUMNS('Section 2'!$C$13:J$13),0)),\"\",VLOOKUP($B48,'Section 2'!$C$16:$M$115,COLUMNS('Section 2'!$C$13:J$13),0)))","v":""},{"$f":"IF($D48=\"\",\"\",IF(ISBLANK(VLOOKUP($B48,'Section 2'!$C$16:$M$115,COLUMNS('Section 2'!$C$13:K$13),0)),\"\",VLOOKUP($B48,'Section 2'!$C$16:$M$115,COLUMNS('Section 2'!$C$13:K$13),0)))","v":""},{"$f":"IF($D48=\"\",\"\",IF(ISBLANK(VLOOKUP($B48,'Section 2'!$C$16:$M$115,COLUMNS('Section 2'!$C$13:L$13),0)),\"\",VLOOKUP($B48,'Section 2'!$C$16:$M$115,COLUMNS('Section 2'!$C$13:L$13),0)))","v":""},{"$f":"IF($D48=\"\",\"\",IF(ISBLANK(VLOOKUP($B48,'Section 2'!$C$16:$M$115,COLUMNS('Section 2'!$C$13:M$13),0)),\"\",VLOOKUP($B48,'Section 2'!$C$16:$M$115,COLUMNS('Section 2'!$C$13:M$13),0)))","v":""}]
[{"$f":"IF(D49=\"\",\"\",ROWS($A$1:A49))","v":""},48,"",{"$f":"IFERROR(VLOOKUP($B49,'Section 2'!$C$16:$M$115,COLUMNS('Section 2'!$C$13:C$13),0),\"\")","v":""},{"$f":"IF($D49=\"\",\"\",IF(ISBLANK(VLOOKUP($B49,'Section 2'!$C$16:$M$115,COLUMNS('Section 2'!$C$13:D$13),0)),\"\",VLOOKUP($B49,'Section 2'!$C$16:$M$115,COLUMNS('Section 2'!$C$13:D$13),0)))","v":""},{"$f":"IF($D49=\"\",\"\",IF(ISBLANK(VLOOKUP($B49,'Section 2'!$C$16:$M$115,COLUMNS('Section 2'!$C$13:E$13),0)),\"\",VLOOKUP($B49,'Section 2'!$C$16:$M$115,COLUMNS('Section 2'!$C$13:E$13),0)))","v":""},{"$f":"IF($D49=\"\",\"\",IF(ISBLANK(VLOOKUP($B49,'Section 2'!$C$16:$M$115,COLUMNS('Section 2'!$C$13:F$13),0)),\"\",VLOOKUP($B49,'Section 2'!$C$16:$M$115,COLUMNS('Section 2'!$C$13:F$13),0)))","v":""},{"$f":"IF($D49=\"\",\"\",IF(ISBLANK(VLOOKUP($B49,'Section 2'!$C$16:$M$115,COLUMNS('Section 2'!$C$13:G$13),0)),\"\",VLOOKUP($B49,'Section 2'!$C$16:$M$115,COLUMNS('Section 2'!$C$13:G$13),0)))","v":""},{"$f":"IF($D49=\"\",\"\",IF(ISBLANK(VLOOKUP($B49,'Section 2'!$C$16:$M$115,COLUMNS('Section 2'!$C$13:H$13),0)),\"\",VLOOKUP($B49,'Section 2'!$C$16:$M$115,COLUMNS('Section 2'!$C$13:H$13),0)))","v":""},{"$f":"IF($D49=\"\",\"\",IF(ISBLANK(VLOOKUP($B49,'Section 2'!$C$16:$M$115,COLUMNS('Section 2'!$C$13:I$13),0)),\"\",VLOOKUP($B49,'Section 2'!$C$16:$M$115,COLUMNS('Section 2'!$C$13:I$13),0)))","v":""},{"$f":"IF($D49=\"\",\"\",IF(ISBLANK(VLOOKUP($B49,'Section 2'!$C$16:$M$115,COLUMNS('Section 2'!$C$13:J$13),0)),\"\",VLOOKUP($B49,'Section 2'!$C$16:$M$115,COLUMNS('Section 2'!$C$13:J$13),0)))","v":""},{"$f":"IF($D49=\"\",\"\",IF(ISBLANK(VLOOKUP($B49,'Section 2'!$C$16:$M$115,COLUMNS('Section 2'!$C$13:K$13),0)),\"\",VLOOKUP($B49,'Section 2'!$C$16:$M$115,COLUMNS('Section 2'!$C$13:K$13),0)))","v":""},{"$f":"IF($D49=\"\",\"\",IF(ISBLANK(VLOOKUP($B49,'Section 2'!$C$16:$M$115,COLUMNS('Section 2'!$C$13:L$13),0)),\"\",VLOOKUP($B49,'Section 2'!$C$16:$M$115,COLUMNS('Section 2'!$C$13:L$13),0)))","v":""},{"$f":"IF($D49=\"\",\"\",IF(ISBLANK(VLOOKUP($B49,'Section 2'!$C$16:$M$115,COLUMNS('Section 2'!$C$13:M$13),0)),\"\",VLOOKUP($B49,'Section 2'!$C$16:$M$115,COLUMNS('Section 2'!$C$13:M$13),0)))","v":""}]
[{"$f":"IF(D50=\"\",\"\",ROWS($A$1:A50))","v":""},49,"",{"$f":"IFERROR(VLOOKUP($B50,'Section 2'!$C$16:$M$115,COLUMNS('Section 2'!$C$13:C$13),0),\"\")","v":""},{"$f":"IF($D50=\"\",\"\",IF(ISBLANK(VLOOKUP($B50,'Section 2'!$C$16:$M$115,COLUMNS('Section 2'!$C$13:D$13),0)),\"\",VLOOKUP($B50,'Section 2'!$C$16:$M$115,COLUMNS('Section 2'!$C$13:D$13),0)))","v":""},{"$f":"IF($D50=\"\",\"\",IF(ISBLANK(VLOOKUP($B50,'Section 2'!$C$16:$M$115,COLUMNS('Section 2'!$C$13:E$13),0)),\"\",VLOOKUP($B50,'Section 2'!$C$16:$M$115,COLUMNS('Section 2'!$C$13:E$13),0)))","v":""},{"$f":"IF($D50=\"\",\"\",IF(ISBLANK(VLOOKUP($B50,'Section 2'!$C$16:$M$115,COLUMNS('Section 2'!$C$13:F$13),0)),\"\",VLOOKUP($B50,'Section 2'!$C$16:$M$115,COLUMNS('Section 2'!$C$13:F$13),0)))","v":""},{"$f":"IF($D50=\"\",\"\",IF(ISBLANK(VLOOKUP($B50,'Section 2'!$C$16:$M$115,COLUMNS('Section 2'!$C$13:G$13),0)),\"\",VLOOKUP($B50,'Section 2'!$C$16:$M$115,COLUMNS('Section 2'!$C$13:G$13),0)))","v":""},{"$f":"IF($D50=\"\",\"\",IF(ISBLANK(VLOOKUP($B50,'Section 2'!$C$16:$M$115,COLUMNS('Section 2'!$C$13:H$13),0)),\"\",VLOOKUP($B50,'Section 2'!$C$16:$M$115,COLUMNS('Section 2'!$C$13:H$13),0)))","v":""},{"$f":"IF($D50=\"\",\"\",IF(ISBLANK(VLOOKUP($B50,'Section 2'!$C$16:$M$115,COLUMNS('Section 2'!$C$13:I$13),0)),\"\",VLOOKUP($B50,'Section 2'!$C$16:$M$115,COLUMNS('Section 2'!$C$13:I$13),0)))","v":""},{"$f":"IF($D50=\"\",\"\",IF(ISBLANK(VLOOKUP($B50,'Section 2'!$C$16:$M$115,COLUMNS('Section 2'!$C$13:J$13),0)),\"\",VLOOKUP($B50,'Section 2'!$C$16:$M$115,COLUMNS('Section 2'!$C$13:J$13),0)))","v":""},{"$f":"IF($D50=\"\",\"\",IF(ISBLANK(VLOOKUP($B50,'Section 2'!$C$16:$M$115,COLUMNS('Section 2'!$C$13:K$13),0)),\"\",VLOOKUP($B50,'Section 2'!$C$16:$M$115,COLUMNS('Section 2'!$C$13:K$13),0)))","v":""},{"$f":"IF($D50=\"\",\"\",IF(ISBLANK(VLOOKUP($B50,'Section 2'!$C$16:$M$115,COLUMNS('Section 2'!$C$13:L$13),0)),\"\",VLOOKUP($B50,'Section 2'!$C$16:$M$115,COLUMNS('Section 2'!$C$13:L$13),0)))","v":""},{"$f":"IF($D50=\"\",\"\",IF(ISBLANK(VLOOKUP($B50,'Section 2'!$C$16:$M$115,COLUMNS('Section 2'!$C$13:M$13),0)),\"\",VLOOKUP($B50,'Section 2'!$C$16:$M$115,COLUMNS('Section 2'!$C$13:M$13),0)))","v":""}]
[{"$f":"IF(D51=\"\",\"\",ROWS($A$1:A51))","v":""},50,"",{"$f":"IFERROR(VLOOKUP($B51,'Section 2'!$C$16:$M$115,COLUMNS('Section 2'!$C$13:C$13),0),\"\")","v":""},{"$f":"IF($D51=\"\",\"\",IF(ISBLANK(VLOOKUP($B51,'Section 2'!$C$16:$M$115,COLUMNS('Section 2'!$C$13:D$13),0)),\"\",VLOOKUP($B51,'Section 2'!$C$16:$M$115,COLUMNS('Section 2'!$C$13:D$13),0)))","v":""},{"$f":"IF($D51=\"\",\"\",IF(ISBLANK(VLOOKUP($B51,'Section 2'!$C$16:$M$115,COLUMNS('Section 2'!$C$13:E$13),0)),\"\",VLOOKUP($B51,'Section 2'!$C$16:$M$115,COLUMNS('Section 2'!$C$13:E$13),0)))","v":""},{"$f":"IF($D51=\"\",\"\",IF(ISBLANK(VLOOKUP($B51,'Section 2'!$C$16:$M$115,COLUMNS('Section 2'!$C$13:F$13),0)),\"\",VLOOKUP($B51,'Section 2'!$C$16:$M$115,COLUMNS('Section 2'!$C$13:F$13),0)))","v":""},{"$f":"IF($D51=\"\",\"\",IF(ISBLANK(VLOOKUP($B51,'Section 2'!$C$16:$M$115,COLUMNS('Section 2'!$C$13:G$13),0)),\"\",VLOOKUP($B51,'Section 2'!$C$16:$M$115,COLUMNS('Section 2'!$C$13:G$13),0)))","v":""},{"$f":"IF($D51=\"\",\"\",IF(ISBLANK(VLOOKUP($B51,'Section 2'!$C$16:$M$115,COLUMNS('Section 2'!$C$13:H$13),0)),\"\",VLOOKUP($B51,'Section 2'!$C$16:$M$115,COLUMNS('Section 2'!$C$13:H$13),0)))","v":""},{"$f":"IF($D51=\"\",\"\",IF(ISBLANK(VLOOKUP($B51,'Section 2'!$C$16:$M$115,COLUMNS('Section 2'!$C$13:I$13),0)),\"\",VLOOKUP($B51,'Section 2'!$C$16:$M$115,COLUMNS('Section 2'!$C$13:I$13),0)))","v":""},{"$f":"IF($D51=\"\",\"\",IF(ISBLANK(VLOOKUP($B51,'Section 2'!$C$16:$M$115,COLUMNS('Section 2'!$C$13:J$13),0)),\"\",VLOOKUP($B51,'Section 2'!$C$16:$M$115,COLUMNS('Section 2'!$C$13:J$13),0)))","v":""},{"$f":"IF($D51=\"\",\"\",IF(ISBLANK(VLOOKUP($B51,'Section 2'!$C$16:$M$115,COLUMNS('Section 2'!$C$13:K$13),0)),\"\",VLOOKUP($B51,'Section 2'!$C$16:$M$115,COLUMNS('Section 2'!$C$13:K$13),0)))","v":""},{"$f":"IF($D51=\"\",\"\",IF(ISBLANK(VLOOKUP($B51,'Section 2'!$C$16:$M$115,COLUMNS('Section 2'!$C$13:L$13),0)),\"\",VLOOKUP($B51,'Section 2'!$C$16:$M$115,COLUMNS('Section 2'!$C$13:L$13),0)))","v":""},{"$f":"IF($D51=\"\",\"\",IF(ISBLANK(VLOOKUP($B51,'Section 2'!$C$16:$M$115,COLUMNS('Section 2'!$C$13:M$13),0)),\"\",VLOOKUP($B51,'Section 2'!$C$16:$M$115,COLUMNS('Section 2'!$C$13:M$13),0)))","v":""}]
[{"$f":"IF(D52=\"\",\"\",ROWS($A$1:A52))","v":""},51,"",{"$f":"IFERROR(VLOOKUP($B52,'Section 2'!$C$16:$M$115,COLUMNS('Section 2'!$C$13:C$13),0),\"\")","v":""},{"$f":"IF($D52=\"\",\"\",IF(ISBLANK(VLOOKUP($B52,'Section 2'!$C$16:$M$115,COLUMNS('Section 2'!$C$13:D$13),0)),\"\",VLOOKUP($B52,'Section 2'!$C$16:$M$115,COLUMNS('Section 2'!$C$13:D$13),0)))","v":""},{"$f":"IF($D52=\"\",\"\",IF(ISBLANK(VLOOKUP($B52,'Section 2'!$C$16:$M$115,COLUMNS('Section 2'!$C$13:E$13),0)),\"\",VLOOKUP($B52,'Section 2'!$C$16:$M$115,COLUMNS('Section 2'!$C$13:E$13),0)))","v":""},{"$f":"IF($D52=\"\",\"\",IF(ISBLANK(VLOOKUP($B52,'Section 2'!$C$16:$M$115,COLUMNS('Section 2'!$C$13:F$13),0)),\"\",VLOOKUP($B52,'Section 2'!$C$16:$M$115,COLUMNS('Section 2'!$C$13:F$13),0)))","v":""},{"$f":"IF($D52=\"\",\"\",IF(ISBLANK(VLOOKUP($B52,'Section 2'!$C$16:$M$115,COLUMNS('Section 2'!$C$13:G$13),0)),\"\",VLOOKUP($B52,'Section 2'!$C$16:$M$115,COLUMNS('Section 2'!$C$13:G$13),0)))","v":""},{"$f":"IF($D52=\"\",\"\",IF(ISBLANK(VLOOKUP($B52,'Section 2'!$C$16:$M$115,COLUMNS('Section 2'!$C$13:H$13),0)),\"\",VLOOKUP($B52,'Section 2'!$C$16:$M$115,COLUMNS('Section 2'!$C$13:H$13),0)))","v":""},{"$f":"IF($D52=\"\",\"\",IF(ISBLANK(VLOOKUP($B52,'Section 2'!$C$16:$M$115,COLUMNS('Section 2'!$C$13:I$13),0)),\"\",VLOOKUP($B52,'Section 2'!$C$16:$M$115,COLUMNS('Section 2'!$C$13:I$13),0)))","v":""},{"$f":"IF($D52=\"\",\"\",IF(ISBLANK(VLOOKUP($B52,'Section 2'!$C$16:$M$115,COLUMNS('Section 2'!$C$13:J$13),0)),\"\",VLOOKUP($B52,'Section 2'!$C$16:$M$115,COLUMNS('Section 2'!$C$13:J$13),0)))","v":""},{"$f":"IF($D52=\"\",\"\",IF(ISBLANK(VLOOKUP($B52,'Section 2'!$C$16:$M$115,COLUMNS('Section 2'!$C$13:K$13),0)),\"\",VLOOKUP($B52,'Section 2'!$C$16:$M$115,COLUMNS('Section 2'!$C$13:K$13),0)))","v":""},{"$f":"IF($D52=\"\",\"\",IF(ISBLANK(VLOOKUP($B52,'Section 2'!$C$16:$M$115,COLUMNS('Section 2'!$C$13:L$13),0)),\"\",VLOOKUP($B52,'Section 2'!$C$16:$M$115,COLUMNS('Section 2'!$C$13:L$13),0)))","v":""},{"$f":"IF($D52=\"\",\"\",IF(ISBLANK(VLOOKUP($B52,'Section 2'!$C$16:$M$115,COLUMNS('Section 2'!$C$13:M$13),0)),\"\",VLOOKUP($B52,'Section 2'!$C$16:$M$115,COLUMNS('Section 2'!$C$13:M$13),0)))","v":""}]
[{"$f":"IF(D53=\"\",\"\",ROWS($A$1:A53))","v":""},52,"",{"$f":"IFERROR(VLOOKUP($B53,'Section 2'!$C$16:$M$115,COLUMNS('Section 2'!$C$13:C$13),0),\"\")","v":""},{"$f":"IF($D53=\"\",\"\",IF(ISBLANK(VLOOKUP($B53,'Section 2'!$C$16:$M$115,COLUMNS('Section 2'!$C$13:D$13),0)),\"\",VLOOKUP($B53,'Section 2'!$C$16:$M$115,COLUMNS('Section 2'!$C$13:D$13),0)))","v":""},{"$f":"IF($D53=\"\",\"\",IF(ISBLANK(VLOOKUP($B53,'Section 2'!$C$16:$M$115,COLUMNS('Section 2'!$C$13:E$13),0)),\"\",VLOOKUP($B53,'Section 2'!$C$16:$M$115,COLUMNS('Section 2'!$C$13:E$13),0)))","v":""},{"$f":"IF($D53=\"\",\"\",IF(ISBLANK(VLOOKUP($B53,'Section 2'!$C$16:$M$115,COLUMNS('Section 2'!$C$13:F$13),0)),\"\",VLOOKUP($B53,'Section 2'!$C$16:$M$115,COLUMNS('Section 2'!$C$13:F$13),0)))","v":""},{"$f":"IF($D53=\"\",\"\",IF(ISBLANK(VLOOKUP($B53,'Section 2'!$C$16:$M$115,COLUMNS('Section 2'!$C$13:G$13),0)),\"\",VLOOKUP($B53,'Section 2'!$C$16:$M$115,COLUMNS('Section 2'!$C$13:G$13),0)))","v":""},{"$f":"IF($D53=\"\",\"\",IF(ISBLANK(VLOOKUP($B53,'Section 2'!$C$16:$M$115,COLUMNS('Section 2'!$C$13:H$13),0)),\"\",VLOOKUP($B53,'Section 2'!$C$16:$M$115,COLUMNS('Section 2'!$C$13:H$13),0)))","v":""},{"$f":"IF($D53=\"\",\"\",IF(ISBLANK(VLOOKUP($B53,'Section 2'!$C$16:$M$115,COLUMNS('Section 2'!$C$13:I$13),0)),\"\",VLOOKUP($B53,'Section 2'!$C$16:$M$115,COLUMNS('Section 2'!$C$13:I$13),0)))","v":""},{"$f":"IF($D53=\"\",\"\",IF(ISBLANK(VLOOKUP($B53,'Section 2'!$C$16:$M$115,COLUMNS('Section 2'!$C$13:J$13),0)),\"\",VLOOKUP($B53,'Section 2'!$C$16:$M$115,COLUMNS('Section 2'!$C$13:J$13),0)))","v":""},{"$f":"IF($D53=\"\",\"\",IF(ISBLANK(VLOOKUP($B53,'Section 2'!$C$16:$M$115,COLUMNS('Section 2'!$C$13:K$13),0)),\"\",VLOOKUP($B53,'Section 2'!$C$16:$M$115,COLUMNS('Section 2'!$C$13:K$13),0)))","v":""},{"$f":"IF($D53=\"\",\"\",IF(ISBLANK(VLOOKUP($B53,'Section 2'!$C$16:$M$115,COLUMNS('Section 2'!$C$13:L$13),0)),\"\",VLOOKUP($B53,'Section 2'!$C$16:$M$115,COLUMNS('Section 2'!$C$13:L$13),0)))","v":""},{"$f":"IF($D53=\"\",\"\",IF(ISBLANK(VLOOKUP($B53,'Section 2'!$C$16:$M$115,COLUMNS('Section 2'!$C$13:M$13),0)),\"\",VLOOKUP($B53,'Section 2'!$C$16:$M$115,COLUMNS('Section 2'!$C$13:M$13),0)))","v":""}]
[{"$f":"IF(D54=\"\",\"\",ROWS($A$1:A54))","v":""},53,"",{"$f":"IFERROR(VLOOKUP($B54,'Section 2'!$C$16:$M$115,COLUMNS('Section 2'!$C$13:C$13),0),\"\")","v":""},{"$f":"IF($D54=\"\",\"\",IF(ISBLANK(VLOOKUP($B54,'Section 2'!$C$16:$M$115,COLUMNS('Section 2'!$C$13:D$13),0)),\"\",VLOOKUP($B54,'Section 2'!$C$16:$M$115,COLUMNS('Section 2'!$C$13:D$13),0)))","v":""},{"$f":"IF($D54=\"\",\"\",IF(ISBLANK(VLOOKUP($B54,'Section 2'!$C$16:$M$115,COLUMNS('Section 2'!$C$13:E$13),0)),\"\",VLOOKUP($B54,'Section 2'!$C$16:$M$115,COLUMNS('Section 2'!$C$13:E$13),0)))","v":""},{"$f":"IF($D54=\"\",\"\",IF(ISBLANK(VLOOKUP($B54,'Section 2'!$C$16:$M$115,COLUMNS('Section 2'!$C$13:F$13),0)),\"\",VLOOKUP($B54,'Section 2'!$C$16:$M$115,COLUMNS('Section 2'!$C$13:F$13),0)))","v":""},{"$f":"IF($D54=\"\",\"\",IF(ISBLANK(VLOOKUP($B54,'Section 2'!$C$16:$M$115,COLUMNS('Section 2'!$C$13:G$13),0)),\"\",VLOOKUP($B54,'Section 2'!$C$16:$M$115,COLUMNS('Section 2'!$C$13:G$13),0)))","v":""},{"$f":"IF($D54=\"\",\"\",IF(ISBLANK(VLOOKUP($B54,'Section 2'!$C$16:$M$115,COLUMNS('Section 2'!$C$13:H$13),0)),\"\",VLOOKUP($B54,'Section 2'!$C$16:$M$115,COLUMNS('Section 2'!$C$13:H$13),0)))","v":""},{"$f":"IF($D54=\"\",\"\",IF(ISBLANK(VLOOKUP($B54,'Section 2'!$C$16:$M$115,COLUMNS('Section 2'!$C$13:I$13),0)),\"\",VLOOKUP($B54,'Section 2'!$C$16:$M$115,COLUMNS('Section 2'!$C$13:I$13),0)))","v":""},{"$f":"IF($D54=\"\",\"\",IF(ISBLANK(VLOOKUP($B54,'Section 2'!$C$16:$M$115,COLUMNS('Section 2'!$C$13:J$13),0)),\"\",VLOOKUP($B54,'Section 2'!$C$16:$M$115,COLUMNS('Section 2'!$C$13:J$13),0)))","v":""},{"$f":"IF($D54=\"\",\"\",IF(ISBLANK(VLOOKUP($B54,'Section 2'!$C$16:$M$115,COLUMNS('Section 2'!$C$13:K$13),0)),\"\",VLOOKUP($B54,'Section 2'!$C$16:$M$115,COLUMNS('Section 2'!$C$13:K$13),0)))","v":""},{"$f":"IF($D54=\"\",\"\",IF(ISBLANK(VLOOKUP($B54,'Section 2'!$C$16:$M$115,COLUMNS('Section 2'!$C$13:L$13),0)),\"\",VLOOKUP($B54,'Section 2'!$C$16:$M$115,COLUMNS('Section 2'!$C$13:L$13),0)))","v":""},{"$f":"IF($D54=\"\",\"\",IF(ISBLANK(VLOOKUP($B54,'Section 2'!$C$16:$M$115,COLUMNS('Section 2'!$C$13:M$13),0)),\"\",VLOOKUP($B54,'Section 2'!$C$16:$M$115,COLUMNS('Section 2'!$C$13:M$13),0)))","v":""}]
[{"$f":"IF(D55=\"\",\"\",ROWS($A$1:A55))","v":""},54,"",{"$f":"IFERROR(VLOOKUP($B55,'Section 2'!$C$16:$M$115,COLUMNS('Section 2'!$C$13:C$13),0),\"\")","v":""},{"$f":"IF($D55=\"\",\"\",IF(ISBLANK(VLOOKUP($B55,'Section 2'!$C$16:$M$115,COLUMNS('Section 2'!$C$13:D$13),0)),\"\",VLOOKUP($B55,'Section 2'!$C$16:$M$115,COLUMNS('Section 2'!$C$13:D$13),0)))","v":""},{"$f":"IF($D55=\"\",\"\",IF(ISBLANK(VLOOKUP($B55,'Section 2'!$C$16:$M$115,COLUMNS('Section 2'!$C$13:E$13),0)),\"\",VLOOKUP($B55,'Section 2'!$C$16:$M$115,COLUMNS('Section 2'!$C$13:E$13),0)))","v":""},{"$f":"IF($D55=\"\",\"\",IF(ISBLANK(VLOOKUP($B55,'Section 2'!$C$16:$M$115,COLUMNS('Section 2'!$C$13:F$13),0)),\"\",VLOOKUP($B55,'Section 2'!$C$16:$M$115,COLUMNS('Section 2'!$C$13:F$13),0)))","v":""},{"$f":"IF($D55=\"\",\"\",IF(ISBLANK(VLOOKUP($B55,'Section 2'!$C$16:$M$115,COLUMNS('Section 2'!$C$13:G$13),0)),\"\",VLOOKUP($B55,'Section 2'!$C$16:$M$115,COLUMNS('Section 2'!$C$13:G$13),0)))","v":""},{"$f":"IF($D55=\"\",\"\",IF(ISBLANK(VLOOKUP($B55,'Section 2'!$C$16:$M$115,COLUMNS('Section 2'!$C$13:H$13),0)),\"\",VLOOKUP($B55,'Section 2'!$C$16:$M$115,COLUMNS('Section 2'!$C$13:H$13),0)))","v":""},{"$f":"IF($D55=\"\",\"\",IF(ISBLANK(VLOOKUP($B55,'Section 2'!$C$16:$M$115,COLUMNS('Section 2'!$C$13:I$13),0)),\"\",VLOOKUP($B55,'Section 2'!$C$16:$M$115,COLUMNS('Section 2'!$C$13:I$13),0)))","v":""},{"$f":"IF($D55=\"\",\"\",IF(ISBLANK(VLOOKUP($B55,'Section 2'!$C$16:$M$115,COLUMNS('Section 2'!$C$13:J$13),0)),\"\",VLOOKUP($B55,'Section 2'!$C$16:$M$115,COLUMNS('Section 2'!$C$13:J$13),0)))","v":""},{"$f":"IF($D55=\"\",\"\",IF(ISBLANK(VLOOKUP($B55,'Section 2'!$C$16:$M$115,COLUMNS('Section 2'!$C$13:K$13),0)),\"\",VLOOKUP($B55,'Section 2'!$C$16:$M$115,COLUMNS('Section 2'!$C$13:K$13),0)))","v":""},{"$f":"IF($D55=\"\",\"\",IF(ISBLANK(VLOOKUP($B55,'Section 2'!$C$16:$M$115,COLUMNS('Section 2'!$C$13:L$13),0)),\"\",VLOOKUP($B55,'Section 2'!$C$16:$M$115,COLUMNS('Section 2'!$C$13:L$13),0)))","v":""},{"$f":"IF($D55=\"\",\"\",IF(ISBLANK(VLOOKUP($B55,'Section 2'!$C$16:$M$115,COLUMNS('Section 2'!$C$13:M$13),0)),\"\",VLOOKUP($B55,'Section 2'!$C$16:$M$115,COLUMNS('Section 2'!$C$13:M$13),0)))","v":""}]
[{"$f":"IF(D56=\"\",\"\",ROWS($A$1:A56))","v":""},55,"",{"$f":"IFERROR(VLOOKUP($B56,'Section 2'!$C$16:$M$115,COLUMNS('Section 2'!$C$13:C$13),0),\"\")","v":""},{"$f":"IF($D56=\"\",\"\",IF(ISBLANK(VLOOKUP($B56,'Section 2'!$C$16:$M$115,COLUMNS('Section 2'!$C$13:D$13),0)),\"\",VLOOKUP($B56,'Section 2'!$C$16:$M$115,COLUMNS('Section 2'!$C$13:D$13),0)))","v":""},{"$f":"IF($D56=\"\",\"\",IF(ISBLANK(VLOOKUP($B56,'Section 2'!$C$16:$M$115,COLUMNS('Section 2'!$C$13:E$13),0)),\"\",VLOOKUP($B56,'Section 2'!$C$16:$M$115,COLUMNS('Section 2'!$C$13:E$13),0)))","v":""},{"$f":"IF($D56=\"\",\"\",IF(ISBLANK(VLOOKUP($B56,'Section 2'!$C$16:$M$115,COLUMNS('Section 2'!$C$13:F$13),0)),\"\",VLOOKUP($B56,'Section 2'!$C$16:$M$115,COLUMNS('Section 2'!$C$13:F$13),0)))","v":""},{"$f":"IF($D56=\"\",\"\",IF(ISBLANK(VLOOKUP($B56,'Section 2'!$C$16:$M$115,COLUMNS('Section 2'!$C$13:G$13),0)),\"\",VLOOKUP($B56,'Section 2'!$C$16:$M$115,COLUMNS('Section 2'!$C$13:G$13),0)))","v":""},{"$f":"IF($D56=\"\",\"\",IF(ISBLANK(VLOOKUP($B56,'Section 2'!$C$16:$M$115,COLUMNS('Section 2'!$C$13:H$13),0)),\"\",VLOOKUP($B56,'Section 2'!$C$16:$M$115,COLUMNS('Section 2'!$C$13:H$13),0)))","v":""},{"$f":"IF($D56=\"\",\"\",IF(ISBLANK(VLOOKUP($B56,'Section 2'!$C$16:$M$115,COLUMNS('Section 2'!$C$13:I$13),0)),\"\",VLOOKUP($B56,'Section 2'!$C$16:$M$115,COLUMNS('Section 2'!$C$13:I$13),0)))","v":""},{"$f":"IF($D56=\"\",\"\",IF(ISBLANK(VLOOKUP($B56,'Section 2'!$C$16:$M$115,COLUMNS('Section 2'!$C$13:J$13),0)),\"\",VLOOKUP($B56,'Section 2'!$C$16:$M$115,COLUMNS('Section 2'!$C$13:J$13),0)))","v":""},{"$f":"IF($D56=\"\",\"\",IF(ISBLANK(VLOOKUP($B56,'Section 2'!$C$16:$M$115,COLUMNS('Section 2'!$C$13:K$13),0)),\"\",VLOOKUP($B56,'Section 2'!$C$16:$M$115,COLUMNS('Section 2'!$C$13:K$13),0)))","v":""},{"$f":"IF($D56=\"\",\"\",IF(ISBLANK(VLOOKUP($B56,'Section 2'!$C$16:$M$115,COLUMNS('Section 2'!$C$13:L$13),0)),\"\",VLOOKUP($B56,'Section 2'!$C$16:$M$115,COLUMNS('Section 2'!$C$13:L$13),0)))","v":""},{"$f":"IF($D56=\"\",\"\",IF(ISBLANK(VLOOKUP($B56,'Section 2'!$C$16:$M$115,COLUMNS('Section 2'!$C$13:M$13),0)),\"\",VLOOKUP($B56,'Section 2'!$C$16:$M$115,COLUMNS('Section 2'!$C$13:M$13),0)))","v":""}]
[{"$f":"IF(D57=\"\",\"\",ROWS($A$1:A57))","v":""},56,"",{"$f":"IFERROR(VLOOKUP($B57,'Section 2'!$C$16:$M$115,COLUMNS('Section 2'!$C$13:C$13),0),\"\")","v":""},{"$f":"IF($D57=\"\",\"\",IF(ISBLANK(VLOOKUP($B57,'Section 2'!$C$16:$M$115,COLUMNS('Section 2'!$C$13:D$13),0)),\"\",VLOOKUP($B57,'Section 2'!$C$16:$M$115,COLUMNS('Section 2'!$C$13:D$13),0)))","v":""},{"$f":"IF($D57=\"\",\"\",IF(ISBLANK(VLOOKUP($B57,'Section 2'!$C$16:$M$115,COLUMNS('Section 2'!$C$13:E$13),0)),\"\",VLOOKUP($B57,'Section 2'!$C$16:$M$115,COLUMNS('Section 2'!$C$13:E$13),0)))","v":""},{"$f":"IF($D57=\"\",\"\",IF(ISBLANK(VLOOKUP($B57,'Section 2'!$C$16:$M$115,COLUMNS('Section 2'!$C$13:F$13),0)),\"\",VLOOKUP($B57,'Section 2'!$C$16:$M$115,COLUMNS('Section 2'!$C$13:F$13),0)))","v":""},{"$f":"IF($D57=\"\",\"\",IF(ISBLANK(VLOOKUP($B57,'Section 2'!$C$16:$M$115,COLUMNS('Section 2'!$C$13:G$13),0)),\"\",VLOOKUP($B57,'Section 2'!$C$16:$M$115,COLUMNS('Section 2'!$C$13:G$13),0)))","v":""},{"$f":"IF($D57=\"\",\"\",IF(ISBLANK(VLOOKUP($B57,'Section 2'!$C$16:$M$115,COLUMNS('Section 2'!$C$13:H$13),0)),\"\",VLOOKUP($B57,'Section 2'!$C$16:$M$115,COLUMNS('Section 2'!$C$13:H$13),0)))","v":""},{"$f":"IF($D57=\"\",\"\",IF(ISBLANK(VLOOKUP($B57,'Section 2'!$C$16:$M$115,COLUMNS('Section 2'!$C$13:I$13),0)),\"\",VLOOKUP($B57,'Section 2'!$C$16:$M$115,COLUMNS('Section 2'!$C$13:I$13),0)))","v":""},{"$f":"IF($D57=\"\",\"\",IF(ISBLANK(VLOOKUP($B57,'Section 2'!$C$16:$M$115,COLUMNS('Section 2'!$C$13:J$13),0)),\"\",VLOOKUP($B57,'Section 2'!$C$16:$M$115,COLUMNS('Section 2'!$C$13:J$13),0)))","v":""},{"$f":"IF($D57=\"\",\"\",IF(ISBLANK(VLOOKUP($B57,'Section 2'!$C$16:$M$115,COLUMNS('Section 2'!$C$13:K$13),0)),\"\",VLOOKUP($B57,'Section 2'!$C$16:$M$115,COLUMNS('Section 2'!$C$13:K$13),0)))","v":""},{"$f":"IF($D57=\"\",\"\",IF(ISBLANK(VLOOKUP($B57,'Section 2'!$C$16:$M$115,COLUMNS('Section 2'!$C$13:L$13),0)),\"\",VLOOKUP($B57,'Section 2'!$C$16:$M$115,COLUMNS('Section 2'!$C$13:L$13),0)))","v":""},{"$f":"IF($D57=\"\",\"\",IF(ISBLANK(VLOOKUP($B57,'Section 2'!$C$16:$M$115,COLUMNS('Section 2'!$C$13:M$13),0)),\"\",VLOOKUP($B57,'Section 2'!$C$16:$M$115,COLUMNS('Section 2'!$C$13:M$13),0)))","v":""}]
[{"$f":"IF(D58=\"\",\"\",ROWS($A$1:A58))","v":""},57,"",{"$f":"IFERROR(VLOOKUP($B58,'Section 2'!$C$16:$M$115,COLUMNS('Section 2'!$C$13:C$13),0),\"\")","v":""},{"$f":"IF($D58=\"\",\"\",IF(ISBLANK(VLOOKUP($B58,'Section 2'!$C$16:$M$115,COLUMNS('Section 2'!$C$13:D$13),0)),\"\",VLOOKUP($B58,'Section 2'!$C$16:$M$115,COLUMNS('Section 2'!$C$13:D$13),0)))","v":""},{"$f":"IF($D58=\"\",\"\",IF(ISBLANK(VLOOKUP($B58,'Section 2'!$C$16:$M$115,COLUMNS('Section 2'!$C$13:E$13),0)),\"\",VLOOKUP($B58,'Section 2'!$C$16:$M$115,COLUMNS('Section 2'!$C$13:E$13),0)))","v":""},{"$f":"IF($D58=\"\",\"\",IF(ISBLANK(VLOOKUP($B58,'Section 2'!$C$16:$M$115,COLUMNS('Section 2'!$C$13:F$13),0)),\"\",VLOOKUP($B58,'Section 2'!$C$16:$M$115,COLUMNS('Section 2'!$C$13:F$13),0)))","v":""},{"$f":"IF($D58=\"\",\"\",IF(ISBLANK(VLOOKUP($B58,'Section 2'!$C$16:$M$115,COLUMNS('Section 2'!$C$13:G$13),0)),\"\",VLOOKUP($B58,'Section 2'!$C$16:$M$115,COLUMNS('Section 2'!$C$13:G$13),0)))","v":""},{"$f":"IF($D58=\"\",\"\",IF(ISBLANK(VLOOKUP($B58,'Section 2'!$C$16:$M$115,COLUMNS('Section 2'!$C$13:H$13),0)),\"\",VLOOKUP($B58,'Section 2'!$C$16:$M$115,COLUMNS('Section 2'!$C$13:H$13),0)))","v":""},{"$f":"IF($D58=\"\",\"\",IF(ISBLANK(VLOOKUP($B58,'Section 2'!$C$16:$M$115,COLUMNS('Section 2'!$C$13:I$13),0)),\"\",VLOOKUP($B58,'Section 2'!$C$16:$M$115,COLUMNS('Section 2'!$C$13:I$13),0)))","v":""},{"$f":"IF($D58=\"\",\"\",IF(ISBLANK(VLOOKUP($B58,'Section 2'!$C$16:$M$115,COLUMNS('Section 2'!$C$13:J$13),0)),\"\",VLOOKUP($B58,'Section 2'!$C$16:$M$115,COLUMNS('Section 2'!$C$13:J$13),0)))","v":""},{"$f":"IF($D58=\"\",\"\",IF(ISBLANK(VLOOKUP($B58,'Section 2'!$C$16:$M$115,COLUMNS('Section 2'!$C$13:K$13),0)),\"\",VLOOKUP($B58,'Section 2'!$C$16:$M$115,COLUMNS('Section 2'!$C$13:K$13),0)))","v":""},{"$f":"IF($D58=\"\",\"\",IF(ISBLANK(VLOOKUP($B58,'Section 2'!$C$16:$M$115,COLUMNS('Section 2'!$C$13:L$13),0)),\"\",VLOOKUP($B58,'Section 2'!$C$16:$M$115,COLUMNS('Section 2'!$C$13:L$13),0)))","v":""},{"$f":"IF($D58=\"\",\"\",IF(ISBLANK(VLOOKUP($B58,'Section 2'!$C$16:$M$115,COLUMNS('Section 2'!$C$13:M$13),0)),\"\",VLOOKUP($B58,'Section 2'!$C$16:$M$115,COLUMNS('Section 2'!$C$13:M$13),0)))","v":""}]
[{"$f":"IF(D59=\"\",\"\",ROWS($A$1:A59))","v":""},58,"",{"$f":"IFERROR(VLOOKUP($B59,'Section 2'!$C$16:$M$115,COLUMNS('Section 2'!$C$13:C$13),0),\"\")","v":""},{"$f":"IF($D59=\"\",\"\",IF(ISBLANK(VLOOKUP($B59,'Section 2'!$C$16:$M$115,COLUMNS('Section 2'!$C$13:D$13),0)),\"\",VLOOKUP($B59,'Section 2'!$C$16:$M$115,COLUMNS('Section 2'!$C$13:D$13),0)))","v":""},{"$f":"IF($D59=\"\",\"\",IF(ISBLANK(VLOOKUP($B59,'Section 2'!$C$16:$M$115,COLUMNS('Section 2'!$C$13:E$13),0)),\"\",VLOOKUP($B59,'Section 2'!$C$16:$M$115,COLUMNS('Section 2'!$C$13:E$13),0)))","v":""},{"$f":"IF($D59=\"\",\"\",IF(ISBLANK(VLOOKUP($B59,'Section 2'!$C$16:$M$115,COLUMNS('Section 2'!$C$13:F$13),0)),\"\",VLOOKUP($B59,'Section 2'!$C$16:$M$115,COLUMNS('Section 2'!$C$13:F$13),0)))","v":""},{"$f":"IF($D59=\"\",\"\",IF(ISBLANK(VLOOKUP($B59,'Section 2'!$C$16:$M$115,COLUMNS('Section 2'!$C$13:G$13),0)),\"\",VLOOKUP($B59,'Section 2'!$C$16:$M$115,COLUMNS('Section 2'!$C$13:G$13),0)))","v":""},{"$f":"IF($D59=\"\",\"\",IF(ISBLANK(VLOOKUP($B59,'Section 2'!$C$16:$M$115,COLUMNS('Section 2'!$C$13:H$13),0)),\"\",VLOOKUP($B59,'Section 2'!$C$16:$M$115,COLUMNS('Section 2'!$C$13:H$13),0)))","v":""},{"$f":"IF($D59=\"\",\"\",IF(ISBLANK(VLOOKUP($B59,'Section 2'!$C$16:$M$115,COLUMNS('Section 2'!$C$13:I$13),0)),\"\",VLOOKUP($B59,'Section 2'!$C$16:$M$115,COLUMNS('Section 2'!$C$13:I$13),0)))","v":""},{"$f":"IF($D59=\"\",\"\",IF(ISBLANK(VLOOKUP($B59,'Section 2'!$C$16:$M$115,COLUMNS('Section 2'!$C$13:J$13),0)),\"\",VLOOKUP($B59,'Section 2'!$C$16:$M$115,COLUMNS('Section 2'!$C$13:J$13),0)))","v":""},{"$f":"IF($D59=\"\",\"\",IF(ISBLANK(VLOOKUP($B59,'Section 2'!$C$16:$M$115,COLUMNS('Section 2'!$C$13:K$13),0)),\"\",VLOOKUP($B59,'Section 2'!$C$16:$M$115,COLUMNS('Section 2'!$C$13:K$13),0)))","v":""},{"$f":"IF($D59=\"\",\"\",IF(ISBLANK(VLOOKUP($B59,'Section 2'!$C$16:$M$115,COLUMNS('Section 2'!$C$13:L$13),0)),\"\",VLOOKUP($B59,'Section 2'!$C$16:$M$115,COLUMNS('Section 2'!$C$13:L$13),0)))","v":""},{"$f":"IF($D59=\"\",\"\",IF(ISBLANK(VLOOKUP($B59,'Section 2'!$C$16:$M$115,COLUMNS('Section 2'!$C$13:M$13),0)),\"\",VLOOKUP($B59,'Section 2'!$C$16:$M$115,COLUMNS('Section 2'!$C$13:M$13),0)))","v":""}]
[{"$f":"IF(D60=\"\",\"\",ROWS($A$1:A60))","v":""},59,"",{"$f":"IFERROR(VLOOKUP($B60,'Section 2'!$C$16:$M$115,COLUMNS('Section 2'!$C$13:C$13),0),\"\")","v":""},{"$f":"IF($D60=\"\",\"\",IF(ISBLANK(VLOOKUP($B60,'Section 2'!$C$16:$M$115,COLUMNS('Section 2'!$C$13:D$13),0)),\"\",VLOOKUP($B60,'Section 2'!$C$16:$M$115,COLUMNS('Section 2'!$C$13:D$13),0)))","v":""},{"$f":"IF($D60=\"\",\"\",IF(ISBLANK(VLOOKUP($B60,'Section 2'!$C$16:$M$115,COLUMNS('Section 2'!$C$13:E$13),0)),\"\",VLOOKUP($B60,'Section 2'!$C$16:$M$115,COLUMNS('Section 2'!$C$13:E$13),0)))","v":""},{"$f":"IF($D60=\"\",\"\",IF(ISBLANK(VLOOKUP($B60,'Section 2'!$C$16:$M$115,COLUMNS('Section 2'!$C$13:F$13),0)),\"\",VLOOKUP($B60,'Section 2'!$C$16:$M$115,COLUMNS('Section 2'!$C$13:F$13),0)))","v":""},{"$f":"IF($D60=\"\",\"\",IF(ISBLANK(VLOOKUP($B60,'Section 2'!$C$16:$M$115,COLUMNS('Section 2'!$C$13:G$13),0)),\"\",VLOOKUP($B60,'Section 2'!$C$16:$M$115,COLUMNS('Section 2'!$C$13:G$13),0)))","v":""},{"$f":"IF($D60=\"\",\"\",IF(ISBLANK(VLOOKUP($B60,'Section 2'!$C$16:$M$115,COLUMNS('Section 2'!$C$13:H$13),0)),\"\",VLOOKUP($B60,'Section 2'!$C$16:$M$115,COLUMNS('Section 2'!$C$13:H$13),0)))","v":""},{"$f":"IF($D60=\"\",\"\",IF(ISBLANK(VLOOKUP($B60,'Section 2'!$C$16:$M$115,COLUMNS('Section 2'!$C$13:I$13),0)),\"\",VLOOKUP($B60,'Section 2'!$C$16:$M$115,COLUMNS('Section 2'!$C$13:I$13),0)))","v":""},{"$f":"IF($D60=\"\",\"\",IF(ISBLANK(VLOOKUP($B60,'Section 2'!$C$16:$M$115,COLUMNS('Section 2'!$C$13:J$13),0)),\"\",VLOOKUP($B60,'Section 2'!$C$16:$M$115,COLUMNS('Section 2'!$C$13:J$13),0)))","v":""},{"$f":"IF($D60=\"\",\"\",IF(ISBLANK(VLOOKUP($B60,'Section 2'!$C$16:$M$115,COLUMNS('Section 2'!$C$13:K$13),0)),\"\",VLOOKUP($B60,'Section 2'!$C$16:$M$115,COLUMNS('Section 2'!$C$13:K$13),0)))","v":""},{"$f":"IF($D60=\"\",\"\",IF(ISBLANK(VLOOKUP($B60,'Section 2'!$C$16:$M$115,COLUMNS('Section 2'!$C$13:L$13),0)),\"\",VLOOKUP($B60,'Section 2'!$C$16:$M$115,COLUMNS('Section 2'!$C$13:L$13),0)))","v":""},{"$f":"IF($D60=\"\",\"\",IF(ISBLANK(VLOOKUP($B60,'Section 2'!$C$16:$M$115,COLUMNS('Section 2'!$C$13:M$13),0)),\"\",VLOOKUP($B60,'Section 2'!$C$16:$M$115,COLUMNS('Section 2'!$C$13:M$13),0)))","v":""}]
[{"$f":"IF(D61=\"\",\"\",ROWS($A$1:A61))","v":""},60,"",{"$f":"IFERROR(VLOOKUP($B61,'Section 2'!$C$16:$M$115,COLUMNS('Section 2'!$C$13:C$13),0),\"\")","v":""},{"$f":"IF($D61=\"\",\"\",IF(ISBLANK(VLOOKUP($B61,'Section 2'!$C$16:$M$115,COLUMNS('Section 2'!$C$13:D$13),0)),\"\",VLOOKUP($B61,'Section 2'!$C$16:$M$115,COLUMNS('Section 2'!$C$13:D$13),0)))","v":""},{"$f":"IF($D61=\"\",\"\",IF(ISBLANK(VLOOKUP($B61,'Section 2'!$C$16:$M$115,COLUMNS('Section 2'!$C$13:E$13),0)),\"\",VLOOKUP($B61,'Section 2'!$C$16:$M$115,COLUMNS('Section 2'!$C$13:E$13),0)))","v":""},{"$f":"IF($D61=\"\",\"\",IF(ISBLANK(VLOOKUP($B61,'Section 2'!$C$16:$M$115,COLUMNS('Section 2'!$C$13:F$13),0)),\"\",VLOOKUP($B61,'Section 2'!$C$16:$M$115,COLUMNS('Section 2'!$C$13:F$13),0)))","v":""},{"$f":"IF($D61=\"\",\"\",IF(ISBLANK(VLOOKUP($B61,'Section 2'!$C$16:$M$115,COLUMNS('Section 2'!$C$13:G$13),0)),\"\",VLOOKUP($B61,'Section 2'!$C$16:$M$115,COLUMNS('Section 2'!$C$13:G$13),0)))","v":""},{"$f":"IF($D61=\"\",\"\",IF(ISBLANK(VLOOKUP($B61,'Section 2'!$C$16:$M$115,COLUMNS('Section 2'!$C$13:H$13),0)),\"\",VLOOKUP($B61,'Section 2'!$C$16:$M$115,COLUMNS('Section 2'!$C$13:H$13),0)))","v":""},{"$f":"IF($D61=\"\",\"\",IF(ISBLANK(VLOOKUP($B61,'Section 2'!$C$16:$M$115,COLUMNS('Section 2'!$C$13:I$13),0)),\"\",VLOOKUP($B61,'Section 2'!$C$16:$M$115,COLUMNS('Section 2'!$C$13:I$13),0)))","v":""},{"$f":"IF($D61=\"\",\"\",IF(ISBLANK(VLOOKUP($B61,'Section 2'!$C$16:$M$115,COLUMNS('Section 2'!$C$13:J$13),0)),\"\",VLOOKUP($B61,'Section 2'!$C$16:$M$115,COLUMNS('Section 2'!$C$13:J$13),0)))","v":""},{"$f":"IF($D61=\"\",\"\",IF(ISBLANK(VLOOKUP($B61,'Section 2'!$C$16:$M$115,COLUMNS('Section 2'!$C$13:K$13),0)),\"\",VLOOKUP($B61,'Section 2'!$C$16:$M$115,COLUMNS('Section 2'!$C$13:K$13),0)))","v":""},{"$f":"IF($D61=\"\",\"\",IF(ISBLANK(VLOOKUP($B61,'Section 2'!$C$16:$M$115,COLUMNS('Section 2'!$C$13:L$13),0)),\"\",VLOOKUP($B61,'Section 2'!$C$16:$M$115,COLUMNS('Section 2'!$C$13:L$13),0)))","v":""},{"$f":"IF($D61=\"\",\"\",IF(ISBLANK(VLOOKUP($B61,'Section 2'!$C$16:$M$115,COLUMNS('Section 2'!$C$13:M$13),0)),\"\",VLOOKUP($B61,'Section 2'!$C$16:$M$115,COLUMNS('Section 2'!$C$13:M$13),0)))","v":""}]
[{"$f":"IF(D62=\"\",\"\",ROWS($A$1:A62))","v":""},61,"",{"$f":"IFERROR(VLOOKUP($B62,'Section 2'!$C$16:$M$115,COLUMNS('Section 2'!$C$13:C$13),0),\"\")","v":""},{"$f":"IF($D62=\"\",\"\",IF(ISBLANK(VLOOKUP($B62,'Section 2'!$C$16:$M$115,COLUMNS('Section 2'!$C$13:D$13),0)),\"\",VLOOKUP($B62,'Section 2'!$C$16:$M$115,COLUMNS('Section 2'!$C$13:D$13),0)))","v":""},{"$f":"IF($D62=\"\",\"\",IF(ISBLANK(VLOOKUP($B62,'Section 2'!$C$16:$M$115,COLUMNS('Section 2'!$C$13:E$13),0)),\"\",VLOOKUP($B62,'Section 2'!$C$16:$M$115,COLUMNS('Section 2'!$C$13:E$13),0)))","v":""},{"$f":"IF($D62=\"\",\"\",IF(ISBLANK(VLOOKUP($B62,'Section 2'!$C$16:$M$115,COLUMNS('Section 2'!$C$13:F$13),0)),\"\",VLOOKUP($B62,'Section 2'!$C$16:$M$115,COLUMNS('Section 2'!$C$13:F$13),0)))","v":""},{"$f":"IF($D62=\"\",\"\",IF(ISBLANK(VLOOKUP($B62,'Section 2'!$C$16:$M$115,COLUMNS('Section 2'!$C$13:G$13),0)),\"\",VLOOKUP($B62,'Section 2'!$C$16:$M$115,COLUMNS('Section 2'!$C$13:G$13),0)))","v":""},{"$f":"IF($D62=\"\",\"\",IF(ISBLANK(VLOOKUP($B62,'Section 2'!$C$16:$M$115,COLUMNS('Section 2'!$C$13:H$13),0)),\"\",VLOOKUP($B62,'Section 2'!$C$16:$M$115,COLUMNS('Section 2'!$C$13:H$13),0)))","v":""},{"$f":"IF($D62=\"\",\"\",IF(ISBLANK(VLOOKUP($B62,'Section 2'!$C$16:$M$115,COLUMNS('Section 2'!$C$13:I$13),0)),\"\",VLOOKUP($B62,'Section 2'!$C$16:$M$115,COLUMNS('Section 2'!$C$13:I$13),0)))","v":""},{"$f":"IF($D62=\"\",\"\",IF(ISBLANK(VLOOKUP($B62,'Section 2'!$C$16:$M$115,COLUMNS('Section 2'!$C$13:J$13),0)),\"\",VLOOKUP($B62,'Section 2'!$C$16:$M$115,COLUMNS('Section 2'!$C$13:J$13),0)))","v":""},{"$f":"IF($D62=\"\",\"\",IF(ISBLANK(VLOOKUP($B62,'Section 2'!$C$16:$M$115,COLUMNS('Section 2'!$C$13:K$13),0)),\"\",VLOOKUP($B62,'Section 2'!$C$16:$M$115,COLUMNS('Section 2'!$C$13:K$13),0)))","v":""},{"$f":"IF($D62=\"\",\"\",IF(ISBLANK(VLOOKUP($B62,'Section 2'!$C$16:$M$115,COLUMNS('Section 2'!$C$13:L$13),0)),\"\",VLOOKUP($B62,'Section 2'!$C$16:$M$115,COLUMNS('Section 2'!$C$13:L$13),0)))","v":""},{"$f":"IF($D62=\"\",\"\",IF(ISBLANK(VLOOKUP($B62,'Section 2'!$C$16:$M$115,COLUMNS('Section 2'!$C$13:M$13),0)),\"\",VLOOKUP($B62,'Section 2'!$C$16:$M$115,COLUMNS('Section 2'!$C$13:M$13),0)))","v":""}]
[{"$f":"IF(D63=\"\",\"\",ROWS($A$1:A63))","v":""},62,"",{"$f":"IFERROR(VLOOKUP($B63,'Section 2'!$C$16:$M$115,COLUMNS('Section 2'!$C$13:C$13),0),\"\")","v":""},{"$f":"IF($D63=\"\",\"\",IF(ISBLANK(VLOOKUP($B63,'Section 2'!$C$16:$M$115,COLUMNS('Section 2'!$C$13:D$13),0)),\"\",VLOOKUP($B63,'Section 2'!$C$16:$M$115,COLUMNS('Section 2'!$C$13:D$13),0)))","v":""},{"$f":"IF($D63=\"\",\"\",IF(ISBLANK(VLOOKUP($B63,'Section 2'!$C$16:$M$115,COLUMNS('Section 2'!$C$13:E$13),0)),\"\",VLOOKUP($B63,'Section 2'!$C$16:$M$115,COLUMNS('Section 2'!$C$13:E$13),0)))","v":""},{"$f":"IF($D63=\"\",\"\",IF(ISBLANK(VLOOKUP($B63,'Section 2'!$C$16:$M$115,COLUMNS('Section 2'!$C$13:F$13),0)),\"\",VLOOKUP($B63,'Section 2'!$C$16:$M$115,COLUMNS('Section 2'!$C$13:F$13),0)))","v":""},{"$f":"IF($D63=\"\",\"\",IF(ISBLANK(VLOOKUP($B63,'Section 2'!$C$16:$M$115,COLUMNS('Section 2'!$C$13:G$13),0)),\"\",VLOOKUP($B63,'Section 2'!$C$16:$M$115,COLUMNS('Section 2'!$C$13:G$13),0)))","v":""},{"$f":"IF($D63=\"\",\"\",IF(ISBLANK(VLOOKUP($B63,'Section 2'!$C$16:$M$115,COLUMNS('Section 2'!$C$13:H$13),0)),\"\",VLOOKUP($B63,'Section 2'!$C$16:$M$115,COLUMNS('Section 2'!$C$13:H$13),0)))","v":""},{"$f":"IF($D63=\"\",\"\",IF(ISBLANK(VLOOKUP($B63,'Section 2'!$C$16:$M$115,COLUMNS('Section 2'!$C$13:I$13),0)),\"\",VLOOKUP($B63,'Section 2'!$C$16:$M$115,COLUMNS('Section 2'!$C$13:I$13),0)))","v":""},{"$f":"IF($D63=\"\",\"\",IF(ISBLANK(VLOOKUP($B63,'Section 2'!$C$16:$M$115,COLUMNS('Section 2'!$C$13:J$13),0)),\"\",VLOOKUP($B63,'Section 2'!$C$16:$M$115,COLUMNS('Section 2'!$C$13:J$13),0)))","v":""},{"$f":"IF($D63=\"\",\"\",IF(ISBLANK(VLOOKUP($B63,'Section 2'!$C$16:$M$115,COLUMNS('Section 2'!$C$13:K$13),0)),\"\",VLOOKUP($B63,'Section 2'!$C$16:$M$115,COLUMNS('Section 2'!$C$13:K$13),0)))","v":""},{"$f":"IF($D63=\"\",\"\",IF(ISBLANK(VLOOKUP($B63,'Section 2'!$C$16:$M$115,COLUMNS('Section 2'!$C$13:L$13),0)),\"\",VLOOKUP($B63,'Section 2'!$C$16:$M$115,COLUMNS('Section 2'!$C$13:L$13),0)))","v":""},{"$f":"IF($D63=\"\",\"\",IF(ISBLANK(VLOOKUP($B63,'Section 2'!$C$16:$M$115,COLUMNS('Section 2'!$C$13:M$13),0)),\"\",VLOOKUP($B63,'Section 2'!$C$16:$M$115,COLUMNS('Section 2'!$C$13:M$13),0)))","v":""}]
[{"$f":"IF(D64=\"\",\"\",ROWS($A$1:A64))","v":""},63,"",{"$f":"IFERROR(VLOOKUP($B64,'Section 2'!$C$16:$M$115,COLUMNS('Section 2'!$C$13:C$13),0),\"\")","v":""},{"$f":"IF($D64=\"\",\"\",IF(ISBLANK(VLOOKUP($B64,'Section 2'!$C$16:$M$115,COLUMNS('Section 2'!$C$13:D$13),0)),\"\",VLOOKUP($B64,'Section 2'!$C$16:$M$115,COLUMNS('Section 2'!$C$13:D$13),0)))","v":""},{"$f":"IF($D64=\"\",\"\",IF(ISBLANK(VLOOKUP($B64,'Section 2'!$C$16:$M$115,COLUMNS('Section 2'!$C$13:E$13),0)),\"\",VLOOKUP($B64,'Section 2'!$C$16:$M$115,COLUMNS('Section 2'!$C$13:E$13),0)))","v":""},{"$f":"IF($D64=\"\",\"\",IF(ISBLANK(VLOOKUP($B64,'Section 2'!$C$16:$M$115,COLUMNS('Section 2'!$C$13:F$13),0)),\"\",VLOOKUP($B64,'Section 2'!$C$16:$M$115,COLUMNS('Section 2'!$C$13:F$13),0)))","v":""},{"$f":"IF($D64=\"\",\"\",IF(ISBLANK(VLOOKUP($B64,'Section 2'!$C$16:$M$115,COLUMNS('Section 2'!$C$13:G$13),0)),\"\",VLOOKUP($B64,'Section 2'!$C$16:$M$115,COLUMNS('Section 2'!$C$13:G$13),0)))","v":""},{"$f":"IF($D64=\"\",\"\",IF(ISBLANK(VLOOKUP($B64,'Section 2'!$C$16:$M$115,COLUMNS('Section 2'!$C$13:H$13),0)),\"\",VLOOKUP($B64,'Section 2'!$C$16:$M$115,COLUMNS('Section 2'!$C$13:H$13),0)))","v":""},{"$f":"IF($D64=\"\",\"\",IF(ISBLANK(VLOOKUP($B64,'Section 2'!$C$16:$M$115,COLUMNS('Section 2'!$C$13:I$13),0)),\"\",VLOOKUP($B64,'Section 2'!$C$16:$M$115,COLUMNS('Section 2'!$C$13:I$13),0)))","v":""},{"$f":"IF($D64=\"\",\"\",IF(ISBLANK(VLOOKUP($B64,'Section 2'!$C$16:$M$115,COLUMNS('Section 2'!$C$13:J$13),0)),\"\",VLOOKUP($B64,'Section 2'!$C$16:$M$115,COLUMNS('Section 2'!$C$13:J$13),0)))","v":""},{"$f":"IF($D64=\"\",\"\",IF(ISBLANK(VLOOKUP($B64,'Section 2'!$C$16:$M$115,COLUMNS('Section 2'!$C$13:K$13),0)),\"\",VLOOKUP($B64,'Section 2'!$C$16:$M$115,COLUMNS('Section 2'!$C$13:K$13),0)))","v":""},{"$f":"IF($D64=\"\",\"\",IF(ISBLANK(VLOOKUP($B64,'Section 2'!$C$16:$M$115,COLUMNS('Section 2'!$C$13:L$13),0)),\"\",VLOOKUP($B64,'Section 2'!$C$16:$M$115,COLUMNS('Section 2'!$C$13:L$13),0)))","v":""},{"$f":"IF($D64=\"\",\"\",IF(ISBLANK(VLOOKUP($B64,'Section 2'!$C$16:$M$115,COLUMNS('Section 2'!$C$13:M$13),0)),\"\",VLOOKUP($B64,'Section 2'!$C$16:$M$115,COLUMNS('Section 2'!$C$13:M$13),0)))","v":""}]
[{"$f":"IF(D65=\"\",\"\",ROWS($A$1:A65))","v":""},64,"",{"$f":"IFERROR(VLOOKUP($B65,'Section 2'!$C$16:$M$115,COLUMNS('Section 2'!$C$13:C$13),0),\"\")","v":""},{"$f":"IF($D65=\"\",\"\",IF(ISBLANK(VLOOKUP($B65,'Section 2'!$C$16:$M$115,COLUMNS('Section 2'!$C$13:D$13),0)),\"\",VLOOKUP($B65,'Section 2'!$C$16:$M$115,COLUMNS('Section 2'!$C$13:D$13),0)))","v":""},{"$f":"IF($D65=\"\",\"\",IF(ISBLANK(VLOOKUP($B65,'Section 2'!$C$16:$M$115,COLUMNS('Section 2'!$C$13:E$13),0)),\"\",VLOOKUP($B65,'Section 2'!$C$16:$M$115,COLUMNS('Section 2'!$C$13:E$13),0)))","v":""},{"$f":"IF($D65=\"\",\"\",IF(ISBLANK(VLOOKUP($B65,'Section 2'!$C$16:$M$115,COLUMNS('Section 2'!$C$13:F$13),0)),\"\",VLOOKUP($B65,'Section 2'!$C$16:$M$115,COLUMNS('Section 2'!$C$13:F$13),0)))","v":""},{"$f":"IF($D65=\"\",\"\",IF(ISBLANK(VLOOKUP($B65,'Section 2'!$C$16:$M$115,COLUMNS('Section 2'!$C$13:G$13),0)),\"\",VLOOKUP($B65,'Section 2'!$C$16:$M$115,COLUMNS('Section 2'!$C$13:G$13),0)))","v":""},{"$f":"IF($D65=\"\",\"\",IF(ISBLANK(VLOOKUP($B65,'Section 2'!$C$16:$M$115,COLUMNS('Section 2'!$C$13:H$13),0)),\"\",VLOOKUP($B65,'Section 2'!$C$16:$M$115,COLUMNS('Section 2'!$C$13:H$13),0)))","v":""},{"$f":"IF($D65=\"\",\"\",IF(ISBLANK(VLOOKUP($B65,'Section 2'!$C$16:$M$115,COLUMNS('Section 2'!$C$13:I$13),0)),\"\",VLOOKUP($B65,'Section 2'!$C$16:$M$115,COLUMNS('Section 2'!$C$13:I$13),0)))","v":""},{"$f":"IF($D65=\"\",\"\",IF(ISBLANK(VLOOKUP($B65,'Section 2'!$C$16:$M$115,COLUMNS('Section 2'!$C$13:J$13),0)),\"\",VLOOKUP($B65,'Section 2'!$C$16:$M$115,COLUMNS('Section 2'!$C$13:J$13),0)))","v":""},{"$f":"IF($D65=\"\",\"\",IF(ISBLANK(VLOOKUP($B65,'Section 2'!$C$16:$M$115,COLUMNS('Section 2'!$C$13:K$13),0)),\"\",VLOOKUP($B65,'Section 2'!$C$16:$M$115,COLUMNS('Section 2'!$C$13:K$13),0)))","v":""},{"$f":"IF($D65=\"\",\"\",IF(ISBLANK(VLOOKUP($B65,'Section 2'!$C$16:$M$115,COLUMNS('Section 2'!$C$13:L$13),0)),\"\",VLOOKUP($B65,'Section 2'!$C$16:$M$115,COLUMNS('Section 2'!$C$13:L$13),0)))","v":""},{"$f":"IF($D65=\"\",\"\",IF(ISBLANK(VLOOKUP($B65,'Section 2'!$C$16:$M$115,COLUMNS('Section 2'!$C$13:M$13),0)),\"\",VLOOKUP($B65,'Section 2'!$C$16:$M$115,COLUMNS('Section 2'!$C$13:M$13),0)))","v":""}]
[{"$f":"IF(D66=\"\",\"\",ROWS($A$1:A66))","v":""},65,"",{"$f":"IFERROR(VLOOKUP($B66,'Section 2'!$C$16:$M$115,COLUMNS('Section 2'!$C$13:C$13),0),\"\")","v":""},{"$f":"IF($D66=\"\",\"\",IF(ISBLANK(VLOOKUP($B66,'Section 2'!$C$16:$M$115,COLUMNS('Section 2'!$C$13:D$13),0)),\"\",VLOOKUP($B66,'Section 2'!$C$16:$M$115,COLUMNS('Section 2'!$C$13:D$13),0)))","v":""},{"$f":"IF($D66=\"\",\"\",IF(ISBLANK(VLOOKUP($B66,'Section 2'!$C$16:$M$115,COLUMNS('Section 2'!$C$13:E$13),0)),\"\",VLOOKUP($B66,'Section 2'!$C$16:$M$115,COLUMNS('Section 2'!$C$13:E$13),0)))","v":""},{"$f":"IF($D66=\"\",\"\",IF(ISBLANK(VLOOKUP($B66,'Section 2'!$C$16:$M$115,COLUMNS('Section 2'!$C$13:F$13),0)),\"\",VLOOKUP($B66,'Section 2'!$C$16:$M$115,COLUMNS('Section 2'!$C$13:F$13),0)))","v":""},{"$f":"IF($D66=\"\",\"\",IF(ISBLANK(VLOOKUP($B66,'Section 2'!$C$16:$M$115,COLUMNS('Section 2'!$C$13:G$13),0)),\"\",VLOOKUP($B66,'Section 2'!$C$16:$M$115,COLUMNS('Section 2'!$C$13:G$13),0)))","v":""},{"$f":"IF($D66=\"\",\"\",IF(ISBLANK(VLOOKUP($B66,'Section 2'!$C$16:$M$115,COLUMNS('Section 2'!$C$13:H$13),0)),\"\",VLOOKUP($B66,'Section 2'!$C$16:$M$115,COLUMNS('Section 2'!$C$13:H$13),0)))","v":""},{"$f":"IF($D66=\"\",\"\",IF(ISBLANK(VLOOKUP($B66,'Section 2'!$C$16:$M$115,COLUMNS('Section 2'!$C$13:I$13),0)),\"\",VLOOKUP($B66,'Section 2'!$C$16:$M$115,COLUMNS('Section 2'!$C$13:I$13),0)))","v":""},{"$f":"IF($D66=\"\",\"\",IF(ISBLANK(VLOOKUP($B66,'Section 2'!$C$16:$M$115,COLUMNS('Section 2'!$C$13:J$13),0)),\"\",VLOOKUP($B66,'Section 2'!$C$16:$M$115,COLUMNS('Section 2'!$C$13:J$13),0)))","v":""},{"$f":"IF($D66=\"\",\"\",IF(ISBLANK(VLOOKUP($B66,'Section 2'!$C$16:$M$115,COLUMNS('Section 2'!$C$13:K$13),0)),\"\",VLOOKUP($B66,'Section 2'!$C$16:$M$115,COLUMNS('Section 2'!$C$13:K$13),0)))","v":""},{"$f":"IF($D66=\"\",\"\",IF(ISBLANK(VLOOKUP($B66,'Section 2'!$C$16:$M$115,COLUMNS('Section 2'!$C$13:L$13),0)),\"\",VLOOKUP($B66,'Section 2'!$C$16:$M$115,COLUMNS('Section 2'!$C$13:L$13),0)))","v":""},{"$f":"IF($D66=\"\",\"\",IF(ISBLANK(VLOOKUP($B66,'Section 2'!$C$16:$M$115,COLUMNS('Section 2'!$C$13:M$13),0)),\"\",VLOOKUP($B66,'Section 2'!$C$16:$M$115,COLUMNS('Section 2'!$C$13:M$13),0)))","v":""}]
[{"$f":"IF(D67=\"\",\"\",ROWS($A$1:A67))","v":""},66,{"$f":"IF(D67=\"\",\"\",2)","v":""},{"$f":"IFERROR(VLOOKUP($B67,'Section 2'!$C$16:$M$115,COLUMNS('Section 2'!$C$13:C$13),0),\"\")","v":""},{"$f":"IF($D67=\"\",\"\",IF(ISBLANK(VLOOKUP($B67,'Section 2'!$C$16:$M$115,COLUMNS('Section 2'!$C$13:D$13),0)),\"\",VLOOKUP($B67,'Section 2'!$C$16:$M$115,COLUMNS('Section 2'!$C$13:D$13),0)))","v":""},{"$f":"IF($D67=\"\",\"\",IF(ISBLANK(VLOOKUP($B67,'Section 2'!$C$16:$M$115,COLUMNS('Section 2'!$C$13:E$13),0)),\"\",VLOOKUP($B67,'Section 2'!$C$16:$M$115,COLUMNS('Section 2'!$C$13:E$13),0)))","v":""},{"$f":"IF($D67=\"\",\"\",IF(ISBLANK(VLOOKUP($B67,'Section 2'!$C$16:$M$115,COLUMNS('Section 2'!$C$13:F$13),0)),\"\",VLOOKUP($B67,'Section 2'!$C$16:$M$115,COLUMNS('Section 2'!$C$13:F$13),0)))","v":""},{"$f":"IF($D67=\"\",\"\",IF(ISBLANK(VLOOKUP($B67,'Section 2'!$C$16:$M$115,COLUMNS('Section 2'!$C$13:G$13),0)),\"\",VLOOKUP($B67,'Section 2'!$C$16:$M$115,COLUMNS('Section 2'!$C$13:G$13),0)))","v":""},{"$f":"IF($D67=\"\",\"\",IF(ISBLANK(VLOOKUP($B67,'Section 2'!$C$16:$M$115,COLUMNS('Section 2'!$C$13:H$13),0)),\"\",VLOOKUP($B67,'Section 2'!$C$16:$M$115,COLUMNS('Section 2'!$C$13:H$13),0)))","v":""},{"$f":"IF($D67=\"\",\"\",IF(ISBLANK(VLOOKUP($B67,'Section 2'!$C$16:$M$115,COLUMNS('Section 2'!$C$13:I$13),0)),\"\",VLOOKUP($B67,'Section 2'!$C$16:$M$115,COLUMNS('Section 2'!$C$13:I$13),0)))","v":""},{"$f":"IF($D67=\"\",\"\",IF(ISBLANK(VLOOKUP($B67,'Section 2'!$C$16:$M$115,COLUMNS('Section 2'!$C$13:J$13),0)),\"\",VLOOKUP($B67,'Section 2'!$C$16:$M$115,COLUMNS('Section 2'!$C$13:J$13),0)))","v":""},{"$f":"IF($D67=\"\",\"\",IF(ISBLANK(VLOOKUP($B67,'Section 2'!$C$16:$M$115,COLUMNS('Section 2'!$C$13:K$13),0)),\"\",VLOOKUP($B67,'Section 2'!$C$16:$M$115,COLUMNS('Section 2'!$C$13:K$13),0)))","v":""},{"$f":"IF($D67=\"\",\"\",IF(ISBLANK(VLOOKUP($B67,'Section 2'!$C$16:$M$115,COLUMNS('Section 2'!$C$13:L$13),0)),\"\",VLOOKUP($B67,'Section 2'!$C$16:$M$115,COLUMNS('Section 2'!$C$13:L$13),0)))","v":""},{"$f":"IF($D67=\"\",\"\",IF(ISBLANK(VLOOKUP($B67,'Section 2'!$C$16:$M$115,COLUMNS('Section 2'!$C$13:M$13),0)),\"\",VLOOKUP($B67,'Section 2'!$C$16:$M$115,COLUMNS('Section 2'!$C$13:M$13),0)))","v":""}]
[{"$f":"IF(D68=\"\",\"\",ROWS($A$1:A68))","v":""},67,"",{"$f":"IFERROR(VLOOKUP($B68,'Section 2'!$C$16:$M$115,COLUMNS('Section 2'!$C$13:C$13),0),\"\")","v":""},{"$f":"IF($D68=\"\",\"\",IF(ISBLANK(VLOOKUP($B68,'Section 2'!$C$16:$M$115,COLUMNS('Section 2'!$C$13:D$13),0)),\"\",VLOOKUP($B68,'Section 2'!$C$16:$M$115,COLUMNS('Section 2'!$C$13:D$13),0)))","v":""},{"$f":"IF($D68=\"\",\"\",IF(ISBLANK(VLOOKUP($B68,'Section 2'!$C$16:$M$115,COLUMNS('Section 2'!$C$13:E$13),0)),\"\",VLOOKUP($B68,'Section 2'!$C$16:$M$115,COLUMNS('Section 2'!$C$13:E$13),0)))","v":""},{"$f":"IF($D68=\"\",\"\",IF(ISBLANK(VLOOKUP($B68,'Section 2'!$C$16:$M$115,COLUMNS('Section 2'!$C$13:F$13),0)),\"\",VLOOKUP($B68,'Section 2'!$C$16:$M$115,COLUMNS('Section 2'!$C$13:F$13),0)))","v":""},{"$f":"IF($D68=\"\",\"\",IF(ISBLANK(VLOOKUP($B68,'Section 2'!$C$16:$M$115,COLUMNS('Section 2'!$C$13:G$13),0)),\"\",VLOOKUP($B68,'Section 2'!$C$16:$M$115,COLUMNS('Section 2'!$C$13:G$13),0)))","v":""},{"$f":"IF($D68=\"\",\"\",IF(ISBLANK(VLOOKUP($B68,'Section 2'!$C$16:$M$115,COLUMNS('Section 2'!$C$13:H$13),0)),\"\",VLOOKUP($B68,'Section 2'!$C$16:$M$115,COLUMNS('Section 2'!$C$13:H$13),0)))","v":""},{"$f":"IF($D68=\"\",\"\",IF(ISBLANK(VLOOKUP($B68,'Section 2'!$C$16:$M$115,COLUMNS('Section 2'!$C$13:I$13),0)),\"\",VLOOKUP($B68,'Section 2'!$C$16:$M$115,COLUMNS('Section 2'!$C$13:I$13),0)))","v":""},{"$f":"IF($D68=\"\",\"\",IF(ISBLANK(VLOOKUP($B68,'Section 2'!$C$16:$M$115,COLUMNS('Section 2'!$C$13:J$13),0)),\"\",VLOOKUP($B68,'Section 2'!$C$16:$M$115,COLUMNS('Section 2'!$C$13:J$13),0)))","v":""},{"$f":"IF($D68=\"\",\"\",IF(ISBLANK(VLOOKUP($B68,'Section 2'!$C$16:$M$115,COLUMNS('Section 2'!$C$13:K$13),0)),\"\",VLOOKUP($B68,'Section 2'!$C$16:$M$115,COLUMNS('Section 2'!$C$13:K$13),0)))","v":""},{"$f":"IF($D68=\"\",\"\",IF(ISBLANK(VLOOKUP($B68,'Section 2'!$C$16:$M$115,COLUMNS('Section 2'!$C$13:L$13),0)),\"\",VLOOKUP($B68,'Section 2'!$C$16:$M$115,COLUMNS('Section 2'!$C$13:L$13),0)))","v":""},{"$f":"IF($D68=\"\",\"\",IF(ISBLANK(VLOOKUP($B68,'Section 2'!$C$16:$M$115,COLUMNS('Section 2'!$C$13:M$13),0)),\"\",VLOOKUP($B68,'Section 2'!$C$16:$M$115,COLUMNS('Section 2'!$C$13:M$13),0)))","v":""}]
[{"$f":"IF(D69=\"\",\"\",ROWS($A$1:A69))","v":""},68,"",{"$f":"IFERROR(VLOOKUP($B69,'Section 2'!$C$16:$M$115,COLUMNS('Section 2'!$C$13:C$13),0),\"\")","v":""},{"$f":"IF($D69=\"\",\"\",IF(ISBLANK(VLOOKUP($B69,'Section 2'!$C$16:$M$115,COLUMNS('Section 2'!$C$13:D$13),0)),\"\",VLOOKUP($B69,'Section 2'!$C$16:$M$115,COLUMNS('Section 2'!$C$13:D$13),0)))","v":""},{"$f":"IF($D69=\"\",\"\",IF(ISBLANK(VLOOKUP($B69,'Section 2'!$C$16:$M$115,COLUMNS('Section 2'!$C$13:E$13),0)),\"\",VLOOKUP($B69,'Section 2'!$C$16:$M$115,COLUMNS('Section 2'!$C$13:E$13),0)))","v":""},{"$f":"IF($D69=\"\",\"\",IF(ISBLANK(VLOOKUP($B69,'Section 2'!$C$16:$M$115,COLUMNS('Section 2'!$C$13:F$13),0)),\"\",VLOOKUP($B69,'Section 2'!$C$16:$M$115,COLUMNS('Section 2'!$C$13:F$13),0)))","v":""},{"$f":"IF($D69=\"\",\"\",IF(ISBLANK(VLOOKUP($B69,'Section 2'!$C$16:$M$115,COLUMNS('Section 2'!$C$13:G$13),0)),\"\",VLOOKUP($B69,'Section 2'!$C$16:$M$115,COLUMNS('Section 2'!$C$13:G$13),0)))","v":""},{"$f":"IF($D69=\"\",\"\",IF(ISBLANK(VLOOKUP($B69,'Section 2'!$C$16:$M$115,COLUMNS('Section 2'!$C$13:H$13),0)),\"\",VLOOKUP($B69,'Section 2'!$C$16:$M$115,COLUMNS('Section 2'!$C$13:H$13),0)))","v":""},{"$f":"IF($D69=\"\",\"\",IF(ISBLANK(VLOOKUP($B69,'Section 2'!$C$16:$M$115,COLUMNS('Section 2'!$C$13:I$13),0)),\"\",VLOOKUP($B69,'Section 2'!$C$16:$M$115,COLUMNS('Section 2'!$C$13:I$13),0)))","v":""},{"$f":"IF($D69=\"\",\"\",IF(ISBLANK(VLOOKUP($B69,'Section 2'!$C$16:$M$115,COLUMNS('Section 2'!$C$13:J$13),0)),\"\",VLOOKUP($B69,'Section 2'!$C$16:$M$115,COLUMNS('Section 2'!$C$13:J$13),0)))","v":""},{"$f":"IF($D69=\"\",\"\",IF(ISBLANK(VLOOKUP($B69,'Section 2'!$C$16:$M$115,COLUMNS('Section 2'!$C$13:K$13),0)),\"\",VLOOKUP($B69,'Section 2'!$C$16:$M$115,COLUMNS('Section 2'!$C$13:K$13),0)))","v":""},{"$f":"IF($D69=\"\",\"\",IF(ISBLANK(VLOOKUP($B69,'Section 2'!$C$16:$M$115,COLUMNS('Section 2'!$C$13:L$13),0)),\"\",VLOOKUP($B69,'Section 2'!$C$16:$M$115,COLUMNS('Section 2'!$C$13:L$13),0)))","v":""},{"$f":"IF($D69=\"\",\"\",IF(ISBLANK(VLOOKUP($B69,'Section 2'!$C$16:$M$115,COLUMNS('Section 2'!$C$13:M$13),0)),\"\",VLOOKUP($B69,'Section 2'!$C$16:$M$115,COLUMNS('Section 2'!$C$13:M$13),0)))","v":""}]
[{"$f":"IF(D70=\"\",\"\",ROWS($A$1:A70))","v":""},69,"",{"$f":"IFERROR(VLOOKUP($B70,'Section 2'!$C$16:$M$115,COLUMNS('Section 2'!$C$13:C$13),0),\"\")","v":""},{"$f":"IF($D70=\"\",\"\",IF(ISBLANK(VLOOKUP($B70,'Section 2'!$C$16:$M$115,COLUMNS('Section 2'!$C$13:D$13),0)),\"\",VLOOKUP($B70,'Section 2'!$C$16:$M$115,COLUMNS('Section 2'!$C$13:D$13),0)))","v":""},{"$f":"IF($D70=\"\",\"\",IF(ISBLANK(VLOOKUP($B70,'Section 2'!$C$16:$M$115,COLUMNS('Section 2'!$C$13:E$13),0)),\"\",VLOOKUP($B70,'Section 2'!$C$16:$M$115,COLUMNS('Section 2'!$C$13:E$13),0)))","v":""},{"$f":"IF($D70=\"\",\"\",IF(ISBLANK(VLOOKUP($B70,'Section 2'!$C$16:$M$115,COLUMNS('Section 2'!$C$13:F$13),0)),\"\",VLOOKUP($B70,'Section 2'!$C$16:$M$115,COLUMNS('Section 2'!$C$13:F$13),0)))","v":""},{"$f":"IF($D70=\"\",\"\",IF(ISBLANK(VLOOKUP($B70,'Section 2'!$C$16:$M$115,COLUMNS('Section 2'!$C$13:G$13),0)),\"\",VLOOKUP($B70,'Section 2'!$C$16:$M$115,COLUMNS('Section 2'!$C$13:G$13),0)))","v":""},{"$f":"IF($D70=\"\",\"\",IF(ISBLANK(VLOOKUP($B70,'Section 2'!$C$16:$M$115,COLUMNS('Section 2'!$C$13:H$13),0)),\"\",VLOOKUP($B70,'Section 2'!$C$16:$M$115,COLUMNS('Section 2'!$C$13:H$13),0)))","v":""},{"$f":"IF($D70=\"\",\"\",IF(ISBLANK(VLOOKUP($B70,'Section 2'!$C$16:$M$115,COLUMNS('Section 2'!$C$13:I$13),0)),\"\",VLOOKUP($B70,'Section 2'!$C$16:$M$115,COLUMNS('Section 2'!$C$13:I$13),0)))","v":""},{"$f":"IF($D70=\"\",\"\",IF(ISBLANK(VLOOKUP($B70,'Section 2'!$C$16:$M$115,COLUMNS('Section 2'!$C$13:J$13),0)),\"\",VLOOKUP($B70,'Section 2'!$C$16:$M$115,COLUMNS('Section 2'!$C$13:J$13),0)))","v":""},{"$f":"IF($D70=\"\",\"\",IF(ISBLANK(VLOOKUP($B70,'Section 2'!$C$16:$M$115,COLUMNS('Section 2'!$C$13:K$13),0)),\"\",VLOOKUP($B70,'Section 2'!$C$16:$M$115,COLUMNS('Section 2'!$C$13:K$13),0)))","v":""},{"$f":"IF($D70=\"\",\"\",IF(ISBLANK(VLOOKUP($B70,'Section 2'!$C$16:$M$115,COLUMNS('Section 2'!$C$13:L$13),0)),\"\",VLOOKUP($B70,'Section 2'!$C$16:$M$115,COLUMNS('Section 2'!$C$13:L$13),0)))","v":""},{"$f":"IF($D70=\"\",\"\",IF(ISBLANK(VLOOKUP($B70,'Section 2'!$C$16:$M$115,COLUMNS('Section 2'!$C$13:M$13),0)),\"\",VLOOKUP($B70,'Section 2'!$C$16:$M$115,COLUMNS('Section 2'!$C$13:M$13),0)))","v":""}]
[{"$f":"IF(D71=\"\",\"\",ROWS($A$1:A71))","v":""},70,"",{"$f":"IFERROR(VLOOKUP($B71,'Section 2'!$C$16:$M$115,COLUMNS('Section 2'!$C$13:C$13),0),\"\")","v":""},{"$f":"IF($D71=\"\",\"\",IF(ISBLANK(VLOOKUP($B71,'Section 2'!$C$16:$M$115,COLUMNS('Section 2'!$C$13:D$13),0)),\"\",VLOOKUP($B71,'Section 2'!$C$16:$M$115,COLUMNS('Section 2'!$C$13:D$13),0)))","v":""},{"$f":"IF($D71=\"\",\"\",IF(ISBLANK(VLOOKUP($B71,'Section 2'!$C$16:$M$115,COLUMNS('Section 2'!$C$13:E$13),0)),\"\",VLOOKUP($B71,'Section 2'!$C$16:$M$115,COLUMNS('Section 2'!$C$13:E$13),0)))","v":""},{"$f":"IF($D71=\"\",\"\",IF(ISBLANK(VLOOKUP($B71,'Section 2'!$C$16:$M$115,COLUMNS('Section 2'!$C$13:F$13),0)),\"\",VLOOKUP($B71,'Section 2'!$C$16:$M$115,COLUMNS('Section 2'!$C$13:F$13),0)))","v":""},{"$f":"IF($D71=\"\",\"\",IF(ISBLANK(VLOOKUP($B71,'Section 2'!$C$16:$M$115,COLUMNS('Section 2'!$C$13:G$13),0)),\"\",VLOOKUP($B71,'Section 2'!$C$16:$M$115,COLUMNS('Section 2'!$C$13:G$13),0)))","v":""},{"$f":"IF($D71=\"\",\"\",IF(ISBLANK(VLOOKUP($B71,'Section 2'!$C$16:$M$115,COLUMNS('Section 2'!$C$13:H$13),0)),\"\",VLOOKUP($B71,'Section 2'!$C$16:$M$115,COLUMNS('Section 2'!$C$13:H$13),0)))","v":""},{"$f":"IF($D71=\"\",\"\",IF(ISBLANK(VLOOKUP($B71,'Section 2'!$C$16:$M$115,COLUMNS('Section 2'!$C$13:I$13),0)),\"\",VLOOKUP($B71,'Section 2'!$C$16:$M$115,COLUMNS('Section 2'!$C$13:I$13),0)))","v":""},{"$f":"IF($D71=\"\",\"\",IF(ISBLANK(VLOOKUP($B71,'Section 2'!$C$16:$M$115,COLUMNS('Section 2'!$C$13:J$13),0)),\"\",VLOOKUP($B71,'Section 2'!$C$16:$M$115,COLUMNS('Section 2'!$C$13:J$13),0)))","v":""},{"$f":"IF($D71=\"\",\"\",IF(ISBLANK(VLOOKUP($B71,'Section 2'!$C$16:$M$115,COLUMNS('Section 2'!$C$13:K$13),0)),\"\",VLOOKUP($B71,'Section 2'!$C$16:$M$115,COLUMNS('Section 2'!$C$13:K$13),0)))","v":""},{"$f":"IF($D71=\"\",\"\",IF(ISBLANK(VLOOKUP($B71,'Section 2'!$C$16:$M$115,COLUMNS('Section 2'!$C$13:L$13),0)),\"\",VLOOKUP($B71,'Section 2'!$C$16:$M$115,COLUMNS('Section 2'!$C$13:L$13),0)))","v":""},{"$f":"IF($D71=\"\",\"\",IF(ISBLANK(VLOOKUP($B71,'Section 2'!$C$16:$M$115,COLUMNS('Section 2'!$C$13:M$13),0)),\"\",VLOOKUP($B71,'Section 2'!$C$16:$M$115,COLUMNS('Section 2'!$C$13:M$13),0)))","v":""}]
[{"$f":"IF(D72=\"\",\"\",ROWS($A$1:A72))","v":""},71,"",{"$f":"IFERROR(VLOOKUP($B72,'Section 2'!$C$16:$M$115,COLUMNS('Section 2'!$C$13:C$13),0),\"\")","v":""},{"$f":"IF($D72=\"\",\"\",IF(ISBLANK(VLOOKUP($B72,'Section 2'!$C$16:$M$115,COLUMNS('Section 2'!$C$13:D$13),0)),\"\",VLOOKUP($B72,'Section 2'!$C$16:$M$115,COLUMNS('Section 2'!$C$13:D$13),0)))","v":""},{"$f":"IF($D72=\"\",\"\",IF(ISBLANK(VLOOKUP($B72,'Section 2'!$C$16:$M$115,COLUMNS('Section 2'!$C$13:E$13),0)),\"\",VLOOKUP($B72,'Section 2'!$C$16:$M$115,COLUMNS('Section 2'!$C$13:E$13),0)))","v":""},{"$f":"IF($D72=\"\",\"\",IF(ISBLANK(VLOOKUP($B72,'Section 2'!$C$16:$M$115,COLUMNS('Section 2'!$C$13:F$13),0)),\"\",VLOOKUP($B72,'Section 2'!$C$16:$M$115,COLUMNS('Section 2'!$C$13:F$13),0)))","v":""},{"$f":"IF($D72=\"\",\"\",IF(ISBLANK(VLOOKUP($B72,'Section 2'!$C$16:$M$115,COLUMNS('Section 2'!$C$13:G$13),0)),\"\",VLOOKUP($B72,'Section 2'!$C$16:$M$115,COLUMNS('Section 2'!$C$13:G$13),0)))","v":""},{"$f":"IF($D72=\"\",\"\",IF(ISBLANK(VLOOKUP($B72,'Section 2'!$C$16:$M$115,COLUMNS('Section 2'!$C$13:H$13),0)),\"\",VLOOKUP($B72,'Section 2'!$C$16:$M$115,COLUMNS('Section 2'!$C$13:H$13),0)))","v":""},{"$f":"IF($D72=\"\",\"\",IF(ISBLANK(VLOOKUP($B72,'Section 2'!$C$16:$M$115,COLUMNS('Section 2'!$C$13:I$13),0)),\"\",VLOOKUP($B72,'Section 2'!$C$16:$M$115,COLUMNS('Section 2'!$C$13:I$13),0)))","v":""},{"$f":"IF($D72=\"\",\"\",IF(ISBLANK(VLOOKUP($B72,'Section 2'!$C$16:$M$115,COLUMNS('Section 2'!$C$13:J$13),0)),\"\",VLOOKUP($B72,'Section 2'!$C$16:$M$115,COLUMNS('Section 2'!$C$13:J$13),0)))","v":""},{"$f":"IF($D72=\"\",\"\",IF(ISBLANK(VLOOKUP($B72,'Section 2'!$C$16:$M$115,COLUMNS('Section 2'!$C$13:K$13),0)),\"\",VLOOKUP($B72,'Section 2'!$C$16:$M$115,COLUMNS('Section 2'!$C$13:K$13),0)))","v":""},{"$f":"IF($D72=\"\",\"\",IF(ISBLANK(VLOOKUP($B72,'Section 2'!$C$16:$M$115,COLUMNS('Section 2'!$C$13:L$13),0)),\"\",VLOOKUP($B72,'Section 2'!$C$16:$M$115,COLUMNS('Section 2'!$C$13:L$13),0)))","v":""},{"$f":"IF($D72=\"\",\"\",IF(ISBLANK(VLOOKUP($B72,'Section 2'!$C$16:$M$115,COLUMNS('Section 2'!$C$13:M$13),0)),\"\",VLOOKUP($B72,'Section 2'!$C$16:$M$115,COLUMNS('Section 2'!$C$13:M$13),0)))","v":""}]
[{"$f":"IF(D73=\"\",\"\",ROWS($A$1:A73))","v":""},72,"",{"$f":"IFERROR(VLOOKUP($B73,'Section 2'!$C$16:$M$115,COLUMNS('Section 2'!$C$13:C$13),0),\"\")","v":""},{"$f":"IF($D73=\"\",\"\",IF(ISBLANK(VLOOKUP($B73,'Section 2'!$C$16:$M$115,COLUMNS('Section 2'!$C$13:D$13),0)),\"\",VLOOKUP($B73,'Section 2'!$C$16:$M$115,COLUMNS('Section 2'!$C$13:D$13),0)))","v":""},{"$f":"IF($D73=\"\",\"\",IF(ISBLANK(VLOOKUP($B73,'Section 2'!$C$16:$M$115,COLUMNS('Section 2'!$C$13:E$13),0)),\"\",VLOOKUP($B73,'Section 2'!$C$16:$M$115,COLUMNS('Section 2'!$C$13:E$13),0)))","v":""},{"$f":"IF($D73=\"\",\"\",IF(ISBLANK(VLOOKUP($B73,'Section 2'!$C$16:$M$115,COLUMNS('Section 2'!$C$13:F$13),0)),\"\",VLOOKUP($B73,'Section 2'!$C$16:$M$115,COLUMNS('Section 2'!$C$13:F$13),0)))","v":""},{"$f":"IF($D73=\"\",\"\",IF(ISBLANK(VLOOKUP($B73,'Section 2'!$C$16:$M$115,COLUMNS('Section 2'!$C$13:G$13),0)),\"\",VLOOKUP($B73,'Section 2'!$C$16:$M$115,COLUMNS('Section 2'!$C$13:G$13),0)))","v":""},{"$f":"IF($D73=\"\",\"\",IF(ISBLANK(VLOOKUP($B73,'Section 2'!$C$16:$M$115,COLUMNS('Section 2'!$C$13:H$13),0)),\"\",VLOOKUP($B73,'Section 2'!$C$16:$M$115,COLUMNS('Section 2'!$C$13:H$13),0)))","v":""},{"$f":"IF($D73=\"\",\"\",IF(ISBLANK(VLOOKUP($B73,'Section 2'!$C$16:$M$115,COLUMNS('Section 2'!$C$13:I$13),0)),\"\",VLOOKUP($B73,'Section 2'!$C$16:$M$115,COLUMNS('Section 2'!$C$13:I$13),0)))","v":""},{"$f":"IF($D73=\"\",\"\",IF(ISBLANK(VLOOKUP($B73,'Section 2'!$C$16:$M$115,COLUMNS('Section 2'!$C$13:J$13),0)),\"\",VLOOKUP($B73,'Section 2'!$C$16:$M$115,COLUMNS('Section 2'!$C$13:J$13),0)))","v":""},{"$f":"IF($D73=\"\",\"\",IF(ISBLANK(VLOOKUP($B73,'Section 2'!$C$16:$M$115,COLUMNS('Section 2'!$C$13:K$13),0)),\"\",VLOOKUP($B73,'Section 2'!$C$16:$M$115,COLUMNS('Section 2'!$C$13:K$13),0)))","v":""},{"$f":"IF($D73=\"\",\"\",IF(ISBLANK(VLOOKUP($B73,'Section 2'!$C$16:$M$115,COLUMNS('Section 2'!$C$13:L$13),0)),\"\",VLOOKUP($B73,'Section 2'!$C$16:$M$115,COLUMNS('Section 2'!$C$13:L$13),0)))","v":""},{"$f":"IF($D73=\"\",\"\",IF(ISBLANK(VLOOKUP($B73,'Section 2'!$C$16:$M$115,COLUMNS('Section 2'!$C$13:M$13),0)),\"\",VLOOKUP($B73,'Section 2'!$C$16:$M$115,COLUMNS('Section 2'!$C$13:M$13),0)))","v":""}]
[{"$f":"IF(D74=\"\",\"\",ROWS($A$1:A74))","v":""},73,"",{"$f":"IFERROR(VLOOKUP($B74,'Section 2'!$C$16:$M$115,COLUMNS('Section 2'!$C$13:C$13),0),\"\")","v":""},{"$f":"IF($D74=\"\",\"\",IF(ISBLANK(VLOOKUP($B74,'Section 2'!$C$16:$M$115,COLUMNS('Section 2'!$C$13:D$13),0)),\"\",VLOOKUP($B74,'Section 2'!$C$16:$M$115,COLUMNS('Section 2'!$C$13:D$13),0)))","v":""},{"$f":"IF($D74=\"\",\"\",IF(ISBLANK(VLOOKUP($B74,'Section 2'!$C$16:$M$115,COLUMNS('Section 2'!$C$13:E$13),0)),\"\",VLOOKUP($B74,'Section 2'!$C$16:$M$115,COLUMNS('Section 2'!$C$13:E$13),0)))","v":""},{"$f":"IF($D74=\"\",\"\",IF(ISBLANK(VLOOKUP($B74,'Section 2'!$C$16:$M$115,COLUMNS('Section 2'!$C$13:F$13),0)),\"\",VLOOKUP($B74,'Section 2'!$C$16:$M$115,COLUMNS('Section 2'!$C$13:F$13),0)))","v":""},{"$f":"IF($D74=\"\",\"\",IF(ISBLANK(VLOOKUP($B74,'Section 2'!$C$16:$M$115,COLUMNS('Section 2'!$C$13:G$13),0)),\"\",VLOOKUP($B74,'Section 2'!$C$16:$M$115,COLUMNS('Section 2'!$C$13:G$13),0)))","v":""},{"$f":"IF($D74=\"\",\"\",IF(ISBLANK(VLOOKUP($B74,'Section 2'!$C$16:$M$115,COLUMNS('Section 2'!$C$13:H$13),0)),\"\",VLOOKUP($B74,'Section 2'!$C$16:$M$115,COLUMNS('Section 2'!$C$13:H$13),0)))","v":""},{"$f":"IF($D74=\"\",\"\",IF(ISBLANK(VLOOKUP($B74,'Section 2'!$C$16:$M$115,COLUMNS('Section 2'!$C$13:I$13),0)),\"\",VLOOKUP($B74,'Section 2'!$C$16:$M$115,COLUMNS('Section 2'!$C$13:I$13),0)))","v":""},{"$f":"IF($D74=\"\",\"\",IF(ISBLANK(VLOOKUP($B74,'Section 2'!$C$16:$M$115,COLUMNS('Section 2'!$C$13:J$13),0)),\"\",VLOOKUP($B74,'Section 2'!$C$16:$M$115,COLUMNS('Section 2'!$C$13:J$13),0)))","v":""},{"$f":"IF($D74=\"\",\"\",IF(ISBLANK(VLOOKUP($B74,'Section 2'!$C$16:$M$115,COLUMNS('Section 2'!$C$13:K$13),0)),\"\",VLOOKUP($B74,'Section 2'!$C$16:$M$115,COLUMNS('Section 2'!$C$13:K$13),0)))","v":""},{"$f":"IF($D74=\"\",\"\",IF(ISBLANK(VLOOKUP($B74,'Section 2'!$C$16:$M$115,COLUMNS('Section 2'!$C$13:L$13),0)),\"\",VLOOKUP($B74,'Section 2'!$C$16:$M$115,COLUMNS('Section 2'!$C$13:L$13),0)))","v":""},{"$f":"IF($D74=\"\",\"\",IF(ISBLANK(VLOOKUP($B74,'Section 2'!$C$16:$M$115,COLUMNS('Section 2'!$C$13:M$13),0)),\"\",VLOOKUP($B74,'Section 2'!$C$16:$M$115,COLUMNS('Section 2'!$C$13:M$13),0)))","v":""}]
[{"$f":"IF(D75=\"\",\"\",ROWS($A$1:A75))","v":""},74,"",{"$f":"IFERROR(VLOOKUP($B75,'Section 2'!$C$16:$M$115,COLUMNS('Section 2'!$C$13:C$13),0),\"\")","v":""},{"$f":"IF($D75=\"\",\"\",IF(ISBLANK(VLOOKUP($B75,'Section 2'!$C$16:$M$115,COLUMNS('Section 2'!$C$13:D$13),0)),\"\",VLOOKUP($B75,'Section 2'!$C$16:$M$115,COLUMNS('Section 2'!$C$13:D$13),0)))","v":""},{"$f":"IF($D75=\"\",\"\",IF(ISBLANK(VLOOKUP($B75,'Section 2'!$C$16:$M$115,COLUMNS('Section 2'!$C$13:E$13),0)),\"\",VLOOKUP($B75,'Section 2'!$C$16:$M$115,COLUMNS('Section 2'!$C$13:E$13),0)))","v":""},{"$f":"IF($D75=\"\",\"\",IF(ISBLANK(VLOOKUP($B75,'Section 2'!$C$16:$M$115,COLUMNS('Section 2'!$C$13:F$13),0)),\"\",VLOOKUP($B75,'Section 2'!$C$16:$M$115,COLUMNS('Section 2'!$C$13:F$13),0)))","v":""},{"$f":"IF($D75=\"\",\"\",IF(ISBLANK(VLOOKUP($B75,'Section 2'!$C$16:$M$115,COLUMNS('Section 2'!$C$13:G$13),0)),\"\",VLOOKUP($B75,'Section 2'!$C$16:$M$115,COLUMNS('Section 2'!$C$13:G$13),0)))","v":""},{"$f":"IF($D75=\"\",\"\",IF(ISBLANK(VLOOKUP($B75,'Section 2'!$C$16:$M$115,COLUMNS('Section 2'!$C$13:H$13),0)),\"\",VLOOKUP($B75,'Section 2'!$C$16:$M$115,COLUMNS('Section 2'!$C$13:H$13),0)))","v":""},{"$f":"IF($D75=\"\",\"\",IF(ISBLANK(VLOOKUP($B75,'Section 2'!$C$16:$M$115,COLUMNS('Section 2'!$C$13:I$13),0)),\"\",VLOOKUP($B75,'Section 2'!$C$16:$M$115,COLUMNS('Section 2'!$C$13:I$13),0)))","v":""},{"$f":"IF($D75=\"\",\"\",IF(ISBLANK(VLOOKUP($B75,'Section 2'!$C$16:$M$115,COLUMNS('Section 2'!$C$13:J$13),0)),\"\",VLOOKUP($B75,'Section 2'!$C$16:$M$115,COLUMNS('Section 2'!$C$13:J$13),0)))","v":""},{"$f":"IF($D75=\"\",\"\",IF(ISBLANK(VLOOKUP($B75,'Section 2'!$C$16:$M$115,COLUMNS('Section 2'!$C$13:K$13),0)),\"\",VLOOKUP($B75,'Section 2'!$C$16:$M$115,COLUMNS('Section 2'!$C$13:K$13),0)))","v":""},{"$f":"IF($D75=\"\",\"\",IF(ISBLANK(VLOOKUP($B75,'Section 2'!$C$16:$M$115,COLUMNS('Section 2'!$C$13:L$13),0)),\"\",VLOOKUP($B75,'Section 2'!$C$16:$M$115,COLUMNS('Section 2'!$C$13:L$13),0)))","v":""},{"$f":"IF($D75=\"\",\"\",IF(ISBLANK(VLOOKUP($B75,'Section 2'!$C$16:$M$115,COLUMNS('Section 2'!$C$13:M$13),0)),\"\",VLOOKUP($B75,'Section 2'!$C$16:$M$115,COLUMNS('Section 2'!$C$13:M$13),0)))","v":""}]
[{"$f":"IF(D76=\"\",\"\",ROWS($A$1:A76))","v":""},75,"",{"$f":"IFERROR(VLOOKUP($B76,'Section 2'!$C$16:$M$115,COLUMNS('Section 2'!$C$13:C$13),0),\"\")","v":""},{"$f":"IF($D76=\"\",\"\",IF(ISBLANK(VLOOKUP($B76,'Section 2'!$C$16:$M$115,COLUMNS('Section 2'!$C$13:D$13),0)),\"\",VLOOKUP($B76,'Section 2'!$C$16:$M$115,COLUMNS('Section 2'!$C$13:D$13),0)))","v":""},{"$f":"IF($D76=\"\",\"\",IF(ISBLANK(VLOOKUP($B76,'Section 2'!$C$16:$M$115,COLUMNS('Section 2'!$C$13:E$13),0)),\"\",VLOOKUP($B76,'Section 2'!$C$16:$M$115,COLUMNS('Section 2'!$C$13:E$13),0)))","v":""},{"$f":"IF($D76=\"\",\"\",IF(ISBLANK(VLOOKUP($B76,'Section 2'!$C$16:$M$115,COLUMNS('Section 2'!$C$13:F$13),0)),\"\",VLOOKUP($B76,'Section 2'!$C$16:$M$115,COLUMNS('Section 2'!$C$13:F$13),0)))","v":""},{"$f":"IF($D76=\"\",\"\",IF(ISBLANK(VLOOKUP($B76,'Section 2'!$C$16:$M$115,COLUMNS('Section 2'!$C$13:G$13),0)),\"\",VLOOKUP($B76,'Section 2'!$C$16:$M$115,COLUMNS('Section 2'!$C$13:G$13),0)))","v":""},{"$f":"IF($D76=\"\",\"\",IF(ISBLANK(VLOOKUP($B76,'Section 2'!$C$16:$M$115,COLUMNS('Section 2'!$C$13:H$13),0)),\"\",VLOOKUP($B76,'Section 2'!$C$16:$M$115,COLUMNS('Section 2'!$C$13:H$13),0)))","v":""},{"$f":"IF($D76=\"\",\"\",IF(ISBLANK(VLOOKUP($B76,'Section 2'!$C$16:$M$115,COLUMNS('Section 2'!$C$13:I$13),0)),\"\",VLOOKUP($B76,'Section 2'!$C$16:$M$115,COLUMNS('Section 2'!$C$13:I$13),0)))","v":""},{"$f":"IF($D76=\"\",\"\",IF(ISBLANK(VLOOKUP($B76,'Section 2'!$C$16:$M$115,COLUMNS('Section 2'!$C$13:J$13),0)),\"\",VLOOKUP($B76,'Section 2'!$C$16:$M$115,COLUMNS('Section 2'!$C$13:J$13),0)))","v":""},{"$f":"IF($D76=\"\",\"\",IF(ISBLANK(VLOOKUP($B76,'Section 2'!$C$16:$M$115,COLUMNS('Section 2'!$C$13:K$13),0)),\"\",VLOOKUP($B76,'Section 2'!$C$16:$M$115,COLUMNS('Section 2'!$C$13:K$13),0)))","v":""},{"$f":"IF($D76=\"\",\"\",IF(ISBLANK(VLOOKUP($B76,'Section 2'!$C$16:$M$115,COLUMNS('Section 2'!$C$13:L$13),0)),\"\",VLOOKUP($B76,'Section 2'!$C$16:$M$115,COLUMNS('Section 2'!$C$13:L$13),0)))","v":""},{"$f":"IF($D76=\"\",\"\",IF(ISBLANK(VLOOKUP($B76,'Section 2'!$C$16:$M$115,COLUMNS('Section 2'!$C$13:M$13),0)),\"\",VLOOKUP($B76,'Section 2'!$C$16:$M$115,COLUMNS('Section 2'!$C$13:M$13),0)))","v":""}]
[{"$f":"IF(D77=\"\",\"\",ROWS($A$1:A77))","v":""},76,"",{"$f":"IFERROR(VLOOKUP($B77,'Section 2'!$C$16:$M$115,COLUMNS('Section 2'!$C$13:C$13),0),\"\")","v":""},{"$f":"IF($D77=\"\",\"\",IF(ISBLANK(VLOOKUP($B77,'Section 2'!$C$16:$M$115,COLUMNS('Section 2'!$C$13:D$13),0)),\"\",VLOOKUP($B77,'Section 2'!$C$16:$M$115,COLUMNS('Section 2'!$C$13:D$13),0)))","v":""},{"$f":"IF($D77=\"\",\"\",IF(ISBLANK(VLOOKUP($B77,'Section 2'!$C$16:$M$115,COLUMNS('Section 2'!$C$13:E$13),0)),\"\",VLOOKUP($B77,'Section 2'!$C$16:$M$115,COLUMNS('Section 2'!$C$13:E$13),0)))","v":""},{"$f":"IF($D77=\"\",\"\",IF(ISBLANK(VLOOKUP($B77,'Section 2'!$C$16:$M$115,COLUMNS('Section 2'!$C$13:F$13),0)),\"\",VLOOKUP($B77,'Section 2'!$C$16:$M$115,COLUMNS('Section 2'!$C$13:F$13),0)))","v":""},{"$f":"IF($D77=\"\",\"\",IF(ISBLANK(VLOOKUP($B77,'Section 2'!$C$16:$M$115,COLUMNS('Section 2'!$C$13:G$13),0)),\"\",VLOOKUP($B77,'Section 2'!$C$16:$M$115,COLUMNS('Section 2'!$C$13:G$13),0)))","v":""},{"$f":"IF($D77=\"\",\"\",IF(ISBLANK(VLOOKUP($B77,'Section 2'!$C$16:$M$115,COLUMNS('Section 2'!$C$13:H$13),0)),\"\",VLOOKUP($B77,'Section 2'!$C$16:$M$115,COLUMNS('Section 2'!$C$13:H$13),0)))","v":""},{"$f":"IF($D77=\"\",\"\",IF(ISBLANK(VLOOKUP($B77,'Section 2'!$C$16:$M$115,COLUMNS('Section 2'!$C$13:I$13),0)),\"\",VLOOKUP($B77,'Section 2'!$C$16:$M$115,COLUMNS('Section 2'!$C$13:I$13),0)))","v":""},{"$f":"IF($D77=\"\",\"\",IF(ISBLANK(VLOOKUP($B77,'Section 2'!$C$16:$M$115,COLUMNS('Section 2'!$C$13:J$13),0)),\"\",VLOOKUP($B77,'Section 2'!$C$16:$M$115,COLUMNS('Section 2'!$C$13:J$13),0)))","v":""},{"$f":"IF($D77=\"\",\"\",IF(ISBLANK(VLOOKUP($B77,'Section 2'!$C$16:$M$115,COLUMNS('Section 2'!$C$13:K$13),0)),\"\",VLOOKUP($B77,'Section 2'!$C$16:$M$115,COLUMNS('Section 2'!$C$13:K$13),0)))","v":""},{"$f":"IF($D77=\"\",\"\",IF(ISBLANK(VLOOKUP($B77,'Section 2'!$C$16:$M$115,COLUMNS('Section 2'!$C$13:L$13),0)),\"\",VLOOKUP($B77,'Section 2'!$C$16:$M$115,COLUMNS('Section 2'!$C$13:L$13),0)))","v":""},{"$f":"IF($D77=\"\",\"\",IF(ISBLANK(VLOOKUP($B77,'Section 2'!$C$16:$M$115,COLUMNS('Section 2'!$C$13:M$13),0)),\"\",VLOOKUP($B77,'Section 2'!$C$16:$M$115,COLUMNS('Section 2'!$C$13:M$13),0)))","v":""}]
[{"$f":"IF(D78=\"\",\"\",ROWS($A$1:A78))","v":""},77,"",{"$f":"IFERROR(VLOOKUP($B78,'Section 2'!$C$16:$M$115,COLUMNS('Section 2'!$C$13:C$13),0),\"\")","v":""},{"$f":"IF($D78=\"\",\"\",IF(ISBLANK(VLOOKUP($B78,'Section 2'!$C$16:$M$115,COLUMNS('Section 2'!$C$13:D$13),0)),\"\",VLOOKUP($B78,'Section 2'!$C$16:$M$115,COLUMNS('Section 2'!$C$13:D$13),0)))","v":""},{"$f":"IF($D78=\"\",\"\",IF(ISBLANK(VLOOKUP($B78,'Section 2'!$C$16:$M$115,COLUMNS('Section 2'!$C$13:E$13),0)),\"\",VLOOKUP($B78,'Section 2'!$C$16:$M$115,COLUMNS('Section 2'!$C$13:E$13),0)))","v":""},{"$f":"IF($D78=\"\",\"\",IF(ISBLANK(VLOOKUP($B78,'Section 2'!$C$16:$M$115,COLUMNS('Section 2'!$C$13:F$13),0)),\"\",VLOOKUP($B78,'Section 2'!$C$16:$M$115,COLUMNS('Section 2'!$C$13:F$13),0)))","v":""},{"$f":"IF($D78=\"\",\"\",IF(ISBLANK(VLOOKUP($B78,'Section 2'!$C$16:$M$115,COLUMNS('Section 2'!$C$13:G$13),0)),\"\",VLOOKUP($B78,'Section 2'!$C$16:$M$115,COLUMNS('Section 2'!$C$13:G$13),0)))","v":""},{"$f":"IF($D78=\"\",\"\",IF(ISBLANK(VLOOKUP($B78,'Section 2'!$C$16:$M$115,COLUMNS('Section 2'!$C$13:H$13),0)),\"\",VLOOKUP($B78,'Section 2'!$C$16:$M$115,COLUMNS('Section 2'!$C$13:H$13),0)))","v":""},{"$f":"IF($D78=\"\",\"\",IF(ISBLANK(VLOOKUP($B78,'Section 2'!$C$16:$M$115,COLUMNS('Section 2'!$C$13:I$13),0)),\"\",VLOOKUP($B78,'Section 2'!$C$16:$M$115,COLUMNS('Section 2'!$C$13:I$13),0)))","v":""},{"$f":"IF($D78=\"\",\"\",IF(ISBLANK(VLOOKUP($B78,'Section 2'!$C$16:$M$115,COLUMNS('Section 2'!$C$13:J$13),0)),\"\",VLOOKUP($B78,'Section 2'!$C$16:$M$115,COLUMNS('Section 2'!$C$13:J$13),0)))","v":""},{"$f":"IF($D78=\"\",\"\",IF(ISBLANK(VLOOKUP($B78,'Section 2'!$C$16:$M$115,COLUMNS('Section 2'!$C$13:K$13),0)),\"\",VLOOKUP($B78,'Section 2'!$C$16:$M$115,COLUMNS('Section 2'!$C$13:K$13),0)))","v":""},{"$f":"IF($D78=\"\",\"\",IF(ISBLANK(VLOOKUP($B78,'Section 2'!$C$16:$M$115,COLUMNS('Section 2'!$C$13:L$13),0)),\"\",VLOOKUP($B78,'Section 2'!$C$16:$M$115,COLUMNS('Section 2'!$C$13:L$13),0)))","v":""},{"$f":"IF($D78=\"\",\"\",IF(ISBLANK(VLOOKUP($B78,'Section 2'!$C$16:$M$115,COLUMNS('Section 2'!$C$13:M$13),0)),\"\",VLOOKUP($B78,'Section 2'!$C$16:$M$115,COLUMNS('Section 2'!$C$13:M$13),0)))","v":""}]
[{"$f":"IF(D79=\"\",\"\",ROWS($A$1:A79))","v":""},78,"",{"$f":"IFERROR(VLOOKUP($B79,'Section 2'!$C$16:$M$115,COLUMNS('Section 2'!$C$13:C$13),0),\"\")","v":""},{"$f":"IF($D79=\"\",\"\",IF(ISBLANK(VLOOKUP($B79,'Section 2'!$C$16:$M$115,COLUMNS('Section 2'!$C$13:D$13),0)),\"\",VLOOKUP($B79,'Section 2'!$C$16:$M$115,COLUMNS('Section 2'!$C$13:D$13),0)))","v":""},{"$f":"IF($D79=\"\",\"\",IF(ISBLANK(VLOOKUP($B79,'Section 2'!$C$16:$M$115,COLUMNS('Section 2'!$C$13:E$13),0)),\"\",VLOOKUP($B79,'Section 2'!$C$16:$M$115,COLUMNS('Section 2'!$C$13:E$13),0)))","v":""},{"$f":"IF($D79=\"\",\"\",IF(ISBLANK(VLOOKUP($B79,'Section 2'!$C$16:$M$115,COLUMNS('Section 2'!$C$13:F$13),0)),\"\",VLOOKUP($B79,'Section 2'!$C$16:$M$115,COLUMNS('Section 2'!$C$13:F$13),0)))","v":""},{"$f":"IF($D79=\"\",\"\",IF(ISBLANK(VLOOKUP($B79,'Section 2'!$C$16:$M$115,COLUMNS('Section 2'!$C$13:G$13),0)),\"\",VLOOKUP($B79,'Section 2'!$C$16:$M$115,COLUMNS('Section 2'!$C$13:G$13),0)))","v":""},{"$f":"IF($D79=\"\",\"\",IF(ISBLANK(VLOOKUP($B79,'Section 2'!$C$16:$M$115,COLUMNS('Section 2'!$C$13:H$13),0)),\"\",VLOOKUP($B79,'Section 2'!$C$16:$M$115,COLUMNS('Section 2'!$C$13:H$13),0)))","v":""},{"$f":"IF($D79=\"\",\"\",IF(ISBLANK(VLOOKUP($B79,'Section 2'!$C$16:$M$115,COLUMNS('Section 2'!$C$13:I$13),0)),\"\",VLOOKUP($B79,'Section 2'!$C$16:$M$115,COLUMNS('Section 2'!$C$13:I$13),0)))","v":""},{"$f":"IF($D79=\"\",\"\",IF(ISBLANK(VLOOKUP($B79,'Section 2'!$C$16:$M$115,COLUMNS('Section 2'!$C$13:J$13),0)),\"\",VLOOKUP($B79,'Section 2'!$C$16:$M$115,COLUMNS('Section 2'!$C$13:J$13),0)))","v":""},{"$f":"IF($D79=\"\",\"\",IF(ISBLANK(VLOOKUP($B79,'Section 2'!$C$16:$M$115,COLUMNS('Section 2'!$C$13:K$13),0)),\"\",VLOOKUP($B79,'Section 2'!$C$16:$M$115,COLUMNS('Section 2'!$C$13:K$13),0)))","v":""},{"$f":"IF($D79=\"\",\"\",IF(ISBLANK(VLOOKUP($B79,'Section 2'!$C$16:$M$115,COLUMNS('Section 2'!$C$13:L$13),0)),\"\",VLOOKUP($B79,'Section 2'!$C$16:$M$115,COLUMNS('Section 2'!$C$13:L$13),0)))","v":""},{"$f":"IF($D79=\"\",\"\",IF(ISBLANK(VLOOKUP($B79,'Section 2'!$C$16:$M$115,COLUMNS('Section 2'!$C$13:M$13),0)),\"\",VLOOKUP($B79,'Section 2'!$C$16:$M$115,COLUMNS('Section 2'!$C$13:M$13),0)))","v":""}]
[{"$f":"IF(D80=\"\",\"\",ROWS($A$1:A80))","v":""},79,"",{"$f":"IFERROR(VLOOKUP($B80,'Section 2'!$C$16:$M$115,COLUMNS('Section 2'!$C$13:C$13),0),\"\")","v":""},{"$f":"IF($D80=\"\",\"\",IF(ISBLANK(VLOOKUP($B80,'Section 2'!$C$16:$M$115,COLUMNS('Section 2'!$C$13:D$13),0)),\"\",VLOOKUP($B80,'Section 2'!$C$16:$M$115,COLUMNS('Section 2'!$C$13:D$13),0)))","v":""},{"$f":"IF($D80=\"\",\"\",IF(ISBLANK(VLOOKUP($B80,'Section 2'!$C$16:$M$115,COLUMNS('Section 2'!$C$13:E$13),0)),\"\",VLOOKUP($B80,'Section 2'!$C$16:$M$115,COLUMNS('Section 2'!$C$13:E$13),0)))","v":""},{"$f":"IF($D80=\"\",\"\",IF(ISBLANK(VLOOKUP($B80,'Section 2'!$C$16:$M$115,COLUMNS('Section 2'!$C$13:F$13),0)),\"\",VLOOKUP($B80,'Section 2'!$C$16:$M$115,COLUMNS('Section 2'!$C$13:F$13),0)))","v":""},{"$f":"IF($D80=\"\",\"\",IF(ISBLANK(VLOOKUP($B80,'Section 2'!$C$16:$M$115,COLUMNS('Section 2'!$C$13:G$13),0)),\"\",VLOOKUP($B80,'Section 2'!$C$16:$M$115,COLUMNS('Section 2'!$C$13:G$13),0)))","v":""},{"$f":"IF($D80=\"\",\"\",IF(ISBLANK(VLOOKUP($B80,'Section 2'!$C$16:$M$115,COLUMNS('Section 2'!$C$13:H$13),0)),\"\",VLOOKUP($B80,'Section 2'!$C$16:$M$115,COLUMNS('Section 2'!$C$13:H$13),0)))","v":""},{"$f":"IF($D80=\"\",\"\",IF(ISBLANK(VLOOKUP($B80,'Section 2'!$C$16:$M$115,COLUMNS('Section 2'!$C$13:I$13),0)),\"\",VLOOKUP($B80,'Section 2'!$C$16:$M$115,COLUMNS('Section 2'!$C$13:I$13),0)))","v":""},{"$f":"IF($D80=\"\",\"\",IF(ISBLANK(VLOOKUP($B80,'Section 2'!$C$16:$M$115,COLUMNS('Section 2'!$C$13:J$13),0)),\"\",VLOOKUP($B80,'Section 2'!$C$16:$M$115,COLUMNS('Section 2'!$C$13:J$13),0)))","v":""},{"$f":"IF($D80=\"\",\"\",IF(ISBLANK(VLOOKUP($B80,'Section 2'!$C$16:$M$115,COLUMNS('Section 2'!$C$13:K$13),0)),\"\",VLOOKUP($B80,'Section 2'!$C$16:$M$115,COLUMNS('Section 2'!$C$13:K$13),0)))","v":""},{"$f":"IF($D80=\"\",\"\",IF(ISBLANK(VLOOKUP($B80,'Section 2'!$C$16:$M$115,COLUMNS('Section 2'!$C$13:L$13),0)),\"\",VLOOKUP($B80,'Section 2'!$C$16:$M$115,COLUMNS('Section 2'!$C$13:L$13),0)))","v":""},{"$f":"IF($D80=\"\",\"\",IF(ISBLANK(VLOOKUP($B80,'Section 2'!$C$16:$M$115,COLUMNS('Section 2'!$C$13:M$13),0)),\"\",VLOOKUP($B80,'Section 2'!$C$16:$M$115,COLUMNS('Section 2'!$C$13:M$13),0)))","v":""}]
[{"$f":"IF(D81=\"\",\"\",ROWS($A$1:A81))","v":""},80,"",{"$f":"IFERROR(VLOOKUP($B81,'Section 2'!$C$16:$M$115,COLUMNS('Section 2'!$C$13:C$13),0),\"\")","v":""},{"$f":"IF($D81=\"\",\"\",IF(ISBLANK(VLOOKUP($B81,'Section 2'!$C$16:$M$115,COLUMNS('Section 2'!$C$13:D$13),0)),\"\",VLOOKUP($B81,'Section 2'!$C$16:$M$115,COLUMNS('Section 2'!$C$13:D$13),0)))","v":""},{"$f":"IF($D81=\"\",\"\",IF(ISBLANK(VLOOKUP($B81,'Section 2'!$C$16:$M$115,COLUMNS('Section 2'!$C$13:E$13),0)),\"\",VLOOKUP($B81,'Section 2'!$C$16:$M$115,COLUMNS('Section 2'!$C$13:E$13),0)))","v":""},{"$f":"IF($D81=\"\",\"\",IF(ISBLANK(VLOOKUP($B81,'Section 2'!$C$16:$M$115,COLUMNS('Section 2'!$C$13:F$13),0)),\"\",VLOOKUP($B81,'Section 2'!$C$16:$M$115,COLUMNS('Section 2'!$C$13:F$13),0)))","v":""},{"$f":"IF($D81=\"\",\"\",IF(ISBLANK(VLOOKUP($B81,'Section 2'!$C$16:$M$115,COLUMNS('Section 2'!$C$13:G$13),0)),\"\",VLOOKUP($B81,'Section 2'!$C$16:$M$115,COLUMNS('Section 2'!$C$13:G$13),0)))","v":""},{"$f":"IF($D81=\"\",\"\",IF(ISBLANK(VLOOKUP($B81,'Section 2'!$C$16:$M$115,COLUMNS('Section 2'!$C$13:H$13),0)),\"\",VLOOKUP($B81,'Section 2'!$C$16:$M$115,COLUMNS('Section 2'!$C$13:H$13),0)))","v":""},{"$f":"IF($D81=\"\",\"\",IF(ISBLANK(VLOOKUP($B81,'Section 2'!$C$16:$M$115,COLUMNS('Section 2'!$C$13:I$13),0)),\"\",VLOOKUP($B81,'Section 2'!$C$16:$M$115,COLUMNS('Section 2'!$C$13:I$13),0)))","v":""},{"$f":"IF($D81=\"\",\"\",IF(ISBLANK(VLOOKUP($B81,'Section 2'!$C$16:$M$115,COLUMNS('Section 2'!$C$13:J$13),0)),\"\",VLOOKUP($B81,'Section 2'!$C$16:$M$115,COLUMNS('Section 2'!$C$13:J$13),0)))","v":""},{"$f":"IF($D81=\"\",\"\",IF(ISBLANK(VLOOKUP($B81,'Section 2'!$C$16:$M$115,COLUMNS('Section 2'!$C$13:K$13),0)),\"\",VLOOKUP($B81,'Section 2'!$C$16:$M$115,COLUMNS('Section 2'!$C$13:K$13),0)))","v":""},{"$f":"IF($D81=\"\",\"\",IF(ISBLANK(VLOOKUP($B81,'Section 2'!$C$16:$M$115,COLUMNS('Section 2'!$C$13:L$13),0)),\"\",VLOOKUP($B81,'Section 2'!$C$16:$M$115,COLUMNS('Section 2'!$C$13:L$13),0)))","v":""},{"$f":"IF($D81=\"\",\"\",IF(ISBLANK(VLOOKUP($B81,'Section 2'!$C$16:$M$115,COLUMNS('Section 2'!$C$13:M$13),0)),\"\",VLOOKUP($B81,'Section 2'!$C$16:$M$115,COLUMNS('Section 2'!$C$13:M$13),0)))","v":""}]
[{"$f":"IF(D82=\"\",\"\",ROWS($A$1:A82))","v":""},81,"",{"$f":"IFERROR(VLOOKUP($B82,'Section 2'!$C$16:$M$115,COLUMNS('Section 2'!$C$13:C$13),0),\"\")","v":""},{"$f":"IF($D82=\"\",\"\",IF(ISBLANK(VLOOKUP($B82,'Section 2'!$C$16:$M$115,COLUMNS('Section 2'!$C$13:D$13),0)),\"\",VLOOKUP($B82,'Section 2'!$C$16:$M$115,COLUMNS('Section 2'!$C$13:D$13),0)))","v":""},{"$f":"IF($D82=\"\",\"\",IF(ISBLANK(VLOOKUP($B82,'Section 2'!$C$16:$M$115,COLUMNS('Section 2'!$C$13:E$13),0)),\"\",VLOOKUP($B82,'Section 2'!$C$16:$M$115,COLUMNS('Section 2'!$C$13:E$13),0)))","v":""},{"$f":"IF($D82=\"\",\"\",IF(ISBLANK(VLOOKUP($B82,'Section 2'!$C$16:$M$115,COLUMNS('Section 2'!$C$13:F$13),0)),\"\",VLOOKUP($B82,'Section 2'!$C$16:$M$115,COLUMNS('Section 2'!$C$13:F$13),0)))","v":""},{"$f":"IF($D82=\"\",\"\",IF(ISBLANK(VLOOKUP($B82,'Section 2'!$C$16:$M$115,COLUMNS('Section 2'!$C$13:G$13),0)),\"\",VLOOKUP($B82,'Section 2'!$C$16:$M$115,COLUMNS('Section 2'!$C$13:G$13),0)))","v":""},{"$f":"IF($D82=\"\",\"\",IF(ISBLANK(VLOOKUP($B82,'Section 2'!$C$16:$M$115,COLUMNS('Section 2'!$C$13:H$13),0)),\"\",VLOOKUP($B82,'Section 2'!$C$16:$M$115,COLUMNS('Section 2'!$C$13:H$13),0)))","v":""},{"$f":"IF($D82=\"\",\"\",IF(ISBLANK(VLOOKUP($B82,'Section 2'!$C$16:$M$115,COLUMNS('Section 2'!$C$13:I$13),0)),\"\",VLOOKUP($B82,'Section 2'!$C$16:$M$115,COLUMNS('Section 2'!$C$13:I$13),0)))","v":""},{"$f":"IF($D82=\"\",\"\",IF(ISBLANK(VLOOKUP($B82,'Section 2'!$C$16:$M$115,COLUMNS('Section 2'!$C$13:J$13),0)),\"\",VLOOKUP($B82,'Section 2'!$C$16:$M$115,COLUMNS('Section 2'!$C$13:J$13),0)))","v":""},{"$f":"IF($D82=\"\",\"\",IF(ISBLANK(VLOOKUP($B82,'Section 2'!$C$16:$M$115,COLUMNS('Section 2'!$C$13:K$13),0)),\"\",VLOOKUP($B82,'Section 2'!$C$16:$M$115,COLUMNS('Section 2'!$C$13:K$13),0)))","v":""},{"$f":"IF($D82=\"\",\"\",IF(ISBLANK(VLOOKUP($B82,'Section 2'!$C$16:$M$115,COLUMNS('Section 2'!$C$13:L$13),0)),\"\",VLOOKUP($B82,'Section 2'!$C$16:$M$115,COLUMNS('Section 2'!$C$13:L$13),0)))","v":""},{"$f":"IF($D82=\"\",\"\",IF(ISBLANK(VLOOKUP($B82,'Section 2'!$C$16:$M$115,COLUMNS('Section 2'!$C$13:M$13),0)),\"\",VLOOKUP($B82,'Section 2'!$C$16:$M$115,COLUMNS('Section 2'!$C$13:M$13),0)))","v":""}]
[{"$f":"IF(D83=\"\",\"\",ROWS($A$1:A83))","v":""},82,"",{"$f":"IFERROR(VLOOKUP($B83,'Section 2'!$C$16:$M$115,COLUMNS('Section 2'!$C$13:C$13),0),\"\")","v":""},{"$f":"IF($D83=\"\",\"\",IF(ISBLANK(VLOOKUP($B83,'Section 2'!$C$16:$M$115,COLUMNS('Section 2'!$C$13:D$13),0)),\"\",VLOOKUP($B83,'Section 2'!$C$16:$M$115,COLUMNS('Section 2'!$C$13:D$13),0)))","v":""},{"$f":"IF($D83=\"\",\"\",IF(ISBLANK(VLOOKUP($B83,'Section 2'!$C$16:$M$115,COLUMNS('Section 2'!$C$13:E$13),0)),\"\",VLOOKUP($B83,'Section 2'!$C$16:$M$115,COLUMNS('Section 2'!$C$13:E$13),0)))","v":""},{"$f":"IF($D83=\"\",\"\",IF(ISBLANK(VLOOKUP($B83,'Section 2'!$C$16:$M$115,COLUMNS('Section 2'!$C$13:F$13),0)),\"\",VLOOKUP($B83,'Section 2'!$C$16:$M$115,COLUMNS('Section 2'!$C$13:F$13),0)))","v":""},{"$f":"IF($D83=\"\",\"\",IF(ISBLANK(VLOOKUP($B83,'Section 2'!$C$16:$M$115,COLUMNS('Section 2'!$C$13:G$13),0)),\"\",VLOOKUP($B83,'Section 2'!$C$16:$M$115,COLUMNS('Section 2'!$C$13:G$13),0)))","v":""},{"$f":"IF($D83=\"\",\"\",IF(ISBLANK(VLOOKUP($B83,'Section 2'!$C$16:$M$115,COLUMNS('Section 2'!$C$13:H$13),0)),\"\",VLOOKUP($B83,'Section 2'!$C$16:$M$115,COLUMNS('Section 2'!$C$13:H$13),0)))","v":""},{"$f":"IF($D83=\"\",\"\",IF(ISBLANK(VLOOKUP($B83,'Section 2'!$C$16:$M$115,COLUMNS('Section 2'!$C$13:I$13),0)),\"\",VLOOKUP($B83,'Section 2'!$C$16:$M$115,COLUMNS('Section 2'!$C$13:I$13),0)))","v":""},{"$f":"IF($D83=\"\",\"\",IF(ISBLANK(VLOOKUP($B83,'Section 2'!$C$16:$M$115,COLUMNS('Section 2'!$C$13:J$13),0)),\"\",VLOOKUP($B83,'Section 2'!$C$16:$M$115,COLUMNS('Section 2'!$C$13:J$13),0)))","v":""},{"$f":"IF($D83=\"\",\"\",IF(ISBLANK(VLOOKUP($B83,'Section 2'!$C$16:$M$115,COLUMNS('Section 2'!$C$13:K$13),0)),\"\",VLOOKUP($B83,'Section 2'!$C$16:$M$115,COLUMNS('Section 2'!$C$13:K$13),0)))","v":""},{"$f":"IF($D83=\"\",\"\",IF(ISBLANK(VLOOKUP($B83,'Section 2'!$C$16:$M$115,COLUMNS('Section 2'!$C$13:L$13),0)),\"\",VLOOKUP($B83,'Section 2'!$C$16:$M$115,COLUMNS('Section 2'!$C$13:L$13),0)))","v":""},{"$f":"IF($D83=\"\",\"\",IF(ISBLANK(VLOOKUP($B83,'Section 2'!$C$16:$M$115,COLUMNS('Section 2'!$C$13:M$13),0)),\"\",VLOOKUP($B83,'Section 2'!$C$16:$M$115,COLUMNS('Section 2'!$C$13:M$13),0)))","v":""}]
[{"$f":"IF(D84=\"\",\"\",ROWS($A$1:A84))","v":""},83,"",{"$f":"IFERROR(VLOOKUP($B84,'Section 2'!$C$16:$M$115,COLUMNS('Section 2'!$C$13:C$13),0),\"\")","v":""},{"$f":"IF($D84=\"\",\"\",IF(ISBLANK(VLOOKUP($B84,'Section 2'!$C$16:$M$115,COLUMNS('Section 2'!$C$13:D$13),0)),\"\",VLOOKUP($B84,'Section 2'!$C$16:$M$115,COLUMNS('Section 2'!$C$13:D$13),0)))","v":""},{"$f":"IF($D84=\"\",\"\",IF(ISBLANK(VLOOKUP($B84,'Section 2'!$C$16:$M$115,COLUMNS('Section 2'!$C$13:E$13),0)),\"\",VLOOKUP($B84,'Section 2'!$C$16:$M$115,COLUMNS('Section 2'!$C$13:E$13),0)))","v":""},{"$f":"IF($D84=\"\",\"\",IF(ISBLANK(VLOOKUP($B84,'Section 2'!$C$16:$M$115,COLUMNS('Section 2'!$C$13:F$13),0)),\"\",VLOOKUP($B84,'Section 2'!$C$16:$M$115,COLUMNS('Section 2'!$C$13:F$13),0)))","v":""},{"$f":"IF($D84=\"\",\"\",IF(ISBLANK(VLOOKUP($B84,'Section 2'!$C$16:$M$115,COLUMNS('Section 2'!$C$13:G$13),0)),\"\",VLOOKUP($B84,'Section 2'!$C$16:$M$115,COLUMNS('Section 2'!$C$13:G$13),0)))","v":""},{"$f":"IF($D84=\"\",\"\",IF(ISBLANK(VLOOKUP($B84,'Section 2'!$C$16:$M$115,COLUMNS('Section 2'!$C$13:H$13),0)),\"\",VLOOKUP($B84,'Section 2'!$C$16:$M$115,COLUMNS('Section 2'!$C$13:H$13),0)))","v":""},{"$f":"IF($D84=\"\",\"\",IF(ISBLANK(VLOOKUP($B84,'Section 2'!$C$16:$M$115,COLUMNS('Section 2'!$C$13:I$13),0)),\"\",VLOOKUP($B84,'Section 2'!$C$16:$M$115,COLUMNS('Section 2'!$C$13:I$13),0)))","v":""},{"$f":"IF($D84=\"\",\"\",IF(ISBLANK(VLOOKUP($B84,'Section 2'!$C$16:$M$115,COLUMNS('Section 2'!$C$13:J$13),0)),\"\",VLOOKUP($B84,'Section 2'!$C$16:$M$115,COLUMNS('Section 2'!$C$13:J$13),0)))","v":""},{"$f":"IF($D84=\"\",\"\",IF(ISBLANK(VLOOKUP($B84,'Section 2'!$C$16:$M$115,COLUMNS('Section 2'!$C$13:K$13),0)),\"\",VLOOKUP($B84,'Section 2'!$C$16:$M$115,COLUMNS('Section 2'!$C$13:K$13),0)))","v":""},{"$f":"IF($D84=\"\",\"\",IF(ISBLANK(VLOOKUP($B84,'Section 2'!$C$16:$M$115,COLUMNS('Section 2'!$C$13:L$13),0)),\"\",VLOOKUP($B84,'Section 2'!$C$16:$M$115,COLUMNS('Section 2'!$C$13:L$13),0)))","v":""},{"$f":"IF($D84=\"\",\"\",IF(ISBLANK(VLOOKUP($B84,'Section 2'!$C$16:$M$115,COLUMNS('Section 2'!$C$13:M$13),0)),\"\",VLOOKUP($B84,'Section 2'!$C$16:$M$115,COLUMNS('Section 2'!$C$13:M$13),0)))","v":""}]
[{"$f":"IF(D85=\"\",\"\",ROWS($A$1:A85))","v":""},84,"",{"$f":"IFERROR(VLOOKUP($B85,'Section 2'!$C$16:$M$115,COLUMNS('Section 2'!$C$13:C$13),0),\"\")","v":""},{"$f":"IF($D85=\"\",\"\",IF(ISBLANK(VLOOKUP($B85,'Section 2'!$C$16:$M$115,COLUMNS('Section 2'!$C$13:D$13),0)),\"\",VLOOKUP($B85,'Section 2'!$C$16:$M$115,COLUMNS('Section 2'!$C$13:D$13),0)))","v":""},{"$f":"IF($D85=\"\",\"\",IF(ISBLANK(VLOOKUP($B85,'Section 2'!$C$16:$M$115,COLUMNS('Section 2'!$C$13:E$13),0)),\"\",VLOOKUP($B85,'Section 2'!$C$16:$M$115,COLUMNS('Section 2'!$C$13:E$13),0)))","v":""},{"$f":"IF($D85=\"\",\"\",IF(ISBLANK(VLOOKUP($B85,'Section 2'!$C$16:$M$115,COLUMNS('Section 2'!$C$13:F$13),0)),\"\",VLOOKUP($B85,'Section 2'!$C$16:$M$115,COLUMNS('Section 2'!$C$13:F$13),0)))","v":""},{"$f":"IF($D85=\"\",\"\",IF(ISBLANK(VLOOKUP($B85,'Section 2'!$C$16:$M$115,COLUMNS('Section 2'!$C$13:G$13),0)),\"\",VLOOKUP($B85,'Section 2'!$C$16:$M$115,COLUMNS('Section 2'!$C$13:G$13),0)))","v":""},{"$f":"IF($D85=\"\",\"\",IF(ISBLANK(VLOOKUP($B85,'Section 2'!$C$16:$M$115,COLUMNS('Section 2'!$C$13:H$13),0)),\"\",VLOOKUP($B85,'Section 2'!$C$16:$M$115,COLUMNS('Section 2'!$C$13:H$13),0)))","v":""},{"$f":"IF($D85=\"\",\"\",IF(ISBLANK(VLOOKUP($B85,'Section 2'!$C$16:$M$115,COLUMNS('Section 2'!$C$13:I$13),0)),\"\",VLOOKUP($B85,'Section 2'!$C$16:$M$115,COLUMNS('Section 2'!$C$13:I$13),0)))","v":""},{"$f":"IF($D85=\"\",\"\",IF(ISBLANK(VLOOKUP($B85,'Section 2'!$C$16:$M$115,COLUMNS('Section 2'!$C$13:J$13),0)),\"\",VLOOKUP($B85,'Section 2'!$C$16:$M$115,COLUMNS('Section 2'!$C$13:J$13),0)))","v":""},{"$f":"IF($D85=\"\",\"\",IF(ISBLANK(VLOOKUP($B85,'Section 2'!$C$16:$M$115,COLUMNS('Section 2'!$C$13:K$13),0)),\"\",VLOOKUP($B85,'Section 2'!$C$16:$M$115,COLUMNS('Section 2'!$C$13:K$13),0)))","v":""},{"$f":"IF($D85=\"\",\"\",IF(ISBLANK(VLOOKUP($B85,'Section 2'!$C$16:$M$115,COLUMNS('Section 2'!$C$13:L$13),0)),\"\",VLOOKUP($B85,'Section 2'!$C$16:$M$115,COLUMNS('Section 2'!$C$13:L$13),0)))","v":""},{"$f":"IF($D85=\"\",\"\",IF(ISBLANK(VLOOKUP($B85,'Section 2'!$C$16:$M$115,COLUMNS('Section 2'!$C$13:M$13),0)),\"\",VLOOKUP($B85,'Section 2'!$C$16:$M$115,COLUMNS('Section 2'!$C$13:M$13),0)))","v":""}]
[{"$f":"IF(D86=\"\",\"\",ROWS($A$1:A86))","v":""},85,"",{"$f":"IFERROR(VLOOKUP($B86,'Section 2'!$C$16:$M$115,COLUMNS('Section 2'!$C$13:C$13),0),\"\")","v":""},{"$f":"IF($D86=\"\",\"\",IF(ISBLANK(VLOOKUP($B86,'Section 2'!$C$16:$M$115,COLUMNS('Section 2'!$C$13:D$13),0)),\"\",VLOOKUP($B86,'Section 2'!$C$16:$M$115,COLUMNS('Section 2'!$C$13:D$13),0)))","v":""},{"$f":"IF($D86=\"\",\"\",IF(ISBLANK(VLOOKUP($B86,'Section 2'!$C$16:$M$115,COLUMNS('Section 2'!$C$13:E$13),0)),\"\",VLOOKUP($B86,'Section 2'!$C$16:$M$115,COLUMNS('Section 2'!$C$13:E$13),0)))","v":""},{"$f":"IF($D86=\"\",\"\",IF(ISBLANK(VLOOKUP($B86,'Section 2'!$C$16:$M$115,COLUMNS('Section 2'!$C$13:F$13),0)),\"\",VLOOKUP($B86,'Section 2'!$C$16:$M$115,COLUMNS('Section 2'!$C$13:F$13),0)))","v":""},{"$f":"IF($D86=\"\",\"\",IF(ISBLANK(VLOOKUP($B86,'Section 2'!$C$16:$M$115,COLUMNS('Section 2'!$C$13:G$13),0)),\"\",VLOOKUP($B86,'Section 2'!$C$16:$M$115,COLUMNS('Section 2'!$C$13:G$13),0)))","v":""},{"$f":"IF($D86=\"\",\"\",IF(ISBLANK(VLOOKUP($B86,'Section 2'!$C$16:$M$115,COLUMNS('Section 2'!$C$13:H$13),0)),\"\",VLOOKUP($B86,'Section 2'!$C$16:$M$115,COLUMNS('Section 2'!$C$13:H$13),0)))","v":""},{"$f":"IF($D86=\"\",\"\",IF(ISBLANK(VLOOKUP($B86,'Section 2'!$C$16:$M$115,COLUMNS('Section 2'!$C$13:I$13),0)),\"\",VLOOKUP($B86,'Section 2'!$C$16:$M$115,COLUMNS('Section 2'!$C$13:I$13),0)))","v":""},{"$f":"IF($D86=\"\",\"\",IF(ISBLANK(VLOOKUP($B86,'Section 2'!$C$16:$M$115,COLUMNS('Section 2'!$C$13:J$13),0)),\"\",VLOOKUP($B86,'Section 2'!$C$16:$M$115,COLUMNS('Section 2'!$C$13:J$13),0)))","v":""},{"$f":"IF($D86=\"\",\"\",IF(ISBLANK(VLOOKUP($B86,'Section 2'!$C$16:$M$115,COLUMNS('Section 2'!$C$13:K$13),0)),\"\",VLOOKUP($B86,'Section 2'!$C$16:$M$115,COLUMNS('Section 2'!$C$13:K$13),0)))","v":""},{"$f":"IF($D86=\"\",\"\",IF(ISBLANK(VLOOKUP($B86,'Section 2'!$C$16:$M$115,COLUMNS('Section 2'!$C$13:L$13),0)),\"\",VLOOKUP($B86,'Section 2'!$C$16:$M$115,COLUMNS('Section 2'!$C$13:L$13),0)))","v":""},{"$f":"IF($D86=\"\",\"\",IF(ISBLANK(VLOOKUP($B86,'Section 2'!$C$16:$M$115,COLUMNS('Section 2'!$C$13:M$13),0)),\"\",VLOOKUP($B86,'Section 2'!$C$16:$M$115,COLUMNS('Section 2'!$C$13:M$13),0)))","v":""}]
[{"$f":"IF(D87=\"\",\"\",ROWS($A$1:A87))","v":""},86,"",{"$f":"IFERROR(VLOOKUP($B87,'Section 2'!$C$16:$M$115,COLUMNS('Section 2'!$C$13:C$13),0),\"\")","v":""},{"$f":"IF($D87=\"\",\"\",IF(ISBLANK(VLOOKUP($B87,'Section 2'!$C$16:$M$115,COLUMNS('Section 2'!$C$13:D$13),0)),\"\",VLOOKUP($B87,'Section 2'!$C$16:$M$115,COLUMNS('Section 2'!$C$13:D$13),0)))","v":""},{"$f":"IF($D87=\"\",\"\",IF(ISBLANK(VLOOKUP($B87,'Section 2'!$C$16:$M$115,COLUMNS('Section 2'!$C$13:E$13),0)),\"\",VLOOKUP($B87,'Section 2'!$C$16:$M$115,COLUMNS('Section 2'!$C$13:E$13),0)))","v":""},{"$f":"IF($D87=\"\",\"\",IF(ISBLANK(VLOOKUP($B87,'Section 2'!$C$16:$M$115,COLUMNS('Section 2'!$C$13:F$13),0)),\"\",VLOOKUP($B87,'Section 2'!$C$16:$M$115,COLUMNS('Section 2'!$C$13:F$13),0)))","v":""},{"$f":"IF($D87=\"\",\"\",IF(ISBLANK(VLOOKUP($B87,'Section 2'!$C$16:$M$115,COLUMNS('Section 2'!$C$13:G$13),0)),\"\",VLOOKUP($B87,'Section 2'!$C$16:$M$115,COLUMNS('Section 2'!$C$13:G$13),0)))","v":""},{"$f":"IF($D87=\"\",\"\",IF(ISBLANK(VLOOKUP($B87,'Section 2'!$C$16:$M$115,COLUMNS('Section 2'!$C$13:H$13),0)),\"\",VLOOKUP($B87,'Section 2'!$C$16:$M$115,COLUMNS('Section 2'!$C$13:H$13),0)))","v":""},{"$f":"IF($D87=\"\",\"\",IF(ISBLANK(VLOOKUP($B87,'Section 2'!$C$16:$M$115,COLUMNS('Section 2'!$C$13:I$13),0)),\"\",VLOOKUP($B87,'Section 2'!$C$16:$M$115,COLUMNS('Section 2'!$C$13:I$13),0)))","v":""},{"$f":"IF($D87=\"\",\"\",IF(ISBLANK(VLOOKUP($B87,'Section 2'!$C$16:$M$115,COLUMNS('Section 2'!$C$13:J$13),0)),\"\",VLOOKUP($B87,'Section 2'!$C$16:$M$115,COLUMNS('Section 2'!$C$13:J$13),0)))","v":""},{"$f":"IF($D87=\"\",\"\",IF(ISBLANK(VLOOKUP($B87,'Section 2'!$C$16:$M$115,COLUMNS('Section 2'!$C$13:K$13),0)),\"\",VLOOKUP($B87,'Section 2'!$C$16:$M$115,COLUMNS('Section 2'!$C$13:K$13),0)))","v":""},{"$f":"IF($D87=\"\",\"\",IF(ISBLANK(VLOOKUP($B87,'Section 2'!$C$16:$M$115,COLUMNS('Section 2'!$C$13:L$13),0)),\"\",VLOOKUP($B87,'Section 2'!$C$16:$M$115,COLUMNS('Section 2'!$C$13:L$13),0)))","v":""},{"$f":"IF($D87=\"\",\"\",IF(ISBLANK(VLOOKUP($B87,'Section 2'!$C$16:$M$115,COLUMNS('Section 2'!$C$13:M$13),0)),\"\",VLOOKUP($B87,'Section 2'!$C$16:$M$115,COLUMNS('Section 2'!$C$13:M$13),0)))","v":""}]
[{"$f":"IF(D88=\"\",\"\",ROWS($A$1:A88))","v":""},87,"",{"$f":"IFERROR(VLOOKUP($B88,'Section 2'!$C$16:$M$115,COLUMNS('Section 2'!$C$13:C$13),0),\"\")","v":""},{"$f":"IF($D88=\"\",\"\",IF(ISBLANK(VLOOKUP($B88,'Section 2'!$C$16:$M$115,COLUMNS('Section 2'!$C$13:D$13),0)),\"\",VLOOKUP($B88,'Section 2'!$C$16:$M$115,COLUMNS('Section 2'!$C$13:D$13),0)))","v":""},{"$f":"IF($D88=\"\",\"\",IF(ISBLANK(VLOOKUP($B88,'Section 2'!$C$16:$M$115,COLUMNS('Section 2'!$C$13:E$13),0)),\"\",VLOOKUP($B88,'Section 2'!$C$16:$M$115,COLUMNS('Section 2'!$C$13:E$13),0)))","v":""},{"$f":"IF($D88=\"\",\"\",IF(ISBLANK(VLOOKUP($B88,'Section 2'!$C$16:$M$115,COLUMNS('Section 2'!$C$13:F$13),0)),\"\",VLOOKUP($B88,'Section 2'!$C$16:$M$115,COLUMNS('Section 2'!$C$13:F$13),0)))","v":""},{"$f":"IF($D88=\"\",\"\",IF(ISBLANK(VLOOKUP($B88,'Section 2'!$C$16:$M$115,COLUMNS('Section 2'!$C$13:G$13),0)),\"\",VLOOKUP($B88,'Section 2'!$C$16:$M$115,COLUMNS('Section 2'!$C$13:G$13),0)))","v":""},{"$f":"IF($D88=\"\",\"\",IF(ISBLANK(VLOOKUP($B88,'Section 2'!$C$16:$M$115,COLUMNS('Section 2'!$C$13:H$13),0)),\"\",VLOOKUP($B88,'Section 2'!$C$16:$M$115,COLUMNS('Section 2'!$C$13:H$13),0)))","v":""},{"$f":"IF($D88=\"\",\"\",IF(ISBLANK(VLOOKUP($B88,'Section 2'!$C$16:$M$115,COLUMNS('Section 2'!$C$13:I$13),0)),\"\",VLOOKUP($B88,'Section 2'!$C$16:$M$115,COLUMNS('Section 2'!$C$13:I$13),0)))","v":""},{"$f":"IF($D88=\"\",\"\",IF(ISBLANK(VLOOKUP($B88,'Section 2'!$C$16:$M$115,COLUMNS('Section 2'!$C$13:J$13),0)),\"\",VLOOKUP($B88,'Section 2'!$C$16:$M$115,COLUMNS('Section 2'!$C$13:J$13),0)))","v":""},{"$f":"IF($D88=\"\",\"\",IF(ISBLANK(VLOOKUP($B88,'Section 2'!$C$16:$M$115,COLUMNS('Section 2'!$C$13:K$13),0)),\"\",VLOOKUP($B88,'Section 2'!$C$16:$M$115,COLUMNS('Section 2'!$C$13:K$13),0)))","v":""},{"$f":"IF($D88=\"\",\"\",IF(ISBLANK(VLOOKUP($B88,'Section 2'!$C$16:$M$115,COLUMNS('Section 2'!$C$13:L$13),0)),\"\",VLOOKUP($B88,'Section 2'!$C$16:$M$115,COLUMNS('Section 2'!$C$13:L$13),0)))","v":""},{"$f":"IF($D88=\"\",\"\",IF(ISBLANK(VLOOKUP($B88,'Section 2'!$C$16:$M$115,COLUMNS('Section 2'!$C$13:M$13),0)),\"\",VLOOKUP($B88,'Section 2'!$C$16:$M$115,COLUMNS('Section 2'!$C$13:M$13),0)))","v":""}]
[{"$f":"IF(D89=\"\",\"\",ROWS($A$1:A89))","v":""},88,"",{"$f":"IFERROR(VLOOKUP($B89,'Section 2'!$C$16:$M$115,COLUMNS('Section 2'!$C$13:C$13),0),\"\")","v":""},{"$f":"IF($D89=\"\",\"\",IF(ISBLANK(VLOOKUP($B89,'Section 2'!$C$16:$M$115,COLUMNS('Section 2'!$C$13:D$13),0)),\"\",VLOOKUP($B89,'Section 2'!$C$16:$M$115,COLUMNS('Section 2'!$C$13:D$13),0)))","v":""},{"$f":"IF($D89=\"\",\"\",IF(ISBLANK(VLOOKUP($B89,'Section 2'!$C$16:$M$115,COLUMNS('Section 2'!$C$13:E$13),0)),\"\",VLOOKUP($B89,'Section 2'!$C$16:$M$115,COLUMNS('Section 2'!$C$13:E$13),0)))","v":""},{"$f":"IF($D89=\"\",\"\",IF(ISBLANK(VLOOKUP($B89,'Section 2'!$C$16:$M$115,COLUMNS('Section 2'!$C$13:F$13),0)),\"\",VLOOKUP($B89,'Section 2'!$C$16:$M$115,COLUMNS('Section 2'!$C$13:F$13),0)))","v":""},{"$f":"IF($D89=\"\",\"\",IF(ISBLANK(VLOOKUP($B89,'Section 2'!$C$16:$M$115,COLUMNS('Section 2'!$C$13:G$13),0)),\"\",VLOOKUP($B89,'Section 2'!$C$16:$M$115,COLUMNS('Section 2'!$C$13:G$13),0)))","v":""},{"$f":"IF($D89=\"\",\"\",IF(ISBLANK(VLOOKUP($B89,'Section 2'!$C$16:$M$115,COLUMNS('Section 2'!$C$13:H$13),0)),\"\",VLOOKUP($B89,'Section 2'!$C$16:$M$115,COLUMNS('Section 2'!$C$13:H$13),0)))","v":""},{"$f":"IF($D89=\"\",\"\",IF(ISBLANK(VLOOKUP($B89,'Section 2'!$C$16:$M$115,COLUMNS('Section 2'!$C$13:I$13),0)),\"\",VLOOKUP($B89,'Section 2'!$C$16:$M$115,COLUMNS('Section 2'!$C$13:I$13),0)))","v":""},{"$f":"IF($D89=\"\",\"\",IF(ISBLANK(VLOOKUP($B89,'Section 2'!$C$16:$M$115,COLUMNS('Section 2'!$C$13:J$13),0)),\"\",VLOOKUP($B89,'Section 2'!$C$16:$M$115,COLUMNS('Section 2'!$C$13:J$13),0)))","v":""},{"$f":"IF($D89=\"\",\"\",IF(ISBLANK(VLOOKUP($B89,'Section 2'!$C$16:$M$115,COLUMNS('Section 2'!$C$13:K$13),0)),\"\",VLOOKUP($B89,'Section 2'!$C$16:$M$115,COLUMNS('Section 2'!$C$13:K$13),0)))","v":""},{"$f":"IF($D89=\"\",\"\",IF(ISBLANK(VLOOKUP($B89,'Section 2'!$C$16:$M$115,COLUMNS('Section 2'!$C$13:L$13),0)),\"\",VLOOKUP($B89,'Section 2'!$C$16:$M$115,COLUMNS('Section 2'!$C$13:L$13),0)))","v":""},{"$f":"IF($D89=\"\",\"\",IF(ISBLANK(VLOOKUP($B89,'Section 2'!$C$16:$M$115,COLUMNS('Section 2'!$C$13:M$13),0)),\"\",VLOOKUP($B89,'Section 2'!$C$16:$M$115,COLUMNS('Section 2'!$C$13:M$13),0)))","v":""}]
[{"$f":"IF(D90=\"\",\"\",ROWS($A$1:A90))","v":""},89,"",{"$f":"IFERROR(VLOOKUP($B90,'Section 2'!$C$16:$M$115,COLUMNS('Section 2'!$C$13:C$13),0),\"\")","v":""},{"$f":"IF($D90=\"\",\"\",IF(ISBLANK(VLOOKUP($B90,'Section 2'!$C$16:$M$115,COLUMNS('Section 2'!$C$13:D$13),0)),\"\",VLOOKUP($B90,'Section 2'!$C$16:$M$115,COLUMNS('Section 2'!$C$13:D$13),0)))","v":""},{"$f":"IF($D90=\"\",\"\",IF(ISBLANK(VLOOKUP($B90,'Section 2'!$C$16:$M$115,COLUMNS('Section 2'!$C$13:E$13),0)),\"\",VLOOKUP($B90,'Section 2'!$C$16:$M$115,COLUMNS('Section 2'!$C$13:E$13),0)))","v":""},{"$f":"IF($D90=\"\",\"\",IF(ISBLANK(VLOOKUP($B90,'Section 2'!$C$16:$M$115,COLUMNS('Section 2'!$C$13:F$13),0)),\"\",VLOOKUP($B90,'Section 2'!$C$16:$M$115,COLUMNS('Section 2'!$C$13:F$13),0)))","v":""},{"$f":"IF($D90=\"\",\"\",IF(ISBLANK(VLOOKUP($B90,'Section 2'!$C$16:$M$115,COLUMNS('Section 2'!$C$13:G$13),0)),\"\",VLOOKUP($B90,'Section 2'!$C$16:$M$115,COLUMNS('Section 2'!$C$13:G$13),0)))","v":""},{"$f":"IF($D90=\"\",\"\",IF(ISBLANK(VLOOKUP($B90,'Section 2'!$C$16:$M$115,COLUMNS('Section 2'!$C$13:H$13),0)),\"\",VLOOKUP($B90,'Section 2'!$C$16:$M$115,COLUMNS('Section 2'!$C$13:H$13),0)))","v":""},{"$f":"IF($D90=\"\",\"\",IF(ISBLANK(VLOOKUP($B90,'Section 2'!$C$16:$M$115,COLUMNS('Section 2'!$C$13:I$13),0)),\"\",VLOOKUP($B90,'Section 2'!$C$16:$M$115,COLUMNS('Section 2'!$C$13:I$13),0)))","v":""},{"$f":"IF($D90=\"\",\"\",IF(ISBLANK(VLOOKUP($B90,'Section 2'!$C$16:$M$115,COLUMNS('Section 2'!$C$13:J$13),0)),\"\",VLOOKUP($B90,'Section 2'!$C$16:$M$115,COLUMNS('Section 2'!$C$13:J$13),0)))","v":""},{"$f":"IF($D90=\"\",\"\",IF(ISBLANK(VLOOKUP($B90,'Section 2'!$C$16:$M$115,COLUMNS('Section 2'!$C$13:K$13),0)),\"\",VLOOKUP($B90,'Section 2'!$C$16:$M$115,COLUMNS('Section 2'!$C$13:K$13),0)))","v":""},{"$f":"IF($D90=\"\",\"\",IF(ISBLANK(VLOOKUP($B90,'Section 2'!$C$16:$M$115,COLUMNS('Section 2'!$C$13:L$13),0)),\"\",VLOOKUP($B90,'Section 2'!$C$16:$M$115,COLUMNS('Section 2'!$C$13:L$13),0)))","v":""},{"$f":"IF($D90=\"\",\"\",IF(ISBLANK(VLOOKUP($B90,'Section 2'!$C$16:$M$115,COLUMNS('Section 2'!$C$13:M$13),0)),\"\",VLOOKUP($B90,'Section 2'!$C$16:$M$115,COLUMNS('Section 2'!$C$13:M$13),0)))","v":""}]
[{"$f":"IF(D91=\"\",\"\",ROWS($A$1:A91))","v":""},90,"",{"$f":"IFERROR(VLOOKUP($B91,'Section 2'!$C$16:$M$115,COLUMNS('Section 2'!$C$13:C$13),0),\"\")","v":""},{"$f":"IF($D91=\"\",\"\",IF(ISBLANK(VLOOKUP($B91,'Section 2'!$C$16:$M$115,COLUMNS('Section 2'!$C$13:D$13),0)),\"\",VLOOKUP($B91,'Section 2'!$C$16:$M$115,COLUMNS('Section 2'!$C$13:D$13),0)))","v":""},{"$f":"IF($D91=\"\",\"\",IF(ISBLANK(VLOOKUP($B91,'Section 2'!$C$16:$M$115,COLUMNS('Section 2'!$C$13:E$13),0)),\"\",VLOOKUP($B91,'Section 2'!$C$16:$M$115,COLUMNS('Section 2'!$C$13:E$13),0)))","v":""},{"$f":"IF($D91=\"\",\"\",IF(ISBLANK(VLOOKUP($B91,'Section 2'!$C$16:$M$115,COLUMNS('Section 2'!$C$13:F$13),0)),\"\",VLOOKUP($B91,'Section 2'!$C$16:$M$115,COLUMNS('Section 2'!$C$13:F$13),0)))","v":""},{"$f":"IF($D91=\"\",\"\",IF(ISBLANK(VLOOKUP($B91,'Section 2'!$C$16:$M$115,COLUMNS('Section 2'!$C$13:G$13),0)),\"\",VLOOKUP($B91,'Section 2'!$C$16:$M$115,COLUMNS('Section 2'!$C$13:G$13),0)))","v":""},{"$f":"IF($D91=\"\",\"\",IF(ISBLANK(VLOOKUP($B91,'Section 2'!$C$16:$M$115,COLUMNS('Section 2'!$C$13:H$13),0)),\"\",VLOOKUP($B91,'Section 2'!$C$16:$M$115,COLUMNS('Section 2'!$C$13:H$13),0)))","v":""},{"$f":"IF($D91=\"\",\"\",IF(ISBLANK(VLOOKUP($B91,'Section 2'!$C$16:$M$115,COLUMNS('Section 2'!$C$13:I$13),0)),\"\",VLOOKUP($B91,'Section 2'!$C$16:$M$115,COLUMNS('Section 2'!$C$13:I$13),0)))","v":""},{"$f":"IF($D91=\"\",\"\",IF(ISBLANK(VLOOKUP($B91,'Section 2'!$C$16:$M$115,COLUMNS('Section 2'!$C$13:J$13),0)),\"\",VLOOKUP($B91,'Section 2'!$C$16:$M$115,COLUMNS('Section 2'!$C$13:J$13),0)))","v":""},{"$f":"IF($D91=\"\",\"\",IF(ISBLANK(VLOOKUP($B91,'Section 2'!$C$16:$M$115,COLUMNS('Section 2'!$C$13:K$13),0)),\"\",VLOOKUP($B91,'Section 2'!$C$16:$M$115,COLUMNS('Section 2'!$C$13:K$13),0)))","v":""},{"$f":"IF($D91=\"\",\"\",IF(ISBLANK(VLOOKUP($B91,'Section 2'!$C$16:$M$115,COLUMNS('Section 2'!$C$13:L$13),0)),\"\",VLOOKUP($B91,'Section 2'!$C$16:$M$115,COLUMNS('Section 2'!$C$13:L$13),0)))","v":""},{"$f":"IF($D91=\"\",\"\",IF(ISBLANK(VLOOKUP($B91,'Section 2'!$C$16:$M$115,COLUMNS('Section 2'!$C$13:M$13),0)),\"\",VLOOKUP($B91,'Section 2'!$C$16:$M$115,COLUMNS('Section 2'!$C$13:M$13),0)))","v":""}]
[{"$f":"IF(D92=\"\",\"\",ROWS($A$1:A92))","v":""},91,"",{"$f":"IFERROR(VLOOKUP($B92,'Section 2'!$C$16:$M$115,COLUMNS('Section 2'!$C$13:C$13),0),\"\")","v":""},{"$f":"IF($D92=\"\",\"\",IF(ISBLANK(VLOOKUP($B92,'Section 2'!$C$16:$M$115,COLUMNS('Section 2'!$C$13:D$13),0)),\"\",VLOOKUP($B92,'Section 2'!$C$16:$M$115,COLUMNS('Section 2'!$C$13:D$13),0)))","v":""},{"$f":"IF($D92=\"\",\"\",IF(ISBLANK(VLOOKUP($B92,'Section 2'!$C$16:$M$115,COLUMNS('Section 2'!$C$13:E$13),0)),\"\",VLOOKUP($B92,'Section 2'!$C$16:$M$115,COLUMNS('Section 2'!$C$13:E$13),0)))","v":""},{"$f":"IF($D92=\"\",\"\",IF(ISBLANK(VLOOKUP($B92,'Section 2'!$C$16:$M$115,COLUMNS('Section 2'!$C$13:F$13),0)),\"\",VLOOKUP($B92,'Section 2'!$C$16:$M$115,COLUMNS('Section 2'!$C$13:F$13),0)))","v":""},{"$f":"IF($D92=\"\",\"\",IF(ISBLANK(VLOOKUP($B92,'Section 2'!$C$16:$M$115,COLUMNS('Section 2'!$C$13:G$13),0)),\"\",VLOOKUP($B92,'Section 2'!$C$16:$M$115,COLUMNS('Section 2'!$C$13:G$13),0)))","v":""},{"$f":"IF($D92=\"\",\"\",IF(ISBLANK(VLOOKUP($B92,'Section 2'!$C$16:$M$115,COLUMNS('Section 2'!$C$13:H$13),0)),\"\",VLOOKUP($B92,'Section 2'!$C$16:$M$115,COLUMNS('Section 2'!$C$13:H$13),0)))","v":""},{"$f":"IF($D92=\"\",\"\",IF(ISBLANK(VLOOKUP($B92,'Section 2'!$C$16:$M$115,COLUMNS('Section 2'!$C$13:I$13),0)),\"\",VLOOKUP($B92,'Section 2'!$C$16:$M$115,COLUMNS('Section 2'!$C$13:I$13),0)))","v":""},{"$f":"IF($D92=\"\",\"\",IF(ISBLANK(VLOOKUP($B92,'Section 2'!$C$16:$M$115,COLUMNS('Section 2'!$C$13:J$13),0)),\"\",VLOOKUP($B92,'Section 2'!$C$16:$M$115,COLUMNS('Section 2'!$C$13:J$13),0)))","v":""},{"$f":"IF($D92=\"\",\"\",IF(ISBLANK(VLOOKUP($B92,'Section 2'!$C$16:$M$115,COLUMNS('Section 2'!$C$13:K$13),0)),\"\",VLOOKUP($B92,'Section 2'!$C$16:$M$115,COLUMNS('Section 2'!$C$13:K$13),0)))","v":""},{"$f":"IF($D92=\"\",\"\",IF(ISBLANK(VLOOKUP($B92,'Section 2'!$C$16:$M$115,COLUMNS('Section 2'!$C$13:L$13),0)),\"\",VLOOKUP($B92,'Section 2'!$C$16:$M$115,COLUMNS('Section 2'!$C$13:L$13),0)))","v":""},{"$f":"IF($D92=\"\",\"\",IF(ISBLANK(VLOOKUP($B92,'Section 2'!$C$16:$M$115,COLUMNS('Section 2'!$C$13:M$13),0)),\"\",VLOOKUP($B92,'Section 2'!$C$16:$M$115,COLUMNS('Section 2'!$C$13:M$13),0)))","v":""}]
[{"$f":"IF(D93=\"\",\"\",ROWS($A$1:A93))","v":""},92,"",{"$f":"IFERROR(VLOOKUP($B93,'Section 2'!$C$16:$M$115,COLUMNS('Section 2'!$C$13:C$13),0),\"\")","v":""},{"$f":"IF($D93=\"\",\"\",IF(ISBLANK(VLOOKUP($B93,'Section 2'!$C$16:$M$115,COLUMNS('Section 2'!$C$13:D$13),0)),\"\",VLOOKUP($B93,'Section 2'!$C$16:$M$115,COLUMNS('Section 2'!$C$13:D$13),0)))","v":""},{"$f":"IF($D93=\"\",\"\",IF(ISBLANK(VLOOKUP($B93,'Section 2'!$C$16:$M$115,COLUMNS('Section 2'!$C$13:E$13),0)),\"\",VLOOKUP($B93,'Section 2'!$C$16:$M$115,COLUMNS('Section 2'!$C$13:E$13),0)))","v":""},{"$f":"IF($D93=\"\",\"\",IF(ISBLANK(VLOOKUP($B93,'Section 2'!$C$16:$M$115,COLUMNS('Section 2'!$C$13:F$13),0)),\"\",VLOOKUP($B93,'Section 2'!$C$16:$M$115,COLUMNS('Section 2'!$C$13:F$13),0)))","v":""},{"$f":"IF($D93=\"\",\"\",IF(ISBLANK(VLOOKUP($B93,'Section 2'!$C$16:$M$115,COLUMNS('Section 2'!$C$13:G$13),0)),\"\",VLOOKUP($B93,'Section 2'!$C$16:$M$115,COLUMNS('Section 2'!$C$13:G$13),0)))","v":""},{"$f":"IF($D93=\"\",\"\",IF(ISBLANK(VLOOKUP($B93,'Section 2'!$C$16:$M$115,COLUMNS('Section 2'!$C$13:H$13),0)),\"\",VLOOKUP($B93,'Section 2'!$C$16:$M$115,COLUMNS('Section 2'!$C$13:H$13),0)))","v":""},{"$f":"IF($D93=\"\",\"\",IF(ISBLANK(VLOOKUP($B93,'Section 2'!$C$16:$M$115,COLUMNS('Section 2'!$C$13:I$13),0)),\"\",VLOOKUP($B93,'Section 2'!$C$16:$M$115,COLUMNS('Section 2'!$C$13:I$13),0)))","v":""},{"$f":"IF($D93=\"\",\"\",IF(ISBLANK(VLOOKUP($B93,'Section 2'!$C$16:$M$115,COLUMNS('Section 2'!$C$13:J$13),0)),\"\",VLOOKUP($B93,'Section 2'!$C$16:$M$115,COLUMNS('Section 2'!$C$13:J$13),0)))","v":""},{"$f":"IF($D93=\"\",\"\",IF(ISBLANK(VLOOKUP($B93,'Section 2'!$C$16:$M$115,COLUMNS('Section 2'!$C$13:K$13),0)),\"\",VLOOKUP($B93,'Section 2'!$C$16:$M$115,COLUMNS('Section 2'!$C$13:K$13),0)))","v":""},{"$f":"IF($D93=\"\",\"\",IF(ISBLANK(VLOOKUP($B93,'Section 2'!$C$16:$M$115,COLUMNS('Section 2'!$C$13:L$13),0)),\"\",VLOOKUP($B93,'Section 2'!$C$16:$M$115,COLUMNS('Section 2'!$C$13:L$13),0)))","v":""},{"$f":"IF($D93=\"\",\"\",IF(ISBLANK(VLOOKUP($B93,'Section 2'!$C$16:$M$115,COLUMNS('Section 2'!$C$13:M$13),0)),\"\",VLOOKUP($B93,'Section 2'!$C$16:$M$115,COLUMNS('Section 2'!$C$13:M$13),0)))","v":""}]
[{"$f":"IF(D94=\"\",\"\",ROWS($A$1:A94))","v":""},93,"",{"$f":"IFERROR(VLOOKUP($B94,'Section 2'!$C$16:$M$115,COLUMNS('Section 2'!$C$13:C$13),0),\"\")","v":""},{"$f":"IF($D94=\"\",\"\",IF(ISBLANK(VLOOKUP($B94,'Section 2'!$C$16:$M$115,COLUMNS('Section 2'!$C$13:D$13),0)),\"\",VLOOKUP($B94,'Section 2'!$C$16:$M$115,COLUMNS('Section 2'!$C$13:D$13),0)))","v":""},{"$f":"IF($D94=\"\",\"\",IF(ISBLANK(VLOOKUP($B94,'Section 2'!$C$16:$M$115,COLUMNS('Section 2'!$C$13:E$13),0)),\"\",VLOOKUP($B94,'Section 2'!$C$16:$M$115,COLUMNS('Section 2'!$C$13:E$13),0)))","v":""},{"$f":"IF($D94=\"\",\"\",IF(ISBLANK(VLOOKUP($B94,'Section 2'!$C$16:$M$115,COLUMNS('Section 2'!$C$13:F$13),0)),\"\",VLOOKUP($B94,'Section 2'!$C$16:$M$115,COLUMNS('Section 2'!$C$13:F$13),0)))","v":""},{"$f":"IF($D94=\"\",\"\",IF(ISBLANK(VLOOKUP($B94,'Section 2'!$C$16:$M$115,COLUMNS('Section 2'!$C$13:G$13),0)),\"\",VLOOKUP($B94,'Section 2'!$C$16:$M$115,COLUMNS('Section 2'!$C$13:G$13),0)))","v":""},{"$f":"IF($D94=\"\",\"\",IF(ISBLANK(VLOOKUP($B94,'Section 2'!$C$16:$M$115,COLUMNS('Section 2'!$C$13:H$13),0)),\"\",VLOOKUP($B94,'Section 2'!$C$16:$M$115,COLUMNS('Section 2'!$C$13:H$13),0)))","v":""},{"$f":"IF($D94=\"\",\"\",IF(ISBLANK(VLOOKUP($B94,'Section 2'!$C$16:$M$115,COLUMNS('Section 2'!$C$13:I$13),0)),\"\",VLOOKUP($B94,'Section 2'!$C$16:$M$115,COLUMNS('Section 2'!$C$13:I$13),0)))","v":""},{"$f":"IF($D94=\"\",\"\",IF(ISBLANK(VLOOKUP($B94,'Section 2'!$C$16:$M$115,COLUMNS('Section 2'!$C$13:J$13),0)),\"\",VLOOKUP($B94,'Section 2'!$C$16:$M$115,COLUMNS('Section 2'!$C$13:J$13),0)))","v":""},{"$f":"IF($D94=\"\",\"\",IF(ISBLANK(VLOOKUP($B94,'Section 2'!$C$16:$M$115,COLUMNS('Section 2'!$C$13:K$13),0)),\"\",VLOOKUP($B94,'Section 2'!$C$16:$M$115,COLUMNS('Section 2'!$C$13:K$13),0)))","v":""},{"$f":"IF($D94=\"\",\"\",IF(ISBLANK(VLOOKUP($B94,'Section 2'!$C$16:$M$115,COLUMNS('Section 2'!$C$13:L$13),0)),\"\",VLOOKUP($B94,'Section 2'!$C$16:$M$115,COLUMNS('Section 2'!$C$13:L$13),0)))","v":""},{"$f":"IF($D94=\"\",\"\",IF(ISBLANK(VLOOKUP($B94,'Section 2'!$C$16:$M$115,COLUMNS('Section 2'!$C$13:M$13),0)),\"\",VLOOKUP($B94,'Section 2'!$C$16:$M$115,COLUMNS('Section 2'!$C$13:M$13),0)))","v":""}]
[{"$f":"IF(D95=\"\",\"\",ROWS($A$1:A95))","v":""},94,"",{"$f":"IFERROR(VLOOKUP($B95,'Section 2'!$C$16:$M$115,COLUMNS('Section 2'!$C$13:C$13),0),\"\")","v":""},{"$f":"IF($D95=\"\",\"\",IF(ISBLANK(VLOOKUP($B95,'Section 2'!$C$16:$M$115,COLUMNS('Section 2'!$C$13:D$13),0)),\"\",VLOOKUP($B95,'Section 2'!$C$16:$M$115,COLUMNS('Section 2'!$C$13:D$13),0)))","v":""},{"$f":"IF($D95=\"\",\"\",IF(ISBLANK(VLOOKUP($B95,'Section 2'!$C$16:$M$115,COLUMNS('Section 2'!$C$13:E$13),0)),\"\",VLOOKUP($B95,'Section 2'!$C$16:$M$115,COLUMNS('Section 2'!$C$13:E$13),0)))","v":""},{"$f":"IF($D95=\"\",\"\",IF(ISBLANK(VLOOKUP($B95,'Section 2'!$C$16:$M$115,COLUMNS('Section 2'!$C$13:F$13),0)),\"\",VLOOKUP($B95,'Section 2'!$C$16:$M$115,COLUMNS('Section 2'!$C$13:F$13),0)))","v":""},{"$f":"IF($D95=\"\",\"\",IF(ISBLANK(VLOOKUP($B95,'Section 2'!$C$16:$M$115,COLUMNS('Section 2'!$C$13:G$13),0)),\"\",VLOOKUP($B95,'Section 2'!$C$16:$M$115,COLUMNS('Section 2'!$C$13:G$13),0)))","v":""},{"$f":"IF($D95=\"\",\"\",IF(ISBLANK(VLOOKUP($B95,'Section 2'!$C$16:$M$115,COLUMNS('Section 2'!$C$13:H$13),0)),\"\",VLOOKUP($B95,'Section 2'!$C$16:$M$115,COLUMNS('Section 2'!$C$13:H$13),0)))","v":""},{"$f":"IF($D95=\"\",\"\",IF(ISBLANK(VLOOKUP($B95,'Section 2'!$C$16:$M$115,COLUMNS('Section 2'!$C$13:I$13),0)),\"\",VLOOKUP($B95,'Section 2'!$C$16:$M$115,COLUMNS('Section 2'!$C$13:I$13),0)))","v":""},{"$f":"IF($D95=\"\",\"\",IF(ISBLANK(VLOOKUP($B95,'Section 2'!$C$16:$M$115,COLUMNS('Section 2'!$C$13:J$13),0)),\"\",VLOOKUP($B95,'Section 2'!$C$16:$M$115,COLUMNS('Section 2'!$C$13:J$13),0)))","v":""},{"$f":"IF($D95=\"\",\"\",IF(ISBLANK(VLOOKUP($B95,'Section 2'!$C$16:$M$115,COLUMNS('Section 2'!$C$13:K$13),0)),\"\",VLOOKUP($B95,'Section 2'!$C$16:$M$115,COLUMNS('Section 2'!$C$13:K$13),0)))","v":""},{"$f":"IF($D95=\"\",\"\",IF(ISBLANK(VLOOKUP($B95,'Section 2'!$C$16:$M$115,COLUMNS('Section 2'!$C$13:L$13),0)),\"\",VLOOKUP($B95,'Section 2'!$C$16:$M$115,COLUMNS('Section 2'!$C$13:L$13),0)))","v":""},{"$f":"IF($D95=\"\",\"\",IF(ISBLANK(VLOOKUP($B95,'Section 2'!$C$16:$M$115,COLUMNS('Section 2'!$C$13:M$13),0)),\"\",VLOOKUP($B95,'Section 2'!$C$16:$M$115,COLUMNS('Section 2'!$C$13:M$13),0)))","v":""}]
[{"$f":"IF(D96=\"\",\"\",ROWS($A$1:A96))","v":""},95,"",{"$f":"IFERROR(VLOOKUP($B96,'Section 2'!$C$16:$M$115,COLUMNS('Section 2'!$C$13:C$13),0),\"\")","v":""},{"$f":"IF($D96=\"\",\"\",IF(ISBLANK(VLOOKUP($B96,'Section 2'!$C$16:$M$115,COLUMNS('Section 2'!$C$13:D$13),0)),\"\",VLOOKUP($B96,'Section 2'!$C$16:$M$115,COLUMNS('Section 2'!$C$13:D$13),0)))","v":""},{"$f":"IF($D96=\"\",\"\",IF(ISBLANK(VLOOKUP($B96,'Section 2'!$C$16:$M$115,COLUMNS('Section 2'!$C$13:E$13),0)),\"\",VLOOKUP($B96,'Section 2'!$C$16:$M$115,COLUMNS('Section 2'!$C$13:E$13),0)))","v":""},{"$f":"IF($D96=\"\",\"\",IF(ISBLANK(VLOOKUP($B96,'Section 2'!$C$16:$M$115,COLUMNS('Section 2'!$C$13:F$13),0)),\"\",VLOOKUP($B96,'Section 2'!$C$16:$M$115,COLUMNS('Section 2'!$C$13:F$13),0)))","v":""},{"$f":"IF($D96=\"\",\"\",IF(ISBLANK(VLOOKUP($B96,'Section 2'!$C$16:$M$115,COLUMNS('Section 2'!$C$13:G$13),0)),\"\",VLOOKUP($B96,'Section 2'!$C$16:$M$115,COLUMNS('Section 2'!$C$13:G$13),0)))","v":""},{"$f":"IF($D96=\"\",\"\",IF(ISBLANK(VLOOKUP($B96,'Section 2'!$C$16:$M$115,COLUMNS('Section 2'!$C$13:H$13),0)),\"\",VLOOKUP($B96,'Section 2'!$C$16:$M$115,COLUMNS('Section 2'!$C$13:H$13),0)))","v":""},{"$f":"IF($D96=\"\",\"\",IF(ISBLANK(VLOOKUP($B96,'Section 2'!$C$16:$M$115,COLUMNS('Section 2'!$C$13:I$13),0)),\"\",VLOOKUP($B96,'Section 2'!$C$16:$M$115,COLUMNS('Section 2'!$C$13:I$13),0)))","v":""},{"$f":"IF($D96=\"\",\"\",IF(ISBLANK(VLOOKUP($B96,'Section 2'!$C$16:$M$115,COLUMNS('Section 2'!$C$13:J$13),0)),\"\",VLOOKUP($B96,'Section 2'!$C$16:$M$115,COLUMNS('Section 2'!$C$13:J$13),0)))","v":""},{"$f":"IF($D96=\"\",\"\",IF(ISBLANK(VLOOKUP($B96,'Section 2'!$C$16:$M$115,COLUMNS('Section 2'!$C$13:K$13),0)),\"\",VLOOKUP($B96,'Section 2'!$C$16:$M$115,COLUMNS('Section 2'!$C$13:K$13),0)))","v":""},{"$f":"IF($D96=\"\",\"\",IF(ISBLANK(VLOOKUP($B96,'Section 2'!$C$16:$M$115,COLUMNS('Section 2'!$C$13:L$13),0)),\"\",VLOOKUP($B96,'Section 2'!$C$16:$M$115,COLUMNS('Section 2'!$C$13:L$13),0)))","v":""},{"$f":"IF($D96=\"\",\"\",IF(ISBLANK(VLOOKUP($B96,'Section 2'!$C$16:$M$115,COLUMNS('Section 2'!$C$13:M$13),0)),\"\",VLOOKUP($B96,'Section 2'!$C$16:$M$115,COLUMNS('Section 2'!$C$13:M$13),0)))","v":""}]
[{"$f":"IF(D97=\"\",\"\",ROWS($A$1:A97))","v":""},96,"",{"$f":"IFERROR(VLOOKUP($B97,'Section 2'!$C$16:$M$115,COLUMNS('Section 2'!$C$13:C$13),0),\"\")","v":""},{"$f":"IF($D97=\"\",\"\",IF(ISBLANK(VLOOKUP($B97,'Section 2'!$C$16:$M$115,COLUMNS('Section 2'!$C$13:D$13),0)),\"\",VLOOKUP($B97,'Section 2'!$C$16:$M$115,COLUMNS('Section 2'!$C$13:D$13),0)))","v":""},{"$f":"IF($D97=\"\",\"\",IF(ISBLANK(VLOOKUP($B97,'Section 2'!$C$16:$M$115,COLUMNS('Section 2'!$C$13:E$13),0)),\"\",VLOOKUP($B97,'Section 2'!$C$16:$M$115,COLUMNS('Section 2'!$C$13:E$13),0)))","v":""},{"$f":"IF($D97=\"\",\"\",IF(ISBLANK(VLOOKUP($B97,'Section 2'!$C$16:$M$115,COLUMNS('Section 2'!$C$13:F$13),0)),\"\",VLOOKUP($B97,'Section 2'!$C$16:$M$115,COLUMNS('Section 2'!$C$13:F$13),0)))","v":""},{"$f":"IF($D97=\"\",\"\",IF(ISBLANK(VLOOKUP($B97,'Section 2'!$C$16:$M$115,COLUMNS('Section 2'!$C$13:G$13),0)),\"\",VLOOKUP($B97,'Section 2'!$C$16:$M$115,COLUMNS('Section 2'!$C$13:G$13),0)))","v":""},{"$f":"IF($D97=\"\",\"\",IF(ISBLANK(VLOOKUP($B97,'Section 2'!$C$16:$M$115,COLUMNS('Section 2'!$C$13:H$13),0)),\"\",VLOOKUP($B97,'Section 2'!$C$16:$M$115,COLUMNS('Section 2'!$C$13:H$13),0)))","v":""},{"$f":"IF($D97=\"\",\"\",IF(ISBLANK(VLOOKUP($B97,'Section 2'!$C$16:$M$115,COLUMNS('Section 2'!$C$13:I$13),0)),\"\",VLOOKUP($B97,'Section 2'!$C$16:$M$115,COLUMNS('Section 2'!$C$13:I$13),0)))","v":""},{"$f":"IF($D97=\"\",\"\",IF(ISBLANK(VLOOKUP($B97,'Section 2'!$C$16:$M$115,COLUMNS('Section 2'!$C$13:J$13),0)),\"\",VLOOKUP($B97,'Section 2'!$C$16:$M$115,COLUMNS('Section 2'!$C$13:J$13),0)))","v":""},{"$f":"IF($D97=\"\",\"\",IF(ISBLANK(VLOOKUP($B97,'Section 2'!$C$16:$M$115,COLUMNS('Section 2'!$C$13:K$13),0)),\"\",VLOOKUP($B97,'Section 2'!$C$16:$M$115,COLUMNS('Section 2'!$C$13:K$13),0)))","v":""},{"$f":"IF($D97=\"\",\"\",IF(ISBLANK(VLOOKUP($B97,'Section 2'!$C$16:$M$115,COLUMNS('Section 2'!$C$13:L$13),0)),\"\",VLOOKUP($B97,'Section 2'!$C$16:$M$115,COLUMNS('Section 2'!$C$13:L$13),0)))","v":""},{"$f":"IF($D97=\"\",\"\",IF(ISBLANK(VLOOKUP($B97,'Section 2'!$C$16:$M$115,COLUMNS('Section 2'!$C$13:M$13),0)),\"\",VLOOKUP($B97,'Section 2'!$C$16:$M$115,COLUMNS('Section 2'!$C$13:M$13),0)))","v":""}]
[{"$f":"IF(D98=\"\",\"\",ROWS($A$1:A98))","v":""},97,"",{"$f":"IFERROR(VLOOKUP($B98,'Section 2'!$C$16:$M$115,COLUMNS('Section 2'!$C$13:C$13),0),\"\")","v":""},{"$f":"IF($D98=\"\",\"\",IF(ISBLANK(VLOOKUP($B98,'Section 2'!$C$16:$M$115,COLUMNS('Section 2'!$C$13:D$13),0)),\"\",VLOOKUP($B98,'Section 2'!$C$16:$M$115,COLUMNS('Section 2'!$C$13:D$13),0)))","v":""},{"$f":"IF($D98=\"\",\"\",IF(ISBLANK(VLOOKUP($B98,'Section 2'!$C$16:$M$115,COLUMNS('Section 2'!$C$13:E$13),0)),\"\",VLOOKUP($B98,'Section 2'!$C$16:$M$115,COLUMNS('Section 2'!$C$13:E$13),0)))","v":""},{"$f":"IF($D98=\"\",\"\",IF(ISBLANK(VLOOKUP($B98,'Section 2'!$C$16:$M$115,COLUMNS('Section 2'!$C$13:F$13),0)),\"\",VLOOKUP($B98,'Section 2'!$C$16:$M$115,COLUMNS('Section 2'!$C$13:F$13),0)))","v":""},{"$f":"IF($D98=\"\",\"\",IF(ISBLANK(VLOOKUP($B98,'Section 2'!$C$16:$M$115,COLUMNS('Section 2'!$C$13:G$13),0)),\"\",VLOOKUP($B98,'Section 2'!$C$16:$M$115,COLUMNS('Section 2'!$C$13:G$13),0)))","v":""},{"$f":"IF($D98=\"\",\"\",IF(ISBLANK(VLOOKUP($B98,'Section 2'!$C$16:$M$115,COLUMNS('Section 2'!$C$13:H$13),0)),\"\",VLOOKUP($B98,'Section 2'!$C$16:$M$115,COLUMNS('Section 2'!$C$13:H$13),0)))","v":""},{"$f":"IF($D98=\"\",\"\",IF(ISBLANK(VLOOKUP($B98,'Section 2'!$C$16:$M$115,COLUMNS('Section 2'!$C$13:I$13),0)),\"\",VLOOKUP($B98,'Section 2'!$C$16:$M$115,COLUMNS('Section 2'!$C$13:I$13),0)))","v":""},{"$f":"IF($D98=\"\",\"\",IF(ISBLANK(VLOOKUP($B98,'Section 2'!$C$16:$M$115,COLUMNS('Section 2'!$C$13:J$13),0)),\"\",VLOOKUP($B98,'Section 2'!$C$16:$M$115,COLUMNS('Section 2'!$C$13:J$13),0)))","v":""},{"$f":"IF($D98=\"\",\"\",IF(ISBLANK(VLOOKUP($B98,'Section 2'!$C$16:$M$115,COLUMNS('Section 2'!$C$13:K$13),0)),\"\",VLOOKUP($B98,'Section 2'!$C$16:$M$115,COLUMNS('Section 2'!$C$13:K$13),0)))","v":""},{"$f":"IF($D98=\"\",\"\",IF(ISBLANK(VLOOKUP($B98,'Section 2'!$C$16:$M$115,COLUMNS('Section 2'!$C$13:L$13),0)),\"\",VLOOKUP($B98,'Section 2'!$C$16:$M$115,COLUMNS('Section 2'!$C$13:L$13),0)))","v":""},{"$f":"IF($D98=\"\",\"\",IF(ISBLANK(VLOOKUP($B98,'Section 2'!$C$16:$M$115,COLUMNS('Section 2'!$C$13:M$13),0)),\"\",VLOOKUP($B98,'Section 2'!$C$16:$M$115,COLUMNS('Section 2'!$C$13:M$13),0)))","v":""}]
[{"$f":"IF(D99=\"\",\"\",ROWS($A$1:A99))","v":""},98,"",{"$f":"IFERROR(VLOOKUP($B99,'Section 2'!$C$16:$M$115,COLUMNS('Section 2'!$C$13:C$13),0),\"\")","v":""},{"$f":"IF($D99=\"\",\"\",IF(ISBLANK(VLOOKUP($B99,'Section 2'!$C$16:$M$115,COLUMNS('Section 2'!$C$13:D$13),0)),\"\",VLOOKUP($B99,'Section 2'!$C$16:$M$115,COLUMNS('Section 2'!$C$13:D$13),0)))","v":""},{"$f":"IF($D99=\"\",\"\",IF(ISBLANK(VLOOKUP($B99,'Section 2'!$C$16:$M$115,COLUMNS('Section 2'!$C$13:E$13),0)),\"\",VLOOKUP($B99,'Section 2'!$C$16:$M$115,COLUMNS('Section 2'!$C$13:E$13),0)))","v":""},{"$f":"IF($D99=\"\",\"\",IF(ISBLANK(VLOOKUP($B99,'Section 2'!$C$16:$M$115,COLUMNS('Section 2'!$C$13:F$13),0)),\"\",VLOOKUP($B99,'Section 2'!$C$16:$M$115,COLUMNS('Section 2'!$C$13:F$13),0)))","v":""},{"$f":"IF($D99=\"\",\"\",IF(ISBLANK(VLOOKUP($B99,'Section 2'!$C$16:$M$115,COLUMNS('Section 2'!$C$13:G$13),0)),\"\",VLOOKUP($B99,'Section 2'!$C$16:$M$115,COLUMNS('Section 2'!$C$13:G$13),0)))","v":""},{"$f":"IF($D99=\"\",\"\",IF(ISBLANK(VLOOKUP($B99,'Section 2'!$C$16:$M$115,COLUMNS('Section 2'!$C$13:H$13),0)),\"\",VLOOKUP($B99,'Section 2'!$C$16:$M$115,COLUMNS('Section 2'!$C$13:H$13),0)))","v":""},{"$f":"IF($D99=\"\",\"\",IF(ISBLANK(VLOOKUP($B99,'Section 2'!$C$16:$M$115,COLUMNS('Section 2'!$C$13:I$13),0)),\"\",VLOOKUP($B99,'Section 2'!$C$16:$M$115,COLUMNS('Section 2'!$C$13:I$13),0)))","v":""},{"$f":"IF($D99=\"\",\"\",IF(ISBLANK(VLOOKUP($B99,'Section 2'!$C$16:$M$115,COLUMNS('Section 2'!$C$13:J$13),0)),\"\",VLOOKUP($B99,'Section 2'!$C$16:$M$115,COLUMNS('Section 2'!$C$13:J$13),0)))","v":""},{"$f":"IF($D99=\"\",\"\",IF(ISBLANK(VLOOKUP($B99,'Section 2'!$C$16:$M$115,COLUMNS('Section 2'!$C$13:K$13),0)),\"\",VLOOKUP($B99,'Section 2'!$C$16:$M$115,COLUMNS('Section 2'!$C$13:K$13),0)))","v":""},{"$f":"IF($D99=\"\",\"\",IF(ISBLANK(VLOOKUP($B99,'Section 2'!$C$16:$M$115,COLUMNS('Section 2'!$C$13:L$13),0)),\"\",VLOOKUP($B99,'Section 2'!$C$16:$M$115,COLUMNS('Section 2'!$C$13:L$13),0)))","v":""},{"$f":"IF($D99=\"\",\"\",IF(ISBLANK(VLOOKUP($B99,'Section 2'!$C$16:$M$115,COLUMNS('Section 2'!$C$13:M$13),0)),\"\",VLOOKUP($B99,'Section 2'!$C$16:$M$115,COLUMNS('Section 2'!$C$13:M$13),0)))","v":""}]
[{"$f":"IF(D100=\"\",\"\",ROWS($A$1:A100))","v":""},99,"",{"$f":"IFERROR(VLOOKUP($B100,'Section 2'!$C$16:$M$115,COLUMNS('Section 2'!$C$13:C$13),0),\"\")","v":""},{"$f":"IF($D100=\"\",\"\",IF(ISBLANK(VLOOKUP($B100,'Section 2'!$C$16:$M$115,COLUMNS('Section 2'!$C$13:D$13),0)),\"\",VLOOKUP($B100,'Section 2'!$C$16:$M$115,COLUMNS('Section 2'!$C$13:D$13),0)))","v":""},{"$f":"IF($D100=\"\",\"\",IF(ISBLANK(VLOOKUP($B100,'Section 2'!$C$16:$M$115,COLUMNS('Section 2'!$C$13:E$13),0)),\"\",VLOOKUP($B100,'Section 2'!$C$16:$M$115,COLUMNS('Section 2'!$C$13:E$13),0)))","v":""},{"$f":"IF($D100=\"\",\"\",IF(ISBLANK(VLOOKUP($B100,'Section 2'!$C$16:$M$115,COLUMNS('Section 2'!$C$13:F$13),0)),\"\",VLOOKUP($B100,'Section 2'!$C$16:$M$115,COLUMNS('Section 2'!$C$13:F$13),0)))","v":""},{"$f":"IF($D100=\"\",\"\",IF(ISBLANK(VLOOKUP($B100,'Section 2'!$C$16:$M$115,COLUMNS('Section 2'!$C$13:G$13),0)),\"\",VLOOKUP($B100,'Section 2'!$C$16:$M$115,COLUMNS('Section 2'!$C$13:G$13),0)))","v":""},{"$f":"IF($D100=\"\",\"\",IF(ISBLANK(VLOOKUP($B100,'Section 2'!$C$16:$M$115,COLUMNS('Section 2'!$C$13:H$13),0)),\"\",VLOOKUP($B100,'Section 2'!$C$16:$M$115,COLUMNS('Section 2'!$C$13:H$13),0)))","v":""},{"$f":"IF($D100=\"\",\"\",IF(ISBLANK(VLOOKUP($B100,'Section 2'!$C$16:$M$115,COLUMNS('Section 2'!$C$13:I$13),0)),\"\",VLOOKUP($B100,'Section 2'!$C$16:$M$115,COLUMNS('Section 2'!$C$13:I$13),0)))","v":""},{"$f":"IF($D100=\"\",\"\",IF(ISBLANK(VLOOKUP($B100,'Section 2'!$C$16:$M$115,COLUMNS('Section 2'!$C$13:J$13),0)),\"\",VLOOKUP($B100,'Section 2'!$C$16:$M$115,COLUMNS('Section 2'!$C$13:J$13),0)))","v":""},{"$f":"IF($D100=\"\",\"\",IF(ISBLANK(VLOOKUP($B100,'Section 2'!$C$16:$M$115,COLUMNS('Section 2'!$C$13:K$13),0)),\"\",VLOOKUP($B100,'Section 2'!$C$16:$M$115,COLUMNS('Section 2'!$C$13:K$13),0)))","v":""},{"$f":"IF($D100=\"\",\"\",IF(ISBLANK(VLOOKUP($B100,'Section 2'!$C$16:$M$115,COLUMNS('Section 2'!$C$13:L$13),0)),\"\",VLOOKUP($B100,'Section 2'!$C$16:$M$115,COLUMNS('Section 2'!$C$13:L$13),0)))","v":""},{"$f":"IF($D100=\"\",\"\",IF(ISBLANK(VLOOKUP($B100,'Section 2'!$C$16:$M$115,COLUMNS('Section 2'!$C$13:M$13),0)),\"\",VLOOKUP($B100,'Section 2'!$C$16:$M$115,COLUMNS('Section 2'!$C$13:M$13),0)))","v":""}]
[{"$f":"IF(D101=\"\",\"\",ROWS($A$1:A101))","v":""},100,"",{"$f":"IFERROR(VLOOKUP($B101,'Section 2'!$C$16:$M$115,COLUMNS('Section 2'!$C$13:C$13),0),\"\")","v":""},{"$f":"IF($D101=\"\",\"\",IF(ISBLANK(VLOOKUP($B101,'Section 2'!$C$16:$M$115,COLUMNS('Section 2'!$C$13:D$13),0)),\"\",VLOOKUP($B101,'Section 2'!$C$16:$M$115,COLUMNS('Section 2'!$C$13:D$13),0)))","v":""},{"$f":"IF($D101=\"\",\"\",IF(ISBLANK(VLOOKUP($B101,'Section 2'!$C$16:$M$115,COLUMNS('Section 2'!$C$13:E$13),0)),\"\",VLOOKUP($B101,'Section 2'!$C$16:$M$115,COLUMNS('Section 2'!$C$13:E$13),0)))","v":""},{"$f":"IF($D101=\"\",\"\",IF(ISBLANK(VLOOKUP($B101,'Section 2'!$C$16:$M$115,COLUMNS('Section 2'!$C$13:F$13),0)),\"\",VLOOKUP($B101,'Section 2'!$C$16:$M$115,COLUMNS('Section 2'!$C$13:F$13),0)))","v":""},{"$f":"IF($D101=\"\",\"\",IF(ISBLANK(VLOOKUP($B101,'Section 2'!$C$16:$M$115,COLUMNS('Section 2'!$C$13:G$13),0)),\"\",VLOOKUP($B101,'Section 2'!$C$16:$M$115,COLUMNS('Section 2'!$C$13:G$13),0)))","v":""},{"$f":"IF($D101=\"\",\"\",IF(ISBLANK(VLOOKUP($B101,'Section 2'!$C$16:$M$115,COLUMNS('Section 2'!$C$13:H$13),0)),\"\",VLOOKUP($B101,'Section 2'!$C$16:$M$115,COLUMNS('Section 2'!$C$13:H$13),0)))","v":""},{"$f":"IF($D101=\"\",\"\",IF(ISBLANK(VLOOKUP($B101,'Section 2'!$C$16:$M$115,COLUMNS('Section 2'!$C$13:I$13),0)),\"\",VLOOKUP($B101,'Section 2'!$C$16:$M$115,COLUMNS('Section 2'!$C$13:I$13),0)))","v":""},{"$f":"IF($D101=\"\",\"\",IF(ISBLANK(VLOOKUP($B101,'Section 2'!$C$16:$M$115,COLUMNS('Section 2'!$C$13:J$13),0)),\"\",VLOOKUP($B101,'Section 2'!$C$16:$M$115,COLUMNS('Section 2'!$C$13:J$13),0)))","v":""},{"$f":"IF($D101=\"\",\"\",IF(ISBLANK(VLOOKUP($B101,'Section 2'!$C$16:$M$115,COLUMNS('Section 2'!$C$13:K$13),0)),\"\",VLOOKUP($B101,'Section 2'!$C$16:$M$115,COLUMNS('Section 2'!$C$13:K$13),0)))","v":""},{"$f":"IF($D101=\"\",\"\",IF(ISBLANK(VLOOKUP($B101,'Section 2'!$C$16:$M$115,COLUMNS('Section 2'!$C$13:L$13),0)),\"\",VLOOKUP($B101,'Section 2'!$C$16:$M$115,COLUMNS('Section 2'!$C$13:L$13),0)))","v":""},{"$f":"IF($D101=\"\",\"\",IF(ISBLANK(VLOOKUP($B101,'Section 2'!$C$16:$M$115,COLUMNS('Section 2'!$C$13:M$13),0)),\"\",VLOOKUP($B101,'Section 2'!$C$16:$M$115,COLUMNS('Section 2'!$C$13:M$13),0)))","v":""}]
[{"$f":"IF(D102=\"\",\"\",ROWS($A$1:A102))","v":""},1,{"$f":"IF(D102=\"\",\"\",3)","v":""},{"$f":"IF($E102=\"\",\"\",\"CH3Br\")","v":""},{"$f":"IFERROR(VLOOKUP($B102,'Section 3'!$A$15:$G$24,COLUMNS('Section 3'!$A$15:D$15),0),\"\")","v":""},{"$f":"IF($E102=\"\",\"\",IFERROR(VLOOKUP($B102,'Section 3'!$A$15:$G$24,COLUMNS('Section 3'!$A$15:F$15),0),\"\"))","v":""},{"$f":"IF($E102=\"\",\"\",IFERROR(VLOOKUP($B102,'Section 3'!$A$15:$G$24,COLUMNS('Section 3'!$A$15:G$15),0),\"\"))","v":""}]
[{"$f":"IF(D103=\"\",\"\",ROWS($A$1:A103))","v":""},2,{"$f":"IF(D103=\"\",\"\",3)","v":""},{"$f":"IF($E103=\"\",\"\",\"CH3Br\")","v":""},{"$f":"IFERROR(VLOOKUP($B103,'Section 3'!$A$15:$G$24,COLUMNS('Section 3'!$A$15:D$15),0),\"\")","v":""},{"$f":"IF($E103=\"\",\"\",IFERROR(VLOOKUP($B103,'Section 3'!$A$15:$G$24,COLUMNS('Section 3'!$A$15:F$15),0),\"\"))","v":""},{"$f":"IF($E103=\"\",\"\",IFERROR(VLOOKUP($B103,'Section 3'!$A$15:$G$24,COLUMNS('Section 3'!$A$15:G$15),0),\"\"))","v":""}]
[{"$f":"IF(D104=\"\",\"\",ROWS($A$1:A104))","v":""},3,"","",{"$f":"IFERROR(VLOOKUP($B104,'Section 3'!$A$15:$G$24,COLUMNS('Section 3'!$A$15:D$15),0),\"\")","v":""},{"$f":"IF($E104=\"\",\"\",IFERROR(VLOOKUP($B104,'Section 3'!$A$15:$G$24,COLUMNS('Section 3'!$A$15:F$15),0),\"\"))","v":""},{"$f":"IF($E104=\"\",\"\",IFERROR(VLOOKUP($B104,'Section 3'!$A$15:$G$24,COLUMNS('Section 3'!$A$15:G$15),0),\"\"))","v":""}]
[{"$f":"IF(D105=\"\",\"\",ROWS($A$1:A105))","v":""},4,"","",{"$f":"IFERROR(VLOOKUP($B105,'Section 3'!$A$15:$G$24,COLUMNS('Section 3'!$A$15:D$15),0),\"\")","v":""},{"$f":"IF($E105=\"\",\"\",IFERROR(VLOOKUP($B105,'Section 3'!$A$15:$G$24,COLUMNS('Section 3'!$A$15:F$15),0),\"\"))","v":""},{"$f":"IF($E105=\"\",\"\",IFERROR(VLOOKUP($B105,'Section 3'!$A$15:$G$24,COLUMNS('Section 3'!$A$15:G$15),0),\"\"))","v":""}]
[{"$f":"IF(D106=\"\",\"\",ROWS($A$1:A106))","v":""},5,"","",{"$f":"IFERROR(VLOOKUP($B106,'Section 3'!$A$15:$G$24,COLUMNS('Section 3'!$A$15:D$15),0),\"\")","v":""},{"$f":"IF($E106=\"\",\"\",IFERROR(VLOOKUP($B106,'Section 3'!$A$15:$G$24,COLUMNS('Section 3'!$A$15:F$15),0),\"\"))","v":""},{"$f":"IF($E106=\"\",\"\",IFERROR(VLOOKUP($B106,'Section 3'!$A$15:$G$24,COLUMNS('Section 3'!$A$15:G$15),0),\"\"))","v":""}]
[{"$f":"IF(D107=\"\",\"\",ROWS($A$1:A107))","v":""},6,"","",{"$f":"IFERROR(VLOOKUP($B107,'Section 3'!$A$15:$G$24,COLUMNS('Section 3'!$A$15:D$15),0),\"\")","v":""},{"$f":"IF($E107=\"\",\"\",IFERROR(VLOOKUP($B107,'Section 3'!$A$15:$G$24,COLUMNS('Section 3'!$A$15:F$15),0),\"\"))","v":""},{"$f":"IF($E107=\"\",\"\",IFERROR(VLOOKUP($B107,'Section 3'!$A$15:$G$24,COLUMNS('Section 3'!$A$15:G$15),0),\"\"))","v":""}]
[{"$f":"IF(D108=\"\",\"\",ROWS($A$1:A108))","v":""},7,"","",{"$f":"IFERROR(VLOOKUP($B108,'Section 3'!$A$15:$G$24,COLUMNS('Section 3'!$A$15:D$15),0),\"\")","v":""},{"$f":"IF($E108=\"\",\"\",IFERROR(VLOOKUP($B108,'Section 3'!$A$15:$G$24,COLUMNS('Section 3'!$A$15:F$15),0),\"\"))","v":""},{"$f":"IF($E108=\"\",\"\",IFERROR(VLOOKUP($B108,'Section 3'!$A$15:$G$24,COLUMNS('Section 3'!$A$15:G$15),0),\"\"))","v":""}]
[{"$f":"IF(D109=\"\",\"\",ROWS($A$1:A109))","v":""},8,"","",{"$f":"IFERROR(VLOOKUP($B109,'Section 3'!$A$15:$G$24,COLUMNS('Section 3'!$A$15:D$15),0),\"\")","v":""},{"$f":"IF($E109=\"\",\"\",IFERROR(VLOOKUP($B109,'Section 3'!$A$15:$G$24,COLUMNS('Section 3'!$A$15:F$15),0),\"\"))","v":""},{"$f":"IF($E109=\"\",\"\",IFERROR(VLOOKUP($B109,'Section 3'!$A$15:$G$24,COLUMNS('Section 3'!$A$15:G$15),0),\"\"))","v":""}]
[{"$f":"IF(D110=\"\",\"\",ROWS($A$1:A110))","v":""},9,"","",{"$f":"IFERROR(VLOOKUP($B110,'Section 3'!$A$15:$G$24,COLUMNS('Section 3'!$A$15:D$15),0),\"\")","v":""},{"$f":"IF($E110=\"\",\"\",IFERROR(VLOOKUP($B110,'Section 3'!$A$15:$G$24,COLUMNS('Section 3'!$A$15:F$15),0),\"\"))","v":""},{"$f":"IF($E110=\"\",\"\",IFERROR(VLOOKUP($B110,'Section 3'!$A$15:$G$24,COLUMNS('Section 3'!$A$15:G$15),0),\"\"))","v":""}]
[{"$f":"IF(D111=\"\",\"\",ROWS($A$1:A111))","v":""},10,"","",{"$f":"IFERROR(VLOOKUP($B111,'Section 3'!$A$15:$G$24,COLUMNS('Section 3'!$A$15:D$15),0),\"\")","v":""},{"$f":"IF($E111=\"\",\"\",IFERROR(VLOOKUP($B111,'Section 3'!$A$15:$G$24,COLUMNS('Section 3'!$A$15:F$15),0),\"\"))","v":""},{"$f":"IF($E111=\"\",\"\",IFERROR(VLOOKUP($B111,'Section 3'!$A$15:$G$24,COLUMNS('Section 3'!$A$15:G$15),0),\"\"))","v":""}]
[{"$f":"IF(D112=\"\",\"\",ROWS($A$1:A112))","v":""},1,{"$f":"IF(D112=\"\",\"\",\"4a\")","v":""},{"$f":"IF(ISBLANK('Section 4'!D10),\"\",'Section 4'!D10)","v":""}]
[{"$f":"IF(D113=\"\",\"\",ROWS($A$1:A113))","v":""},1,{"$f":"IF(D113=\"\",\"\",\"4b\")","v":""},{"$f":"IFERROR(VLOOKUP($B113,'Section 4'!$A$15:$G$17,COLUMNS('Section 4'!$A$14:D$14),0),\"\")","v":""},{"$f":"IFERROR(VLOOKUP($B113,'Section 4'!$A$15:$G$17,COLUMNS('Section 4'!$A$14:F$14),0),\"\")","v":""},{"$f":"IFERROR(VLOOKUP($B113,'Section 4'!$A$15:$G$17,COLUMNS('Section 4'!$A$14:G$14),0),\"\")","v":""}]
[{"$f":"IF(D114=\"\",\"\",ROWS($A$1:A114))","v":""},2,{"$f":"IF(D114=\"\",\"\",\"4b\")","v":""},{"$f":"IFERROR(VLOOKUP($B114,'Section 4'!$A$15:$G$17,COLUMNS('Section 4'!$A$14:D$14),0),\"\")","v":""},{"$f":"IFERROR(VLOOKUP($B114,'Section 4'!$A$15:$G$17,COLUMNS('Section 4'!$A$14:F$14),0),\"\")","v":""},{"$f":"IFERROR(VLOOKUP($B114,'Section 4'!$A$15:$G$17,COLUMNS('Section 4'!$A$14:G$14),0),\"\")","v":""}]
[{"$f":"IF(D115=\"\",\"\",ROWS($A$1:A115))","v":""},3,{"$f":"IF(D115=\"\",\"\",\"4b\")","v":""},{"$f":"IFERROR(VLOOKUP($B115,'Section 4'!$A$15:$G$17,COLUMNS('Section 4'!$A$14:D$14),0),\"\")","v":""},{"$f":"IFERROR(VLOOKUP($B115,'Section 4'!$A$15:$G$17,COLUMNS('Section 4'!$A$14:F$14),0),\"\")","v":""},{"$f":"IFERROR(VLOOKUP($B115,'Section 4'!$A$15:$G$17,COLUMNS('Section 4'!$A$14:G$14),0),\"\")","v":""}]
[null,"LastRow"]

{"sheet":"TempOutput","index":10,"n_rows":115,"n_cols":10,"rows_kept":115,"hidden":true}
["MaxRow",1,"IMPT3","1","2017-11-03","TEST ORG","Original Submission",2016,4,"222333444"]
[{"$f":"IF(OR(B2=\"\",B2=0),\"\",ROWS($A$1:A2))","v":""}]
[{"$f":"IF(OR(B3=\"\",B3=0),\"\",ROWS($A$1:A3))","v":""}]
[{"$f":"IF(OR(B4=\"\",B4=0),\"\",ROWS($A$1:A4))","v":""}]
[{"$f":"IF(OR(B5=\"\",B5=0),\"\",ROWS($A$1:A5))","v":""}]
[{"$f":"IF(OR(B6=\"\",B6=0),\"\",ROWS($A$1:A6))","v":""}]
[{"$f":"IF(OR(B7=\"\",B7=0),\"\",ROWS($A$1:A7))","v":""}]
[{"$f":"IF(OR(B8=\"\",B8=0),\"\",ROWS($A$1:A8))","v":""}]
[{"$f":"IF(OR(B9=\"\",B9=0),\"\",ROWS($A$1:A9))","v":""}]
[{"$f":"IF(OR(B10=\"\",B10=0),\"\",ROWS($A$1:A10))","v":""}]
[{"$f":"IF(OR(B11=\"\",B11=0),\"\",ROWS($A$1:A11))","v":""}]
[{"$f":"IF(OR(B12=\"\",B12=0),\"\",ROWS($A$1:A12))","v":""}]
[{"$f":"IF(OR(B13=\"\",B13=0),\"\",ROWS($A$1:A13))","v":""}]
[{"$f":"IF(OR(B14=\"\",B14=0),\"\",ROWS($A$1:A14))","v":""}]
[{"$f":"IF(OR(B15=\"\",B15=0),\"\",ROWS($A$1:A15))","v":""}]
[{"$f":"IF(OR(B16=\"\",B16=0),\"\",ROWS($A$1:A16))","v":""}]
[{"$f":"IF(OR(B17=\"\",B17=0),\"\",ROWS($A$1:A17))","v":""}]
[{"$f":"IF(OR(B18=\"\",B18=0),\"\",ROWS($A$1:A18))","v":""}]
[{"$f":"IF(OR(B19=\"\",B19=0),\"\",ROWS($A$1:A19))","v":""}]
[{"$f":"IF(OR(B20=\"\",B20=0),\"\",ROWS($A$1:A20))","v":""}]
[{"$f":"IF(OR(B21=\"\",B21=0),\"\",ROWS($A$1:A21))","v":""}]
[{"$f":"IF(OR(B22=\"\",B22=0),\"\",ROWS($A$1:A22))","v":""}]
[{"$f":"IF(OR(B23=\"\",B23=0),\"\",ROWS($A$1:A23))","v":""}]
[{"$f":"IF(OR(B24=\"\",B24=0),\"\",ROWS($A$1:A24))","v":""}]
[{"$f":"IF(OR(B25=\"\",B25=0),\"\",ROWS($A$1:A25))","v":""}]
[{"$f":"IF(OR(B26=\"\",B26=0),\"\",ROWS($A$1:A26))","v":""}]
[{"$f":"IF(OR(B27=\"\",B27=0),\"\",ROWS($A$1:A27))","v":""}]
[{"$f":"IF(OR(B28=\"\",B28=0),\"\",ROWS($A$1:A28))","v":""}]
[{"$f":"IF(OR(B29=\"\",B29=0),\"\",ROWS($A$1:A29))","v":""}]
[{"$f":"IF(OR(B30=\"\",B30=0),\"\",ROWS($A$1:A30))","v":""}]
[{"$f":"IF(OR(B31=\"\",B31=0),\"\",ROWS($A$1:A31))","v":""}]
[{"$f":"IF(OR(B32=\"\",B32=0),\"\",ROWS($A$1:A32))","v":""}]
[{"$f":"IF(OR(B33=\"\",B33=0),\"\",ROWS($A$1:A33))","v":""}]
[{"$f":"IF(OR(B34=\"\",B34=0),\"\",ROWS($A$1:A34))","v":""}]
[{"$f":"IF(OR(B35=\"\",B35=0),\"\",ROWS($A$1:A35))","v":""}]
[{"$f":"IF(OR(B36=\"\",B36=0),\"\",ROWS($A$1:A36))","v":""}]
[{"$f":"IF(OR(B37=\"\",B37=0),\"\",ROWS($A$1:A37))","v":""}]
[{"$f":"IF(OR(B38=\"\",B38=0),\"\",ROWS($A$1:A38))","v":""}]
[{"$f":"IF(OR(B39=\"\",B39=0),\"\",ROWS($A$1:A39))","v":""}]
[{"$f":"IF(OR(B40=\"\",B40=0),\"\",ROWS($A$1:A40))","v":""}]
[{"$f":"IF(OR(B41=\"\",B41=0),\"\",ROWS($A$1:A41))","v":""}]
[{"$f":"IF(OR(B42=\"\",B42=0),\"\",ROWS($A$1:A42))","v":""}]
[{"$f":"IF(OR(B43=\"\",B43=0),\"\",ROWS($A$1:A43))","v":""}]
[{"$f":"IF(OR(B44=\"\",B44=0),\"\",ROWS($A$1:A44))","v":""}]
[{"$f":"IF(OR(B45=\"\",B45=0),\"\",ROWS($A$1:A45))","v":""}]
[{"$f":"IF(OR(B46=\"\",B46=0),\"\",ROWS($A$1:A46))","v":""}]
[{"$f":"IF(OR(B47=\"\",B47=0),\"\",ROWS($A$1:A47))","v":""}]
[{"$f":"IF(OR(B48=\"\",B48=0),\"\",ROWS($A$1:A48))","v":""}]
[{"$f":"IF(OR(B49=\"\",B49=0),\"\",ROWS($A$1:A49))","v":""}]
[{"$f":"IF(OR(B50=\"\",B50=0),\"\",ROWS($A$1:A50))","v":""}]
[{"$f":"IF(OR(B51=\"\",B51=0),\"\",ROWS($A$1:A51))","v":""}]
[{"$f":"IF(OR(B52=\"\",B52=0),\"\",ROWS($A$1:A52))","v":""}]
[{"$f":"IF(OR(B53=\"\",B53=0),\"\",ROWS($A$1:A53))","v":""}]
[{"$f":"IF(OR(B54=\"\",B54=0),\"\",ROWS($A$1:A54))","v":""}]
[{"$f":"IF(OR(B55=\"\",B55=0),\"\",ROWS($A$1:A55))","v":""}]
[{"$f":"IF(OR(B56=\"\",B56=0),\"\",ROWS($A$1:A56))","v":""}]
[{"$f":"IF(OR(B57=\"\",B57=0),\"\",ROWS($A$1:A57))","v":""}]
[{"$f":"IF(OR(B58=\"\",B58=0),\"\",ROWS($A$1:A58))","v":""}]
[{"$f":"IF(OR(B59=\"\",B59=0),\"\",ROWS($A$1:A59))","v":""}]
[{"$f":"IF(OR(B60=\"\",B60=0),\"\",ROWS($A$1:A60))","v":""}]
[{"$f":"IF(OR(B61=\"\",B61=0),\"\",ROWS($A$1:A61))","v":""}]
[{"$f":"IF(OR(B62=\"\",B62=0),\"\",ROWS($A$1:A62))","v":""}]
[{"$f":"IF(OR(B63=\"\",B63=0),\"\",ROWS($A$1:A63))","v":""}]
[{"$f":"IF(OR(B64=\"\",B64=0),\"\",ROWS($A$1:A64))","v":""}]
[{"$f":"IF(OR(B65=\"\",B65=0),\"\",ROWS($A$1:A65))","v":""}]
[{"$f":"IF(OR(B66=\"\",B66=0),\"\",ROWS($A$1:A66))","v":""}]
[{"$f":"IF(OR(B67=\"\",B67=0),\"\",ROWS($A$1:A67))","v":""}]
[{"$f":"IF(OR(B68=\"\",B68=0),\"\",ROWS($A$1:A68))","v":""}]
[{"$f":"IF(OR(B69=\"\",B69=0),\"\",ROWS($A$1:A69))","v":""}]
[{"$f":"IF(OR(B70=\"\",B70=0),\"\",ROWS($A$1:A70))","v":""}]
[{"$f":"IF(OR(B71=\"\",B71=0),\"\",ROWS($A$1:A71))","v":""}]
[{"$f":"IF(OR(B72=\"\",B72=0),\"\",ROWS($A$1:A72))","v":""}]
[{"$f":"IF(OR(B73=\"\",B73=0),\"\",ROWS($A$1:A73))","v":""}]
[{"$f":"IF(OR(B74=\"\",B74=0),\"\",ROWS($A$1:A74))","v":""}]
[{"$f":"IF(OR(B75=\"\",B75=0),\"\",ROWS($A$1:A75))","v":""}]
[{"$f":"IF(OR(B76=\"\",B76=0),\"\",ROWS($A$1:A76))","v":""}]
[{"$f":"IF(OR(B77=\"\",B77=0),\"\",ROWS($A$1:A77))","v":""}]
[{"$f":"IF(OR(B78=\"\",B78=0),\"\",ROWS($A$1:A78))","v":""}]
[{"$f":"IF(OR(B79=\"\",B79=0),\"\",ROWS($A$1:A79))","v":""}]
[{"$f":"IF(OR(B80=\"\",B80=0),\"\",ROWS($A$1:A80))","v":""}]
[{"$f":"IF(OR(B81=\"\",B81=0),\"\",ROWS($A$1:A81))","v":""}]
[{"$f":"IF(OR(B82=\"\",B82=0),\"\",ROWS($A$1:A82))","v":""}]
[{"$f":"IF(OR(B83=\"\",B83=0),\"\",ROWS($A$1:A83))","v":""}]
[{"$f":"IF(OR(B84=\"\",B84=0),\"\",ROWS($A$1:A84))","v":""}]
[{"$f":"IF(OR(B85=\"\",B85=0),\"\",ROWS($A$1:A85))","v":""}]
[{"$f":"IF(OR(B86=\"\",B86=0),\"\",ROWS($A$1:A86))","v":""}]
[{"$f":"IF(OR(B87=\"\",B87=0),\"\",ROWS($A$1:A87))","v":""}]
[{"$f":"IF(OR(B88=\"\",B88=0),\"\",ROWS($A$1:A88))","v":""}]
[{"$f":"IF(OR(B89=\"\",B89=0),\"\",ROWS($A$1:A89))","v":""}]
[{"$f":"IF(OR(B90=\"\",B90=0),\"\",ROWS($A$1:A90))","v":""}]
[{"$f":"IF(OR(B91=\"\",B91=0),\"\",ROWS($A$1:A91))","v":""}]
[{"$f":"IF(OR(B92=\"\",B92=0),\"\",ROWS($A$1:A92))","v":""}]
[{"$f":"IF(OR(B93=\"\",B93=0),\"\",ROWS($A$1:A93))","v":""}]
[{"$f":"IF(OR(B94=\"\",B94=0),\"\",ROWS($A$1:A94))","v":""}]
[{"$f":"IF(OR(B95=\"\",B95=0),\"\",ROWS($A$1:A95))","v":""}]
[{"$f":"IF(OR(B96=\"\",B96=0),\"\",ROWS($A$1:A96))","v":""}]
[{"$f":"IF(OR(B97=\"\",B97=0),\"\",ROWS($A$1:A97))","v":""}]
[{"$f":"IF(OR(B98=\"\",B98=0),\"\",ROWS($A$1:A98))","v":""}]
[{"$f":"IF(OR(B99=\"\",B99=0),\"\",ROWS($A$1:A99))","v":""}]
[{"$f":"IF(OR(B100=\"\",B100=0),\"\",ROWS($A$1:A100))","v":""}]
[{"$f":"IF(OR(B101=\"\",B101=0),\"\",ROWS($A$1:A101))","v":""}]
[{"$f":"IF(OR(B102=\"\",B102=0),\"\",ROWS($A$1:A102))","v":""}]
[{"$f":"IF(OR(B103=\"\",B103=0),\"\",ROWS($A$1:A103))","v":""}]
[{"$f":"IF(OR(B104=\"\",B104=0),\"\",ROWS($A$1:A104))","v":""}]
[{"$f":"IF(OR(B105=\"\",B105=0),\"\",ROWS($A$1:A105))","v":""}]
[{"$f":"IF(OR(B106=\"\",B106=0),\"\",ROWS($A$1:A106))","v":""}]
[{"$f":"IF(OR(B107=\"\",B107=0),\"\",ROWS($A$1:A107))","v":""}]
[{"$f":"IF(OR(B108=\"\",B108=0),\"\",ROWS($A$1:A108))","v":""}]
[{"$f":"IF(OR(B109=\"\",B109=0),\"\",ROWS($A$1:A109))","v":""}]
[{"$f":"IF(OR(B110=\"\",B110=0),\"\",ROWS($A$1:A110))","v":""}]
[{"$f":"IF(OR(B111=\"\",B111=0),\"\",ROWS($A$1:A111))","v":""}]
[{"$f":"IF(OR(B112=\"\",B112=0),\"\",ROWS($A$1:A112))","v":""}]
[{"$f":"IF(OR(B113=\"\",B113=0),\"\",ROWS($A$1:A113))","v":""}]
[{"$f":"IF(OR(B114=\"\",B114=0),\"\",ROWS($A$1:A114))","v":""}]
[{"$f":"IF(OR(B115=\"\",B115=0),\"\",ROWS($A$1:A115))","v":""}]

{"sheet":"Data for Summary","index":11,"n_rows":103,"n_cols":10,"rows_kept":103,"hidden":true}
[]
[null,"Column Set","Chemical","Quantity Imported","Transaction Type","Intended Use",{"$nulls":3},"Chem List"]
[null,1,{"$f":"IF(ISBLANK('Section 2'!F16),\"\",'Section 2'!F16)","v":""},{"$f":"IF($C3=\"\",\"\",'Section 2'!G16)","v":""},{"$f":"IF($C3=\"\",\"\",'Section 2'!L16)","v":""},{"$f":"IF($C3=\"\",\"\",'Section 2'!M16)","v":""},null,null,{"$f":"IF(COUNTIF($C$3:$C$103,J3)>0,1,0)","v":0},"CH3Br"]
[null,1,{"$f":"IF(ISBLANK('Section 2'!F17),\"\",'Section 2'!F17)","v":""},{"$f":"IF($C4=\"\",\"\",'Section 2'!G17)","v":""},{"$f":"IF($C4=\"\",\"\",'Section 2'!L17)","v":""},{"$f":"IF($C4=\"\",\"\",'Section 2'!M17)","v":""}]
[null,1,{"$f":"IF(ISBLANK('Section 2'!F18),\"\",'Section 2'!F18)","v":""},{"$f":"IF($C5=\"\",\"\",'Section 2'!G18)","v":""},{"$f":"IF($C5=\"\",\"\",'Section 2'!L18)","v":""},{"$f":"IF($C5=\"\",\"\",'Section 2'!M18)","v":""}]
[null,1,{"$f":"IF(ISBLANK('Section 2'!F19),\"\",'Section 2'!F19)","v":""},{"$f":"IF($C6=\"\",\"\",'Section 2'!G19)","v":""},{"$f":"IF($C6=\"\",\"\",'Section 2'!L19)","v":""},{"$f":"IF($C6=\"\",\"\",'Section 2'!M19)","v":""}]
[null,1,{"$f":"IF(ISBLANK('Section 2'!F20),\"\",'Section 2'!F20)","v":""},{"$f":"IF($C7=\"\",\"\",'Section 2'!G20)","v":""},{"$f":"IF($C7=\"\",\"\",'Section 2'!L20)","v":""},{"$f":"IF($C7=\"\",\"\",'Section 2'!M20)","v":""}]
[null,1,{"$f":"IF(ISBLANK('Section 2'!F21),\"\",'Section 2'!F21)","v":""},{"$f":"IF($C8=\"\",\"\",'Section 2'!G21)","v":""},{"$f":"IF($C8=\"\",\"\",'Section 2'!L21)","v":""},{"$f":"IF($C8=\"\",\"\",'Section 2'!M21)","v":""}]
[null,1,{"$f":"IF(ISBLANK('Section 2'!F22),\"\",'Section 2'!F22)","v":""},{"$f":"IF($C9=\"\",\"\",'Section 2'!G22)","v":""},{"$f":"IF($C9=\"\",\"\",'Section 2'!L22)","v":""},{"$f":"IF($C9=\"\",\"\",'Section 2'!M22)","v":""}]
[null,1,{"$f":"IF(ISBLANK('Section 2'!F23),\"\",'Section 2'!F23)","v":""},{"$f":"IF($C10=\"\",\"\",'Section 2'!G23)","v":""},{"$f":"IF($C10=\"\",\"\",'Section 2'!L23)","v":""},{"$f":"IF($C10=\"\",\"\",'Section 2'!M23)","v":""}]
[null,1,{"$f":"IF(ISBLANK('Section 2'!F24),\"\",'Section 2'!F24)","v":""},{"$f":"IF($C11=\"\",\"\",'Section 2'!G24)","v":""},{"$f":"IF($C11=\"\",\"\",'Section 2'!L24)","v":""},{"$f":"IF($C11=\"\",\"\",'Section 2'!M24)","v":""}]
[null,1,{"$f":"IF(ISBLANK('Section 2'!F25),\"\",'Section 2'!F25)","v":""},{"$f":"IF($C12=\"\",\"\",'Section 2'!G25)","v":""},{"$f":"IF($C12=\"\",\"\",'Section 2'!L25)","v":""},{"$f":"IF($C12=\"\",\"\",'Section 2'!M25)","v":""}]
[null,1,{"$f":"IF(ISBLANK('Section 2'!F26),\"\",'Section 2'!F26)","v":""},{"$f":"IF($C13=\"\",\"\",'Section 2'!G26)","v":""},{"$f":"IF($C13=\"\",\"\",'Section 2'!L26)","v":""},{"$f":"IF($C13=\"\",\"\",'Section 2'!M26)","v":""}]
[null,1,{"$f":"IF(ISBLANK('Section 2'!F27),\"\",'Section 2'!F27)","v":""},{"$f":"IF($C14=\"\",\"\",'Section 2'!G27)","v":""},{"$f":"IF($C14=\"\",\"\",'Section 2'!L27)","v":""},{"$f":"IF($C14=\"\",\"\",'Section 2'!M27)","v":""}]
[null,1,{"$f":"IF(ISBLANK('Section 2'!F28),\"\",'Section 2'!F28)","v":""},{"$f":"IF($C15=\"\",\"\",'Section 2'!G28)","v":""},{"$f":"IF($C15=\"\",\"\",'Section 2'!L28)","v":""},{"$f":"IF($C15=\"\",\"\",'Section 2'!M28)","v":""}]
[null,1,{"$f":"IF(ISBLANK('Section 2'!F29),\"\",'Section 2'!F29)","v":""},{"$f":"IF($C16=\"\",\"\",'Section 2'!G29)","v":""},{"$f":"IF($C16=\"\",\"\",'Section 2'!L29)","v":""},{"$f":"IF($C16=\"\",\"\",'Section 2'!M29)","v":""}]
[null,1,{"$f":"IF(ISBLANK('Section 2'!F30),\"\",'Section 2'!F30)","v":""},{"$f":"IF($C17=\"\",\"\",'Section 2'!G30)","v":""},{"$f":"IF($C17=\"\",\"\",'Section 2'!L30)","v":""},{"$f":"IF($C17=\"\",\"\",'Section 2'!M30)","v":""}]
[null,1,{"$f":"IF(ISBLANK('Section 2'!F31),\"\",'Section 2'!F31)","v":""},{"$f":"IF($C18=\"\",\"\",'Section 2'!G31)","v":""},{"$f":"IF($C18=\"\",\"\",'Section 2'!L31)","v":""},{"$f":"IF($C18=\"\",\"\",'Section 2'!M31)","v":""}]
[null,1,{"$f":"IF(ISBLANK('Section 2'!F32),\"\",'Section 2'!F32)","v":""},{"$f":"IF($C19=\"\",\"\",'Section 2'!G32)","v":""},{"$f":"IF($C19=\"\",\"\",'Section 2'!L32)","v":""},{"$f":"IF($C19=\"\",\"\",'Section 2'!M32)","v":""}]
[null,1,{"$f":"IF(ISBLANK('Section 2'!F33),\"\",'Section 2'!F33)","v":""},{"$f":"IF($C20=\"\",\"\",'Section 2'!G33)","v":""},{"$f":"IF($C20=\"\",\"\",'Section 2'!L33)","v":""},{"$f":"IF($C20=\"\",\"\",'Section 2'!M33)","v":""}]
[null,1,{"$f":"IF(ISBLANK('Section 2'!F34),\"\",'Section 2'!F34)","v":""},{"$f":"IF($C21=\"\",\"\",'Section 2'!G34)","v":""},{"$f":"IF($C21=\"\",\"\",'Section 2'!L34)","v":""},{"$f":"IF($C21=\"\",\"\",'Section 2'!M34)","v":""}]
[null,1,{"$f":"IF(ISBLANK('Section 2'!F35),\"\",'Section 2'!F35)","v":""},{"$f":"IF($C22=\"\",\"\",'Section 2'!G35)","v":""},{"$f":"IF($C22=\"\",\"\",'Section 2'!L35)","v":""},{"$f":"IF($C22=\"\",\"\",'Section 2'!M35)","v":""}]
[null,1,{"$f":"IF(ISBLANK('Section 2'!F36),\"\",'Section 2'!F36)","v":""},{"$f":"IF($C23=\"\",\"\",'Section 2'!G36)","v":""},{"$f":"IF($C23=\"\",\"\",'Section 2'!L36)","v":""},{"$f":"IF($C23=\"\",\"\",'Section 2'!M36)","v":""}]
[null,1,{"$f":"IF(ISBLANK('Section 2'!F37),\"\",'Section 2'!F37)","v":""},{"$f":"IF($C24=\"\",\"\",'Section 2'!G37)","v":""},{"$f":"IF($C24=\"\",\"\",'Section 2'!L37)","v":""},{"$f":"IF($C24=\"\",\"\",'Section 2'!M37)","v":""}]
[null,1,{"$f":"IF(ISBLANK('Section 2'!F38),\"\",'Section 2'!F38)","v":""},{"$f":"IF($C25=\"\",\"\",'Section 2'!G38)","v":""},{"$f":"IF($C25=\"\",\"\",'Section 2'!L38)","v":""},{"$f":"IF($C25=\"\",\"\",'Section 2'!M38)","v":""}]
[null,1,{"$f":"IF(ISBLANK('Section 2'!F39),\"\",'Section 2'!F39)","v":""},{"$f":"IF($C26=\"\",\"\",'Section 2'!G39)","v":""},{"$f":"IF($C26=\"\",\"\",'Section 2'!L39)","v":""},{"$f":"IF($C26=\"\",\"\",'Section 2'!M39)","v":""}]
[null,1,{"$f":"IF(ISBLANK('Section 2'!F40),\"\",'Section 2'!F40)","v":""},{"$f":"IF($C27=\"\",\"\",'Section 2'!G40)","v":""},{"$f":"IF($C27=\"\",\"\",'Section 2'!L40)","v":""},{"$f":"IF($C27=\"\",\"\",'Section 2'!M40)","v":""}]
[null,1,{"$f":"IF(ISBLANK('Section 2'!F41),\"\",'Section 2'!F41)","v":""},{"$f":"IF($C28=\"\",\"\",'Section 2'!G41)","v":""},{"$f":"IF($C28=\"\",\"\",'Section 2'!L41)","v":""},{"$f":"IF($C28=\"\",\"\",'Section 2'!M41)","v":""}]
[null,1,{"$f":"IF(ISBLANK('Section 2'!F42),\"\",'Section 2'!F42)","v":""},{"$f":"IF($C29=\"\",\"\",'Section 2'!G42)","v":""},{"$f":"IF($C29=\"\",\"\",'Section 2'!L42)","v":""},{"$f":"IF($C29=\"\",\"\",'Section 2'!M42)","v":""}]
[null,1,{"$f":"IF(ISBLANK('Section 2'!F43),\"\",'Section 2'!F43)","v":""},{"$f":"IF($C30=\"\",\"\",'Section 2'!G43)","v":""},{"$f":"IF($C30=\"\",\"\",'Section 2'!L43)","v":""},{"$f":"IF($C30=\"\",\"\",'Section 2'!M43)","v":""}]
[null,1,{"$f":"IF(ISBLANK('Section 2'!F44),\"\",'Section 2'!F44)","v":""},{"$f":"IF($C31=\"\",\"\",'Section 2'!G44)","v":""},{"$f":"IF($C31=\"\",\"\",'Section 2'!L44)","v":""},{"$f":"IF($C31=\"\",\"\",'Section 2'!M44)","v":""}]
[null,1,{"$f":"IF(ISBLANK('Section 2'!F45),\"\",'Section 2'!F45)","v":""},{"$f":"IF($C32=\"\",\"\",'Section 2'!G45)","v":""},{"$f":"IF($C32=\"\",\"\",'Section 2'!L45)","v":""},{"$f":"IF($C32=\"\",\"\",'Section 2'!M45)","v":""}]
[null,1,{"$f":"IF(ISBLANK('Section 2'!F46),\"\",'Section 2'!F46)","v":""},{"$f":"IF($C33=\"\",\"\",'Section 2'!G46)","v":""},{"$f":"IF($C33=\"\",\"\",'Section 2'!L46)","v":""},{"$f":"IF($C33=\"\",\"\",'Section 2'!M46)","v":""}]
[null,1,{"$f":"IF(ISBLANK('Section 2'!F47),\"\",'Section 2'!F47)","v":""},{"$f":"IF($C34=\"\",\"\",'Section 2'!G47)","v":""},{"$f":"IF($C34=\"\",\"\",'Section 2'!L47)","v":""},{"$f":"IF($C34=\"\",\"\",'Section 2'!M47)","v":""}]
[null,1,{"$f":"IF(ISBLANK('Section 2'!F48),\"\",'Section 2'!F48)","v":""},{"$f":"IF($C35=\"\",\"\",'Section 2'!G48)","v":""},{"$f":"IF($C35=\"\",\"\",'Section 2'!L48)","v":""},{"$f":"IF($C35=\"\",\"\",'Section 2'!M48)","v":""}]
[null,1,{"$f":"IF(ISBLANK('Section 2'!F49),\"\",'Section 2'!F49)","v":""},{"$f":"IF($C36=\"\",\"\",'Section 2'!G49)","v":""},{"$f":"IF($C36=\"\",\"\",'Section 2'!L49)","v":""},{"$f":"IF($C36=\"\",\"\",'Section 2'!M49)","v":""}]
[null,1,{"$f":"IF(ISBLANK('Section 2'!F50),\"\",'Section 2'!F50)","v":""},{"$f":"IF($C37=\"\",\"\",'Section 2'!G50)","v":""},{"$f":"IF($C37=\"\",\"\",'Section 2'!L50)","v":""},{"$f":"IF($C37=\"\",\"\",'Section 2'!M50)","v":""}]
[null,1,{"$f":"IF(ISBLANK('Section 2'!F51),\"\",'Section 2'!F51)","v":""},{"$f":"IF($C38=\"\",\"\",'Section 2'!G51)","v":""},{"$f":"IF($C38=\"\",\"\",'Section 2'!L51)","v":""},{"$f":"IF($C38=\"\",\"\",'Section 2'!M51)","v":""}]
[null,1,{"$f":"IF(ISBLANK('Section 2'!F52),\"\",'Section 2'!F52)","v":""},{"$f":"IF($C39=\"\",\"\",'Section 2'!G52)","v":""},{"$f":"IF($C39=\"\",\"\",'Section 2'!L52)","v":""},{"$f":"IF($C39=\"\",\"\",'Section 2'!M52)","v":""}]
[null,1,{"$f":"IF(ISBLANK('Section 2'!F53),\"\",'Section 2'!F53)","v":""},{"$f":"IF($C40=\"\",\"\",'Section 2'!G53)","v":""},{"$f":"IF($C40=\"\",\"\",'Section 2'!L53)","v":""},{"$f":"IF($C40=\"\",\"\",'Section 2'!M53)","v":""}]
[null,1,{"$f":"IF(ISBLANK('Section 2'!F54),\"\",'Section 2'!F54)","v":""},{"$f":"IF($C41=\"\",\"\",'Section 2'!G54)","v":""},{"$f":"IF($C41=\"\",\"\",'Section 2'!L54)","v":""},{"$f":"IF($C41=\"\",\"\",'Section 2'!M54)","v":""}]
[null,1,{"$f":"IF(ISBLANK('Section 2'!F55),\"\",'Section 2'!F55)","v":""},{"$f":"IF($C42=\"\",\"\",'Section 2'!G55)","v":""},{"$f":"IF($C42=\"\",\"\",'Section 2'!L55)","v":""},{"$f":"IF($C42=\"\",\"\",'Section 2'!M55)","v":""}]
[null,1,{"$f":"IF(ISBLANK('Section 2'!F56),\"\",'Section 2'!F56)","v":""},{"$f":"IF($C43=\"\",\"\",'Section 2'!G56)","v":""},{"$f":"IF($C43=\"\",\"\",'Section 2'!L56)","v":""},{"$f":"IF($C43=\"\",\"\",'Section 2'!M56)","v":""}]
[null,1,{"$f":"IF(ISBLANK('Section 2'!F57),\"\",'Section 2'!F57)","v":""},{"$f":"IF($C44=\"\",\"\",'Section 2'!G57)","v":""},{"$f":"IF($C44=\"\",\"\",'Section 2'!L57)","v":""},{"$f":"IF($C44=\"\",\"\",'Section 2'!M57)","v":""}]
[null,1,{"$f":"IF(ISBLANK('Section 2'!F58),\"\",'Section 2'!F58)","v":""},{"$f":"IF($C45=\"\",\"\",'Section 2'!G58)","v":""},{"$f":"IF($C45=\"\",\"\",'Section 2'!L58)","v":""},{"$f":"IF($C45=\"\",\"\",'Section 2'!M58)","v":""}]
[null,1,{"$f":"IF(ISBLANK('Section 2'!F59),\"\",'Section 2'!F59)","v":""},{"$f":"IF($C46=\"\",\"\",'Section 2'!G59)","v":""},{"$f":"IF($C46=\"\",\"\",'Section 2'!L59)","v":""},{"$f":"IF($C46=\"\",\"\",'Section 2'!M59)","v":""}]
[null,1,{"$f":"IF(ISBLANK('Section 2'!F60),\"\",'Section 2'!F60)","v":""},{"$f":"IF($C47=\"\",\"\",'Section 2'!G60)","v":""},{"$f":"IF($C47=\"\",\"\",'Section 2'!L60)","v":""},{"$f":"IF($C47=\"\",\"\",'Section 2'!M60)","v":""}]
[null,1,{"$f":"IF(ISBLANK('Section 2'!F61),\"\",'Section 2'!F61)","v":""},{"$f":"IF($C48=\"\",\"\",'Section 2'!G61)","v":""},{"$f":"IF($C48=\"\",\"\",'Section 2'!L61)","v":""},{"$f":"IF($C48=\"\",\"\",'Section 2'!M61)","v":""}]
[null,1,{"$f":"IF(ISBLANK('Section 2'!F62),\"\",'Section 2'!F62)","v":""},{"$f":"IF($C49=\"\",\"\",'Section 2'!G62)","v":""},{"$f":"IF($C49=\"\",\"\",'Section 2'!L62)","v":""},{"$f":"IF($C49=\"\",\"\",'Section 2'!M62)","v":""}]
[null,1,{"$f":"IF(ISBLANK('Section 2'!F63),\"\",'Section 2'!F63)","v":""},{"$f":"IF($C50=\"\",\"\",'Section 2'!G63)","v":""},{"$f":"IF($C50=\"\",\"\",'Section 2'!L63)","v":""},{"$f":"IF($C50=\"\",\"\",'Section 2'!M63)","v":""}]
[null,1,{"$f":"IF(ISBLANK('Section 2'!F64),\"\",'Section 2'!F64)","v":""},{"$f":"IF($C51=\"\",\"\",'Section 2'!G64)","v":""},{"$f":"IF($C51=\"\",\"\",'Section 2'!L64)","v":""},{"$f":"IF($C51=\"\",\"\",'Section 2'!M64)","v":""}]
[null,1,{"$f":"IF(ISBLANK('Section 2'!F65),\"\",'Section 2'!F65)","v":""},{"$f":"IF($C52=\"\",\"\",'Section 2'!G65)","v":""},{"$f":"IF($C52=\"\",\"\",'Section 2'!L65)","v":""},{"$f":"IF($C52=\"\",\"\",'Section 2'!M65)","v":""}]
[null,1,{"$f":"IF(ISBLANK('Section 2'!F66),\"\",'Section 2'!F66)","v":""},{"$f":"IF($C53=\"\",\"\",'Section 2'!G66)","v":""},{"$f":"IF($C53=\"\",\"\",'Section 2'!L66)","v":""},{"$f":"IF($C53=\"\",\"\",'Section 2'!M66)","v":""}]
[null,1,{"$f":"IF(ISBLANK('Section 2'!F67),\"\",'Section 2'!F67)","v":""},{"$f":"IF($C54=\"\",\"\",'Section 2'!G67)","v":""},{"$f":"IF($C54=\"\",\"\",'Section 2'!L67)","v":""},{"$f":"IF($C54=\"\",\"\",'Section 2'!M67)","v":""}]
[null,1,{"$f":"IF(ISBLANK('Section 2'!F68),\"\",'Section 2'!F68)","v":""},{"$f":"IF($C55=\"\",\"\",'Section 2'!G68)","v":""},{"$f":"IF($C55=\"\",\"\",'Section 2'!L68)","v":""},{"$f":"IF($C55=\"\",\"\",'Section 2'!M68)","v":""}]
[null,1,{"$f":"IF(ISBLANK('Section 2'!F69),\"\",'Section 2'!F69)","v":""},{"$f":"IF($C56=\"\",\"\",'Section 2'!G69)","v":""},{"$f":"IF($C56=\"\",\"\",'Section 2'!L69)","v":""},{"$f":"IF($C56=\"\",\"\",'Section 2'!M69)","v":""}]
[null,1,{"$f":"IF(ISBLANK('Section 2'!F70),\"\",'Section 2'!F70)","v":""},{"$f":"IF($C57=\"\",\"\",'Section 2'!G70)","v":""},{"$f":"IF($C57=\"\",\"\",'Section 2'!L70)","v":""},{"$f":"IF($C57=\"\",\"\",'Section 2'!M70)","v":""}]
[null,1,{"$f":"IF(ISBLANK('Section 2'!F71),\"\",'Section 2'!F71)","v":""},{"$f":"IF($C58=\"\",\"\",'Section 2'!G71)","v":""},{"$f":"IF($C58=\"\",\"\",'Section 2'!L71)","v":""},{"$f":"IF($C58=\"\",\"\",'Section 2'!M71)","v":""}]
[null,1,{"$f":"IF(ISBLANK('Section 2'!F72),\"\",'Section 2'!F72)","v":""},{"$f":"IF($C59=\"\",\"\",'Section 2'!G72)","v":""},{"$f":"IF($C59=\"\",\"\",'Section 2'!L72)","v":""},{"$f":"IF($C59=\"\",\"\",'Section 2'!M72)","v":""}]
[null,1,{"$f":"IF(ISBLANK('Section 2'!F73),\"\",'Section 2'!F73)","v":""},{"$f":"IF($C60=\"\",\"\",'Section 2'!G73)","v":""},{"$f":"IF($C60=\"\",\"\",'Section 2'!L73)","v":""},{"$f":"IF($C60=\"\",\"\",'Section 2'!M73)","v":""}]
[null,1,{"$f":"IF(ISBLANK('Section 2'!F74),\"\",'Section 2'!F74)","v":""},{"$f":"IF($C61=\"\",\"\",'Section 2'!G74)","v":""},{"$f":"IF($C61=\"\",\"\",'Section 2'!L74)","v":""},{"$f":"IF($C61=\"\",\"\",'Section 2'!M74)","v":""}]
[null,1,{"$f":"IF(ISBLANK('Section 2'!F75),\"\",'Section 2'!F75)","v":""},{"$f":"IF($C62=\"\",\"\",'Section 2'!G75)","v":""},{"$f":"IF($C62=\"\",\"\",'Section 2'!L75)","v":""},{"$f":"IF($C62=\"\",\"\",'Section 2'!M75)","v":""}]
[null,1,{"$f":"IF(ISBLANK('Section 2'!F76),\"\",'Section 2'!F76)","v":""},{"$f":"IF($C63=\"\",\"\",'Section 2'!G76)","v":""},{"$f":"IF($C63=\"\",\"\",'Section 2'!L76)","v":""},{"$f":"IF($C63=\"\",\"\",'Section 2'!M76)","v":""}]
[null,1,{"$f":"IF(ISBLANK('Section 2'!F77),\"\",'Section 2'!F77)","v":""},{"$f":"IF($C64=\"\",\"\",'Section 2'!G77)","v":""},{"$f":"IF($C64=\"\",\"\",'Section 2'!L77)","v":""},{"$f":"IF($C64=\"\",\"\",'Section 2'!M77)","v":""}]
[null,1,{"$f":"IF(ISBLANK('Section 2'!F78),\"\",'Section 2'!F78)","v":""},{"$f":"IF($C65=\"\",\"\",'Section 2'!G78)","v":""},{"$f":"IF($C65=\"\",\"\",'Section 2'!L78)","v":""},{"$f":"IF($C65=\"\",\"\",'Section 2'!M78)","v":""}]
[null,1,{"$f":"IF(ISBLANK('Section 2'!F79),\"\",'Section 2'!F79)","v":""},{"$f":"IF($C66=\"\",\"\",'Section 2'!G79)","v":""},{"$f":"IF($C66=\"\",\"\",'Section 2'!L79)","v":""},{"$f":"IF($C66=\"\",\"\",'Section 2'!M79)","v":""}]
[null,1,{"$f":"IF(ISBLANK('Section 2'!F80),\"\",'Section 2'!F80)","v":""},{"$f":"IF($C67=\"\",\"\",'Section 2'!G80)","v":""},{"$f":"IF($C67=\"\",\"\",'Section 2'!L80)","v":""},{"$f":"IF($C67=\"\",\"\",'Section 2'!M80)","v":""}]
[null,1,{"$f":"IF(ISBLANK('Section 2'!F81),\"\",'Section 2'!F81)","v":""},{"$f":"IF($C68=\"\",\"\",'Section 2'!G81)","v":""},{"$f":"IF($C68=\"\",\"\",'Section 2'!L81)","v":""},{"$f":"IF($C68=\"\",\"\",'Section 2'!M81)","v":""}]
[null,1,{"$f":"IF(ISBLANK('Section 2'!F82),\"\",'Section 2'!F82)","v":""},{"$f":"IF($C69=\"\",\"\",'Section 2'!G82)","v":""},{"$f":"IF($C69=\"\",\"\",'Section 2'!L82)","v":""},{"$f":"IF($C69=\"\",\"\",'Section 2'!M82)","v":""}]
[null,1,{"$f":"IF(ISBLANK('Section 2'!F83),\"\",'Section 2'!F83)","v":""},{"$f":"IF($C70=\"\",\"\",'Section 2'!G83)","v":""},{"$f":"IF($C70=\"\",\"\",'Section 2'!L83)","v":""},{"$f":"IF($C70=\"\",\"\",'Section 2'!M83)","v":""}]
[null,1,{"$f":"IF(ISBLANK('Section 2'!F84),\"\",'Section 2'!F84)","v":""},{"$f":"IF($C71=\"\",\"\",'Section 2'!G84)","v":""},{"$f":"IF($C71=\"\",\"\",'Section 2'!L84)","v":""},{"$f":"IF($C71=\"\",\"\",'Section 2'!M84)","v":""}]
[null,1,{"$f":"IF(ISBLANK('Section 2'!F85),\"\",'Section 2'!F85)","v":""},{"$f":"IF($C72=\"\",\"\",'Section 2'!G85)","v":""},{"$f":"IF($C72=\"\",\"\",'Section 2'!L85)","v":""},{"$f":"IF($C72=\"\",\"\",'Section 2'!M85)","v":""}]
[null,1,{"$f":"IF(ISBLANK('Section 2'!F86),\"\",'Section 2'!F86)","v":""},{"$f":"IF($C73=\"\",\"\",'Section 2'!G86)","v":""},{"$f":"IF($C73=\"\",\"\",'Section 2'!L86)","v":""},{"$f":"IF($C73=\"\",\"\",'Section 2'!M86)","v":""}]
[null,1,{"$f":"IF(ISBLANK('Section 2'!F87),\"\",'Section 2'!F87)","v":""},{"$f":"IF($C74=\"\",\"\",'Section 2'!G87)","v":""},{"$f":"IF($C74=\"\",\"\",'Section 2'!L87)","v":""},{"$f":"IF($C74=\"\",\"\",'Section 2'!M87)","v":""}]
[null,1,{"$f":"IF(ISBLANK('Section 2'!F88),\"\",'Section 2'!F88)","v":""},{"$f":"IF($C75=\"\",\"\",'Section 2'!G88)","v":""},{"$f":"IF($C75=\"\",\"\",'Section 2'!L88)","v":""},{"$f":"IF($C75=\"\",\"\",'Section 2'!M88)","v":""}]
[null,1,{"$f":"IF(ISBLANK('Section 2'!F89),\"\",'Section 2'!F89)","v":""},{"$f":"IF($C76=\"\",\"\",'Section 2'!G89)","v":""},{"$f":"IF($C76=\"\",\"\",'Section 2'!L89)","v":""},{"$f":"IF($C76=\"\",\"\",'Section 2'!M89)","v":""}]
[null,1,{"$f":"IF(ISBLANK('Section 2'!F90),\"\",'Section 2'!F90)","v":""},{"$f":"IF($C77=\"\",\"\",'Section 2'!G90)","v":""},{"$f":"IF($C77=\"\",\"\",'Section 2'!L90)","v":""},{"$f":"IF($C77=\"\",\"\",'Section 2'!M90)","v":""}]
[null,1,{"$f":"IF(ISBLANK('Section 2'!F91),\"\",'Section 2'!F91)","v":""},{"$f":"IF($C78=\"\",\"\",'Section 2'!G91)","v":""},{"$f":"IF($C78=\"\",\"\",'Section 2'!L91)","v":""},{"$f":"IF($C78=\"\",\"\",'Section 2'!M91)","v":""}]
[null,1,{"$f":"IF(ISBLANK('Section 2'!F92),\"\",'Section 2'!F92)","v":""},{"$f":"IF($C79=\"\",\"\",'Section 2'!G92)","v":""},{"$f":"IF($C79=\"\",\"\",'Section 2'!L92)","v":""},{"$f":"IF($C79=\"\",\"\",'Section 2'!M92)","v":""}]
[null,1,{"$f":"IF(ISBLANK('Section 2'!F93),\"\",'Section 2'!F93)","v":""},{"$f":"IF($C80=\"\",\"\",'Section 2'!G93)","v":""},{"$f":"IF($C80=\"\",\"\",'Section 2'!L93)","v":""},{"$f":"IF($C80=\"\",\"\",'Section 2'!M93)","v":""}]
[null,1,{"$f":"IF(ISBLANK('Section 2'!F94),\"\",'Section 2'!F94)","v":""},{"$f":"IF($C81=\"\",\"\",'Section 2'!G94)","v":""},{"$f":"IF($C81=\"\",\"\",'Section 2'!L94)","v":""},{"$f":"IF($C81=\"\",\"\",'Section 2'!M94)","v":""}]
[null,1,{"$f":"IF(ISBLANK('Section 2'!F95),\"\",'Section 2'!F95)","v":""},{"$f":"IF($C82=\"\",\"\",'Section 2'!G95)","v":""},{"$f":"IF($C82=\"\",\"\",'Section 2'!L95)","v":""},{"$f":"IF($C82=\"\",\"\",'Section 2'!M95)","v":""}]
[null,1,{"$f":"IF(ISBLANK('Section 2'!F96),\"\",'Section 2'!F96)","v":""},{"$f":"IF($C83=\"\",\"\",'Section 2'!G96)","v":""},{"$f":"IF($C83=\"\",\"\",'Section 2'!L96)","v":""},{"$f":"IF($C83=\"\",\"\",'Section 2'!M96)","v":""}]
[null,1,{"$f":"IF(ISBLANK('Section 2'!F97),\"\",'Section 2'!F97)","v":""},{"$f":"IF($C84=\"\",\"\",'Section 2'!G97)","v":""},{"$f":"IF($C84=\"\",\"\",'Section 2'!L97)","v":""},{"$f":"IF($C84=\"\",\"\",'Section 2'!M97)","v":""}]
[null,1,{"$f":"IF(ISBLANK('Section 2'!F98),\"\",'Section 2'!F98)","v":""},{"$f":"IF($C85=\"\",\"\",'Section 2'!G98)","v":""},{"$f":"IF($C85=\"\",\"\",'Section 2'!L98)","v":""},{"$f":"IF($C85=\"\",\"\",'Section 2'!M98)","v":""}]
[null,1,{"$f":"IF(ISBLANK('Section 2'!F99),\"\",'Section 2'!F99)","v":""},{"$f":"IF($C86=\"\",\"\",'Section 2'!G99)","v":""},{"$f":"IF($C86=\"\",\"\",'Section 2'!L99)","v":""},{"$f":"IF($C86=\"\",\"\",'Section 2'!M99)","v":""}]
[null,1,{"$f":"IF(ISBLANK('Section 2'!F100),\"\",'Section 2'!F100)","v":""},{"$f":"IF($C87=\"\",\"\",'Section 2'!G100)","v":""},{"$f":"IF($C87=\"\",\"\",'Section 2'!L100)","v":""},{"$f":"IF($C87=\"\",\"\",'Section 2'!M100)","v":""}]
[null,1,{"$f":"IF(ISBLANK('Section 2'!F101),\"\",'Section 2'!F101)","v":""},{"$f":"IF($C88=\"\",\"\",'Section 2'!G101)","v":""},{"$f":"IF($C88=\"\",\"\",'Section 2'!L101)","v":""},{"$f":"IF($C88=\"\",\"\",'Section 2'!M101)","v":""}]
[null,1,{"$f":"IF(ISBLANK('Section 2'!F102),\"\",'Section 2'!F102)","v":""},{"$f":"IF($C89=\"\",\"\",'Section 2'!G102)","v":""},{"$f":"IF($C89=\"\",\"\",'Section 2'!L102)","v":""},{"$f":"IF($C89=\"\",\"\",'Section 2'!M102)","v":""}]
[null,1,{"$f":"IF(ISBLANK('Section 2'!F103),\"\",'Section 2'!F103)","v":""},{"$f":"IF($C90=\"\",\"\",'Section 2'!G103)","v":""},{"$f":"IF($C90=\"\",\"\",'Section 2'!L103)","v":""},{"$f":"IF($C90=\"\",\"\",'Section 2'!M103)","v":""}]
[null,1,{"$f":"IF(ISBLANK('Section 2'!F104),\"\",'Section 2'!F104)","v":""},{"$f":"IF($C91=\"\",\"\",'Section 2'!G104)","v":""},{"$f":"IF($C91=\"\",\"\",'Section 2'!L104)","v":""},{"$f":"IF($C91=\"\",\"\",'Section 2'!M104)","v":""}]
[null,1,{"$f":"IF(ISBLANK('Section 2'!F105),\"\",'Section 2'!F105)","v":""},{"$f":"IF($C92=\"\",\"\",'Section 2'!G105)","v":""},{"$f":"IF($C92=\"\",\"\",'Section 2'!L105)","v":""},{"$f":"IF($C92=\"\",\"\",'Section 2'!M105)","v":""}]
[null,1,{"$f":"IF(ISBLANK('Section 2'!F106),\"\",'Section 2'!F106)","v":""},{"$f":"IF($C93=\"\",\"\",'Section 2'!G106)","v":""},{"$f":"IF($C93=\"\",\"\",'Section 2'!L106)","v":""},{"$f":"IF($C93=\"\",\"\",'Section 2'!M106)","v":""}]
[null,1,{"$f":"IF(ISBLANK('Section 2'!F107),\"\",'Section 2'!F107)","v":""},{"$f":"IF($C94=\"\",\"\",'Section 2'!G107)","v":""},{"$f":"IF($C94=\"\",\"\",'Section 2'!L107)","v":""},{"$f":"IF($C94=\"\",\"\",'Section 2'!M107)","v":""}]
[null,1,{"$f":"IF(ISBLANK('Section 2'!F108),\"\",'Section 2'!F108)","v":""},{"$f":"IF($C95=\"\",\"\",'Section 2'!G108)","v":""},{"$f":"IF($C95=\"\",\"\",'Section 2'!L108)","v":""},{"$f":"IF($C95=\"\",\"\",'Section 2'!M108)","v":""}]
[null,1,{"$f":"IF(ISBLANK('Section 2'!F109),\"\",'Section 2'!F109)","v":""},{"$f":"IF($C96=\"\",\"\",'Section 2'!G109)","v":""},{"$f":"IF($C96=\"\",\"\",'Section 2'!L109)","v":""},{"$f":"IF($C96=\"\",\"\",'Section 2'!M109)","v":""}]
[null,1,{"$f":"IF(ISBLANK('Section 2'!F110),\"\",'Section 2'!F110)","v":""},{"$f":"IF($C97=\"\",\"\",'Section 2'!G110)","v":""},{"$f":"IF($C97=\"\",\"\",'Section 2'!L110)","v":""},{"$f":"IF($C97=\"\",\"\",'Section 2'!M110)","v":""}]
[null,1,{"$f":"IF(ISBLANK('Section 2'!F111),\"\",'Section 2'!F111)","v":""},{"$f":"IF($C98=\"\",\"\",'Section 2'!G111)","v":""},{"$f":"IF($C98=\"\",\"\",'Section 2'!L111)","v":""},{"$f":"IF($C98=\"\",\"\",'Section 2'!M111)","v":""}]
[null,1,{"$f":"IF(ISBLANK('Section 2'!F112),\"\",'Section 2'!F112)","v":""},{"$f":"IF($C99=\"\",\"\",'Section 2'!G112)","v":""},{"$f":"IF($C99=\"\",\"\",'Section 2'!L112)","v":""},{"$f":"IF($C99=\"\",\"\",'Section 2'!M112)","v":""}]
[null,1,{"$f":"IF(ISBLANK('Section 2'!F113),\"\",'Section 2'!F113)","v":""},{"$f":"IF($C100=\"\",\"\",'Section 2'!G113)","v":""},{"$f":"IF($C100=\"\",\"\",'Section 2'!L113)","v":""},{"$f":"IF($C100=\"\",\"\",'Section 2'!M113)","v":""}]
[null,1,{"$f":"IF(ISBLANK('Section 2'!F114),\"\",'Section 2'!F114)","v":""},{"$f":"IF($C101=\"\",\"\",'Section 2'!G114)","v":""},{"$f":"IF($C101=\"\",\"\",'Section 2'!L114)","v":""},{"$f":"IF($C101=\"\",\"\",'Section 2'!M114)","v":""}]
[null,1,{"$f":"IF(ISBLANK('Section 2'!F115),\"\",'Section 2'!F115)","v":""},{"$f":"IF($C102=\"\",\"\",'Section 2'!G115)","v":""},{"$f":"IF($C102=\"\",\"\",'Section 2'!L115)","v":""},{"$f":"IF($C102=\"\",\"\",'Section 2'!M115)","v":""}]
[null,1,{"$f":"IF(ISBLANK('Section 2'!F115),\"\",'Section 2'!F115)","v":""},{"$f":"IF($C103=\"\",\"\",'Section 2'!G115)","v":""},{"$f":"IF($C103=\"\",\"\",'Section 2'!L115)","v":""},{"$f":"IF($C103=\"\",\"\",'Section 2'!M115)","v":""}]