{"text_format":"3","workbook":"xlsx","n_sheets":12,"sheets":["Instructions","Section 1","Section 2","Section 3","Section 4","Summary","Reference List","Lists","Checks","OutputForCSV","TempOutput","Data for Summary"],"not_rendered":{"macros":1,"defined_names":64,"comments":8},"read":"whole","date_system":"1900"}

{"sheet":"Instructions","index":0,"n_rows":21,"n_cols":3,"rows_kept":21}
[]
[null,null,"U.S. Environmental Protection Agency"]
[null,null,"Stratospheric Ozone Protection Program"]
[]
[null,null,"Methyl Bromide Importer Quarterly Report (Sec 82.13)"]
[null,null,"Version 1.0 "]
[null,null,"Last Updated: December 2017"]
[]
{"$rows_left_out":14}
{"sheet":"Section 1","index":1,"n_rows":16,"n_cols":9,"rows_kept":16,"merged":[[7,2,7,3]]}
[]
[null,null,"U.S. Environmental Protection Agency"]
[null,null,"Methyl Bromide Importer Quarterly Report"]
[]
[null,null,"   Date Prepared:",{"$f":"TODAY()","v":"2017-12-06"}]
[]
[null,null,"Section 1: Report Identification Information "]
[null,null,"Complete all fields below.  No fields may be left blank."]
{"$rows_left_out":9}
{"sheet":"Section 2","index":2,"n_rows":312,"n_cols":28,"rows_kept":312,"merged":[[6,2,6,3],[7,2,7,3],[10,2,10,12],[11,2,11,9]]}
[{"$nulls":10},"ImporterCol"]
[{"$nulls":10},{"$f":"IF('Section 1'!D13=0,\"\",'Section 1'!D13)","v":""}]
[]
[null,null,"U.S. Environmental Protection Agency"]
[null,null,"Methyl Bromide Importer Quarterly Report"]
[]
[null,null,"Company Name:",null,{"$f":"IF('Section 1'!D9=0,\"\",'Section 1'!D9)","v":""}]
[null,null,"Reporting Period:",null,{"$f":"IF(OR('Section 1'!D11=0,'Section 1'!D12=0),\"\",\"Quarter \"&'Section 1'!D12&\", \"&'Section 1'!D11)","v":""}]
{"$rows_left_out":305}
{"sheet":"Section 3","index":3,"n_rows":32,"n_cols":17,"rows_kept":32,"merged":[[8,3,8,6],[9,3,9,6],[10,3,10,6],[11,3,11,4],[12,3,12,4],[13,3,13,4],[14,3,14,4],[15,3,15,4],[16,3,16,4],[17,3,17,4],[18,3,18,4],[19,3,19,4],[20,3,20,4],[21,3,21,4],[22,3,22,4],[23,3,23,4]]}
[]
[{"$nulls":3},"U.S. Environmental Protection Agency"]
[{"$nulls":3},"Methyl Bromide Importer Quarterly Report"]
[]
[{"$nulls":3},"Company Name:",{"$f":"IF('Section 1'!D9=0,\"\",'Section 1'!D9)","v":""}]
[{"$nulls":3},"Reporting Period:",{"$f":"IF(OR('Section 1'!D11=0,'Section 1'!D12=0),\"\",\"Quarter \"&'Section 1'!D12&\", \"&'Section 1'!D11)","v":""}]
[]
[{"$nulls":3},"Section 3: Shipment/Sales Data"]
{"$rows_left_out":25}
{"sheet":"Section 4","index":4,"n_rows":17,"n_cols":13,"rows_kept":17,"hidden":true,"merged":[[8,3,8,7],[11,3,11,7],[12,3,12,4],[13,3,13,4],[14,3,14,4],[15,3,15,4],[16,3,16,4]]}
[]
[{"$nulls":3},"U.S. Environmental Protection Agency"]
[{"$nulls":3},"Methyl Bromide Importer Quarterly Report"]
[]
[{"$nulls":3},"Company Name:",{"$f":"IF('Section 1'!D9=0,\"\",'Section 1'!D9)","v":""}]
[{"$nulls":3},"Reporting Period:",{"$f":"IF(OR('Section 1'!D11=0,'Section 1'!D12=0),\"\",\"Quarter \"&'Section 1'!D12&\", \"&'Section 1'!D11)","v":""}]
[]
[{"$nulls":3},"Section 4: Importers Critical Use Year-End Inventory (Quarter 4 Only)"]
{"$rows_left_out":10}
{"sheet":"Summary","index":5,"n_rows":18,"n_cols":15,"rows_kept":18,"merged":[[8,3,8,14],[9,3,10,3],[9,4,9,13],[9,14,10,14],[14,3,14,7],[15,3,16,3],[15,4,15,7],[16,4,16,5],[16,6,16,7],[17,4,17,5],[17,6,17,7]]}
[]
[{"$nulls":3},"U.S. Environmental Protection Agency"]
[{"$nulls":3},"Methyl Bromide Importer Quarterly Report"]
[]
[{"$nulls":3},"Company Name:",{"$f":"IF('Section 1'!D9=0,\"\",'Section 1'!D9)","v":""}]
[{"$nulls":3},"Reporting Period:",{"$f":"IF(OR('Section 1'!D11=0,'Section 1'!D12=0),\"\",\"Quarter \"&'Section 1'!D12&\", \"&'Section 1'!D11)","v":""}]
[]
[{"$nulls":3},"Import Totals"]
{"$rows_left_out":11}
{"sheet":"Reference List","index":6,"n_rows":78,"n_cols":10,"rows_kept":78,"merged":[[5,2,5,9],[6,2,6,5],[6,7,6,9],[8,2,8,3],[8,7,8,9],[11,2,12,5],[14,2,14,5],[18,2,18,5],[21,2,24,4],[26,2,26,4],[27,3,27,4],[28,3,28,4],[51,9,52,9],[64,9,65,9],[71,8,72,8]]}
[]
[null,null,"U.S. Environmental Protection Agency"]
[null,null,"Methyl Bromide Importer Quarterly Report"]
[null,null,"Reference List"]
[]
[null,null,"Copying and Pasting Data: If data is pasted into this reporting form from another spreadsheet, the formatting of specific cells must be consistent with the requirements of the form in order to be accepted into EPA’s ODS tracking system. When copying and pasting data into the form, please ensure consistency with the formatting of the lists provided below."]
[null,null,"Transaction Type List: The table below lists the valid transaction types that may be used when entering data into Section 2 of this form. ",{"$nulls":4},"Country List: The table below lists the valid country names that may be used when entering data into Section 2 of this form. "]
[]
{"$rows_left_out":71}
{"sheet":"Lists","index":7,"n_rows":203,"n_cols":19,"rows_kept":203,"hidden":true,"merged":[[0,14,0,15]]}
[{"$nulls":14},"FOR REFERENCE ONLY",null,null,"Variables for Data Submission"]
[null,"Country List","Submission Type","Reporting Year","Reporting Quarter","Quarter Start Month","Date Range","MeBr Purpose","MeBr Transaction Type","MeBr Intended Uses_New ","Intended Uses_Heels ","Date for CSV Title","Form Name for CSV Title",null,"Form Type","Form Code",null,null,"Row #"]
[null,"Afghanistan","Original Submission",2018,1,1,{"$f":"IF(SUM('Section 1'!$F$11:$F$12)>0,DATE(2018,1,1),DATE('Section 1'!$D$11,VLOOKUP('Section 1'!D12,Lists!$E$3:$F$6,2,0),1))","v":"2018-01-01"},"Global Lab","New","New","Heels",{"$f":"MONTH('Section 1'!D5)&\"-\"&DAY('Section 1'!D5)&\"-\"&YEAR('Section 1'!D5)","v":"12-6-2017"},"MeBr Importer",null,"Class I Producer","PROD1",null,"Sec2End",{"$f":"IF(MAX(OutputForCSV!A2:A101)=0,1,MAX(OutputForCSV!A2:A101))","v":1}]
[null,"Albania","Re-Submittal",2019,2,4,{"$f":"IF(SUM('Section 1'!$F$11:$F$12)>0,DATE(2030,1,1),IF('Section 1'!D12=4,DATE('Section 1'!D11+1,1,1)-1,DATE('Section 1'!$D$11,VLOOKUP('Section 1'!$D$12,Lists!$E$3:$F$6,2,0)+3,1)-1))","v":"2030-01-01"},"QPS","Heels","MeBrNewIntendedUses","HeelsIntendedUses",{"$nulls":3},"MeBr Producer","PROD3",null,"Sec3Start",{"$f":"OutputForCSV!A102","v":""}]
[null,"Algeria",null,2020,3,7,null,"Transformation",null,"In-House Trans","Future Shipment",{"$nulls":3},"Class II Producer","PROD2",null,"Sec3End",{"$f":"MAX(OutputForCSV!A102:A111)","v":0}]
[null,"Andorra",null,null,4,10,null,"Destruction",null,"2nd Party Trans","Transformation",{"$nulls":3},"Class I Importer","IMPT1",null,"Sec4Start",{"$f":"OutputForCSV!A112","v":""}]
[null,"Angola",{"$nulls":5},"Emergency Use",null,"In-House Dest","Destruction",{"$nulls":3},"MeBr Importer","IMPT3",null,"Sec4End",{"$f":"MAX(OutputForCSV!A112:A115)","v":0}]
[null,"Antigua and Barbuda",{"$nulls":7},"2nd Party Dest","Non-Emissive Use ",{"$nulls":3},"Class II Importer","IMPT2",null,"MaxTempRow",{"$f":"IF(MAX(TempOutput!A2:A115)=0,1,MAX(TempOutput!A2:A115))","v":1}]
{"$rows_left_out":196}
{"sheet":"Checks","index":8,"n_rows":30,"n_cols":5,"rows_kept":30,"hidden":true}
[]
[null,"Section","Check Description","Status (1 = Incomplete, 0 = Complete)","Check Type"]
[null,"Section 1","All",{"$f":"IF(SUM('Section 1'!F9:F13)>0,1,0)","v":1},"Error"]
[null,"Section 2","Date Range Check",{"$f":"IF(SUM('Section 2'!S16:S115)>0,1,0)","v":0},"Stopper"]
[null,"Section 2","Complete?",{"$f":"IF(SUM('Section 2'!T16:T115)>0,1,0)","v":0},"Stopper"]
[null,"Section 2","Valid Country",{"$f":"IF(SUM('Section 2'!U16:U115)>0,1,0)","v":0},"Stopper"]
[null,"Section 2","Valid Transaction Type",{"$f":"IF(SUM('Section 2'!AA16:AA115)>0,1,0)","v":0},"Stopper"]
[null,"Section 2","Valid Intended Use",{"$f":"IF(SUM('Section 2'!AB16:AB115)>0,1,0)","v":0},"Stopper"]
{"$rows_left_out":23}
{"sheet":"OutputForCSV","index":9,"n_rows":116,"n_cols":21,"rows_kept":116,"hidden":true}
["Row #","Entry",1,"IMPT3","1",{"$f":"'Section 1'!D5","v":"2017-12-06"},{"$f":"'Section 1'!D9","v":0},{"$f":"'Section 1'!D10","v":0},{"$f":"'Section 1'!D11","v":0},{"$f":"'Section 1'!D12","v":0},{"$f":"'Section 1'!D13","v":0},{"$nulls":9},"LastColumn"]
[{"$f":"IF(D2=\"\",\"\",ROWS($A$1:A2))","v":""},1,{"$f":"IF(D2=\"\",\"\",2)","v":""},{"$f":"IFERROR(VLOOKUP($B2,'Section 2'!$C$16:$M$115,COLUMNS('Section 2'!$C$13:C$13),0),\"\")","v":""},{"$f":"IF($D2=\"\",\"\",IF(ISBLANK(VLOOKUP($B2,'Section 2'!$C$16:$M$115,COLUMNS('Section 2'!$C$13:D$13),0)),\"\",VLOOKUP($B2,'Section 2'!$C$16:$M$115,COLUMNS('Section 2'!$C$13:D$13),0)))","v":""},{"$f":"IF($D2=\"\",\"\",IF(ISBLANK(VLOOKUP($B2,'Section 2'!$C$16:$M$115,COLUMNS('Section 2'!$C$13:E$13),0)),\"\",VLOOKUP($B2,'Section 2'!$C$16:$M$115,COLUMNS('Section 2'!$C$13:E$13),0)))","v":""},{"$f":"IF($D2=\"\",\"\",IF(ISBLANK(VLOOKUP($B2,'Section 2'!$C$16:$M$115,COLUMNS('Section 2'!$C$13:F$13),0)),\"\",VLOOKUP($B2,'Section 2'!$C$16:$M$115,COLUMNS('Section 2'!$C$13:F$13),0)))","v":""},{"$f":"IF($D2=\"\",\"\",IF(ISBLANK(VLOOKUP($B2,'Section 2'!$C$16:$M$115,COLUMNS('Section 2'!$C$13:G$13),0)),\"\",VLOOKUP($B2,'Section 2'!$C$16:$M$115,COLUMNS('Section 2'!$C$13:G$13),0)))","v":""},{"$f":"IF($D2=\"\",\"\",IF(ISBLANK(VLOOKUP($B2,'Section 2'!$C$16:$M$115,COLUMNS('Section 2'!$C$13:H$13),0)),\"\",VLOOKUP($B2,'Section 2'!$C$16:$M$115,COLUMNS('Section 2'!$C$13:H$13),0)))","v":""},{"$f":"IF($D2=\"\",\"\",IF(ISBLANK(VLOOKUP($B2,'Section 2'!$C$16:$M$115,COLUMNS('Section 2'!$C$13:I$13),0)),\"\",VLOOKUP($B2,'Section 2'!$C$16:$M$115,COLUMNS('Section 2'!$C$13:I$13),0)))","v":""},{"$f":"IF($D2=\"\",\"\",IF(ISBLANK(VLOOKUP($B2,'Section 2'!$C$16:$M$115,COLUMNS('Section 2'!$C$13:J$13),0)),\"\",VLOOKUP($B2,'Section 2'!$C$16:$M$115,COLUMNS('Section 2'!$C$13:J$13),0)))","v":""},{"$f":"IF($D2=\"\",\"\",IF(ISBLANK(VLOOKUP($B2,'Section 2'!$C$16:$M$115,COLUMNS('Section 2'!$C$13:K$13),0)),\"\",VLOOKUP($B2,'Section 2'!$C$16:$M$115,COLUMNS('Section 2'!$C$13:K$13),0)))","v":""},{"$f":"IF($D2=\"\",\"\",IF(ISBLANK(VLOOKUP($B2,'Section 2'!$C$16:$M$115,COLUMNS('Section 2'!$C$13:L$13),0)),\"\",VLOOKUP($B2,'Section 2'!$C$16:$M$115,COLUMNS('Section 2'!$C$13:L$13),0)))","v":""},{"$f":"IF($D2=\"\",\"\",IF(ISBLANK(VLOOKUP($B2,'Section 2'!$C$16:$M$115,COLUMNS('Section 2'!$C$13:M$13),0)),\"\",VLOOKUP($B2,'Section 2'!$C$16:$M$115,COLUMNS('Section 2'!$C$13:M$13),0)))","v":""}]
[{"$f":"IF(D3=\"\",\"\",ROWS($A$1:A3))","v":""},2,{"$f":"IF(D3=\"\",\"\",2)","v":""},{"$f":"IFERROR(VLOOKUP($B3,'Section 2'!$C$16:$M$115,COLUMNS('Section 2'!$C$13:C$13),0),\"\")","v":""},{"$f":"IF($D3=\"\",\"\",IF(ISBLANK(VLOOKUP($B3,'Section 2'!$C$16:$M$115,COLUMNS('Section 2'!$C$13:D$13),0)),\"\",VLOOKUP($B3,'Section 2'!$C$16:$M$115,COLUMNS('Section 2'!$C$13:D$13),0)))","v":""},{"$f":"IF($D3=\"\",\"\",IF(ISBLANK(VLOOKUP($B3,'Section 2'!$C$16:$M$115,COLUMNS('Section 2'!$C$13:E$13),0)),\"\",VLOOKUP($B3,'Section 2'!$C$16:$M$115,COLUMNS('Section 2'!$C$13:E$13),0)))","v":""},{"$f":"IF($D3=\"\",\"\",IF(ISBLANK(VLOOKUP($B3,'Section 2'!$C$16:$M$115,COLUMNS('Section 2'!$C$13:F$13),0)),\"\",VLOOKUP($B3,'Section 2'!$C$16:$M$115,COLUMNS('Section 2'!$C$13:F$13),0)))","v":""},{"$f":"IF($D3=\"\",\"\",IF(ISBLANK(VLOOKUP($B3,'Section 2'!$C$16:$M$115,COLUMNS('Section 2'!$C$13:G$13),0)),\"\",VLOOKUP($B3,'Section 2'!$C$16:$M$115,COLUMNS('Section 2'!$C$13:G$13),0)))","v":""},{"$f":"IF($D3=\"\",\"\",IF(ISBLANK(VLOOKUP($B3,'Section 2'!$C$16:$M$115,COLUMNS('Section 2'!$C$13:H$13),0)),\"\",VLOOKUP($B3,'Section 2'!$C$16:$M$115,COLUMNS('Section 2'!$C$13:H$13),0)))","v":""},{"$f":"IF($D3=\"\",\"\",IF(ISBLANK(VLOOKUP($B3,'Section 2'!$C$16:$M$115,COLUMNS('Section 2'!$C$13:I$13),0)),\"\",VLOOKUP($B3,'Section 2'!$C$16:$M$115,COLUMNS('Section 2'!$C$13:I$13),0)))","v":""},{"$f":"IF($D3=\"\",\"\",IF(ISBLANK(VLOOKUP($B3,'Section 2'!$C$16:$M$115,COLUMNS('Section 2'!$C$13:J$13),0)),\"\",VLOOKUP($B3,'Section 2'!$C$16:$M$115,COLUMNS('Section 2'!$C$13:J$13),0)))","v":""},{"$f":"IF($D3=\"\",\"\",IF(ISBLANK(VLOOKUP($B3,'Section 2'!$C$16:$M$115,COLUMNS('Section 2'!$C$13:K$13),0)),\"\",VLOOKUP($B3,'Section 2'!$C$16:$M$115,COLUMNS('Section 2'!$C$13:K$13),0)))","v":""},{"$f":"IF($D3=\"\",\"\",IF(ISBLANK(VLOOKUP($B3,'Section 2'!$C$16:$M$115,COLUMNS('Section 2'!$C$13:L$13),0)),\"\",VLOOKUP($B3,'Section 2'!$C$16:$M$115,COLUMNS('Section 2'!$C$13:L$13),0)))","v":""},{"$f":"IF($D3=\"\",\"\",IF(ISBLANK(VLOOKUP($B3,'Section 2'!$C$16:$M$115,COLUMNS('Section 2'!$C$13:M$13),0)),\"\",VLOOKUP($B3,'Section 2'!$C$16:$M$115,COLUMNS('Section 2'!$C$13:M$13),0)))","v":""}]
[{"$f":"IF(D4=\"\",\"\",ROWS($A$1:A4))","v":""},3,"",{"$f":"IFERROR(VLOOKUP($B4,'Section 2'!$C$16:$M$115,COLUMNS('Section 2'!$C$13:C$13),0),\"\")","v":""},{"$f":"IF($D4=\"\",\"\",IF(ISBLANK(VLOOKUP($B4,'Section 2'!$C$16:$M$115,COLUMNS('Section 2'!$C$13:D$13),0)),\"\",VLOOKUP($B4,'Section 2'!$C$16:$M$115,COLUMNS('Section 2'!$C$13:D$13),0)))","v":""},{"$f":"IF($D4=\"\",\"\",IF(ISBLANK(VLOOKUP($B4,'Section 2'!$C$16:$M$115,COLUMNS('Section 2'!$C$13:E$13),0)),\"\",VLOOKUP($B4,'Section 2'!$C$16:$M$115,COLUMNS('Section 2'!$C$13:E$13),0)))","v":""},{"$f":"IF($D4=\"\",\"\",IF(ISBLANK(VLOOKUP($B4,'Section 2'!$C$16:$M$115,COLUMNS('Section 2'!$C$13:F$13),0)),\"\",VLOOKUP($B4,'Section 2'!$C$16:$M$115,COLUMNS('Section 2'!$C$13:F$13),0)))","v":""},{"$f":"IF($D4=\"\",\"\",IF(ISBLANK(VLOOKUP($B4,'Section 2'!$C$16:$M$115,COLUMNS('Section 2'!$C$13:G$13),0)),\"\",VLOOKUP($B4,'Section 2'!$C$16:$M$115,COLUMNS('Section 2'!$C$13:G$13),0)))","v":""},{"$f":"IF($D4=\"\",\"\",IF(ISBLANK(VLOOKUP($B4,'Section 2'!$C$16:$M$115,COLUMNS('Section 2'!$C$13:H$13),0)),\"\",VLOOKUP($B4,'Section 2'!$C$16:$M$115,COLUMNS('Section 2'!$C$13:H$13),0)))","v":""},{"$f":"IF($D4=\"\",\"\",IF(ISBLANK(VLOOKUP($B4,'Section 2'!$C$16:$M$115,COLUMNS('Section 2'!$C$13:I$13),0)),\"\",VLOOKUP($B4,'Section 2'!$C$16:$M$115,COLUMNS('Section 2'!$C$13:I$13),0)))","v":""},{"$f":"IF($D4=\"\",\"\",IF(ISBLANK(VLOOKUP($B4,'Section 2'!$C$16:$M$115,COLUMNS('Section 2'!$C$13:J$13),0)),\"\",VLOOKUP($B4,'Section 2'!$C$16:$M$115,COLUMNS('Section 2'!$C$13:J$13),0)))","v":""},{"$f":"IF($D4=\"\",\"\",IF(ISBLANK(VLOOKUP($B4,'Section 2'!$C$16:$M$115,COLUMNS('Section 2'!$C$13:K$13),0)),\"\",VLOOKUP($B4,'Section 2'!$C$16:$M$115,COLUMNS('Section 2'!$C$13:K$13),0)))","v":""},{"$f":"IF($D4=\"\",\"\",IF(ISBLANK(VLOOKUP($B4,'Section 2'!$C$16:$M$115,COLUMNS('Section 2'!$C$13:L$13),0)),\"\",VLOOKUP($B4,'Section 2'!$C$16:$M$115,COLUMNS('Section 2'!$C$13:L$13),0)))","v":""},{"$f":"IF($D4=\"\",\"\",IF(ISBLANK(VLOOKUP($B4,'Section 2'!$C$16:$M$115,COLUMNS('Section 2'!$C$13:M$13),0)),\"\",VLOOKUP($B4,'Section 2'!$C$16:$M$115,COLUMNS('Section 2'!$C$13:M$13),0)))","v":""}]
[{"$f":"IF(D5=\"\",\"\",ROWS($A$1:A5))","v":""},4,"",{"$f":"IFERROR(VLOOKUP($B5,'Section 2'!$C$16:$M$115,COLUMNS('Section 2'!$C$13:C$13),0),\"\")","v":""},{"$f":"IF($D5=\"\",\"\",IF(ISBLANK(VLOOKUP($B5,'Section 2'!$C$16:$M$115,COLUMNS('Section 2'!$C$13:D$13),0)),\"\",VLOOKUP($B5,'Section 2'!$C$16:$M$115,COLUMNS('Section 2'!$C$13:D$13),0)))","v":""},{"$f":"IF($D5=\"\",\"\",IF(ISBLANK(VLOOKUP($B5,'Section 2'!$C$16:$M$115,COLUMNS('Section 2'!$C$13:E$13),0)),\"\",VLOOKUP($B5,'Section 2'!$C$16:$M$115,COLUMNS('Section 2'!$C$13:E$13),0)))","v":""},{"$f":"IF($D5=\"\",\"\",IF(ISBLANK(VLOOKUP($B5,'Section 2'!$C$16:$M$115,COLUMNS('Section 2'!$C$13:F$13),0)),\"\",VLOOKUP($B5,'Section 2'!$C$16:$M$115,COLUMNS('Section 2'!$C$13:F$13),0)))","v":""},{"$f":"IF($D5=\"\",\"\",IF(ISBLANK(VLOOKUP($B5,'Section 2'!$C$16:$M$115,COLUMNS('Section 2'!$C$13:G$13),0)),\"\",VLOOKUP($B5,'Section 2'!$C$16:$M$115,COLUMNS('Section 2'!$C$13:G$13),0)))","v":""},{"$f":"IF($D5=\"\",\"\",IF(ISBLANK(VLOOKUP($B5,'Section 2'!$C$16:$M$115,COLUMNS('Section 2'!$C$13:H$13),0)),\"\",VLOOKUP($B5,'Section 2'!$C$16:$M$115,COLUMNS('Section 2'!$C$13:H$13),0)))","v":""},{"$f":"IF($D5=\"\",\"\",IF(ISBLANK(VLOOKUP($B5,'Section 2'!$C$16:$M$115,COLUMNS('Section 2'!$C$13:I$13),0)),\"\",VLOOKUP($B5,'Section 2'!$C$16:$M$115,COLUMNS('Section 2'!$C$13:I$13),0)))","v":""},{"$f":"IF($D5=\"\",\"\",IF(ISBLANK(VLOOKUP($B5,'Section 2'!$C$16:$M$115,COLUMNS('Section 2'!$C$13:J$13),0)),\"\",VLOOKUP($B5,'Section 2'!$C$16:$M$115,COLUMNS('Section 2'!$C$13:J$13),0)))","v":""},{"$f":"IF($D5=\"\",\"\",IF(ISBLANK(VLOOKUP($B5,'Section 2'!$C$16:$M$115,COLUMNS('Section 2'!$C$13:K$13),0)),\"\",VLOOKUP($B5,'Section 2'!$C$16:$M$115,COLUMNS('Section 2'!$C$13:K$13),0)))","v":""},{"$f":"IF($D5=\"\",\"\",IF(ISBLANK(VLOOKUP($B5,'Section 2'!$C$16:$M$115,COLUMNS('Section 2'!$C$13:L$13),0)),\"\",VLOOKUP($B5,'Section 2'!$C$16:$M$115,COLUMNS('Section 2'!$C$13:L$13),0)))","v":""},{"$f":"IF($D5=\"\",\"\",IF(ISBLANK(VLOOKUP($B5,'Section 2'!$C$16:$M$115,COLUMNS('Section 2'!$C$13:M$13),0)),\"\",VLOOKUP($B5,'Section 2'!$C$16:$M$115,COLUMNS('Section 2'!$C$13:M$13),0)))","v":""}]
[{"$f":"IF(D6=\"\",\"\",ROWS($A$1:A6))","v":""},5,"",{"$f":"IFERROR(VLOOKUP($B6,'Section 2'!$C$16:$M$115,COLUMNS('Section 2'!$C$13:C$13),0),\"\")","v":""},{"$f":"IF($D6=\"\",\"\",IF(ISBLANK(VLOOKUP($B6,'Section 2'!$C$16:$M$115,COLUMNS('Section 2'!$C$13:D$13),0)),\"\",VLOOKUP($B6,'Section 2'!$C$16:$M$115,COLUMNS('Section 2'!$C$13:D$13),0)))","v":""},{"$f":"IF($D6=\"\",\"\",IF(ISBLANK(VLOOKUP($B6,'Section 2'!$C$16:$M$115,COLUMNS('Section 2'!$C$13:E$13),0)),\"\",VLOOKUP($B6,'Section 2'!$C$16:$M$115,COLUMNS('Section 2'!$C$13:E$13),0)))","v":""},{"$f":"IF($D6=\"\",\"\",IF(ISBLANK(VLOOKUP($B6,'Section 2'!$C$16:$M$115,COLUMNS('Section 2'!$C$13:F$13),0)),\"\",VLOOKUP($B6,'Section 2'!$C$16:$M$115,COLUMNS('Section 2'!$C$13:F$13),0)))","v":""},{"$f":"IF($D6=\"\",\"\",IF(ISBLANK(VLOOKUP($B6,'Section 2'!$C$16:$M$115,COLUMNS('Section 2'!$C$13:G$13),0)),\"\",VLOOKUP($B6,'Section 2'!$C$16:$M$115,COLUMNS('Section 2'!$C$13:G$13),0)))","v":""},{"$f":"IF($D6=\"\",\"\",IF(ISBLANK(VLOOKUP($B6,'Section 2'!$C$16:$M$115,COLUMNS('Section 2'!$C$13:H$13),0)),\"\",VLOOKUP($B6,'Section 2'!$C$16:$M$115,COLUMNS('Section 2'!$C$13:H$13),0)))","v":""},{"$f":"IF($D6=\"\",\"\",IF(ISBLANK(VLOOKUP($B6,'Section 2'!$C$16:$M$115,COLUMNS('Section 2'!$C$13:I$13),0)),\"\",VLOOKUP($B6,'Section 2'!$C$16:$M$115,COLUMNS('Section 2'!$C$13:I$13),0)))","v":""},{"$f":"IF($D6=\"\",\"\",IF(ISBLANK(VLOOKUP($B6,'Section 2'!$C$16:$M$115,COLUMNS('Section 2'!$C$13:J$13),0)),\"\",VLOOKUP($B6,'Section 2'!$C$16:$M$115,COLUMNS('Section 2'!$C$13:J$13),0)))","v":""},{"$f":"IF($D6=\"\",\"\",IF(ISBLANK(VLOOKUP($B6,'Section 2'!$C$16:$M$115,COLUMNS('Section 2'!$C$13:K$13),0)),\"\",VLOOKUP($B6,'Section 2'!$C$16:$M$115,COLUMNS('Section 2'!$C$13:K$13),0)))","v":""},{"$f":"IF($D6=\"\",\"\",IF(ISBLANK(VLOOKUP($B6,'Section 2'!$C$16:$M$115,COLUMNS('Section 2'!$C$13:L$13),0)),\"\",VLOOKUP($B6,'Section 2'!$C$16:$M$115,COLUMNS('Section 2'!$C$13:L$13),0)))","v":""},{"$f":"IF($D6=\"\",\"\",IF(ISBLANK(VLOOKUP($B6,'Section 2'!$C$16:$M$115,COLUMNS('Section 2'!$C$13:M$13),0)),\"\",VLOOKUP($B6,'Section 2'!$C$16:$M$115,COLUMNS('Section 2'!$C$13:M$13),0)))","v":""}]
[{"$f":"IF(D7=\"\",\"\",ROWS($A$1:A7))","v":""},6,"",{"$f":"IFERROR(VLOOKUP($B7,'Section 2'!$C$16:$M$115,COLUMNS('Section 2'!$C$13:C$13),0),\"\")","v":""},{"$f":"IF($D7=\"\",\"\",IF(ISBLANK(VLOOKUP($B7,'Section 2'!$C$16:$M$115,COLUMNS('Section 2'!$C$13:D$13),0)),\"\",VLOOKUP($B7,'Section 2'!$C$16:$M$115,COLUMNS('Section 2'!$C$13:D$13),0)))","v":""},{"$f":"IF($D7=\"\",\"\",IF(ISBLANK(VLOOKUP($B7,'Section 2'!$C$16:$M$115,COLUMNS('Section 2'!$C$13:E$13),0)),\"\",VLOOKUP($B7,'Section 2'!$C$16:$M$115,COLUMNS('Section 2'!$C$13:E$13),0)))","v":""},{"$f":"IF($D7=\"\",\"\",IF(ISBLANK(VLOOKUP($B7,'Section 2'!$C$16:$M$115,COLUMNS('Section 2'!$C$13:F$13),0)),\"\",VLOOKUP($B7,'Section 2'!$C$16:$M$115,COLUMNS('Section 2'!$C$13:F$13),0)))","v":""},{"$f":"IF($D7=\"\",\"\",IF(ISBLANK(VLOOKUP($B7,'Section 2'!$C$16:$M$115,COLUMNS('Section 2'!$C$13:G$13),0)),\"\",VLOOKUP($B7,'Section 2'!$C$16:$M$115,COLUMNS('Section 2'!$C$13:G$13),0)))","v":""},{"$f":"IF($D7=\"\",\"\",IF(ISBLANK(VLOOKUP($B7,'Section 2'!$C$16:$M$115,COLUMNS('Section 2'!$C$13:H$13),0)),\"\",VLOOKUP($B7,'Section 2'!$C$16:$M$115,COLUMNS('Section 2'!$C$13:H$13),0)))","v":""},{"$f":"IF($D7=\"\",\"\",IF(ISBLANK(VLOOKUP($B7,'Section 2'!$C$16:$M$115,COLUMNS('Section 2'!$C$13:I$13),0)),\"\",VLOOKUP($B7,'Section 2'!$C$16:$M$115,COLUMNS('Section 2'!$C$13:I$13),0)))","v":""},{"$f":"IF($D7=\"\",\"\",IF(ISBLANK(VLOOKUP($B7,'Section 2'!$C$16:$M$115,COLUMNS('Section 2'!$C$13:J$13),0)),\"\",VLOOKUP($B7,'Section 2'!$C$16:$M$115,COLUMNS('Section 2'!$C$13:J$13),0)))","v":""},{"$f":"IF($D7=\"\",\"\",IF(ISBLANK(VLOOKUP($B7,'Section 2'!$C$16:$M$115,COLUMNS('Section 2'!$C$13:K$13),0)),\"\",VLOOKUP($B7,'Section 2'!$C$16:$M$115,COLUMNS('Section 2'!$C$13:K$13),0)))","v":""},{"$f":"IF($D7=\"\",\"\",IF(ISBLANK(VLOOKUP($B7,'Section 2'!$C$16:$M$115,COLUMNS('Section 2'!$C$13:L$13),0)),\"\",VLOOKUP($B7,'Section 2'!$C$16:$M$115,COLUMNS('Section 2'!$C$13:L$13),0)))","v":""},{"$f":"IF($D7=\"\",\"\",IF(ISBLANK(VLOOKUP($B7,'Section 2'!$C$16:$M$115,COLUMNS('Section 2'!$C$13:M$13),0)),\"\",VLOOKUP($B7,'Section 2'!$C$16:$M$115,COLUMNS('Section 2'!$C$13:M$13),0)))","v":""}]
[{"$f":"IF(D8=\"\",\"\",ROWS($A$1:A8))","v":""},7,"",{"$f":"IFERROR(VLOOKUP($B8,'Section 2'!$C$16:$M$115,COLUMNS('Section 2'!$C$13:C$13),0),\"\")","v":""},{"$f":"IF($D8=\"\",\"\",IF(ISBLANK(VLOOKUP($B8,'Section 2'!$C$16:$M$115,COLUMNS('Section 2'!$C$13:D$13),0)),\"\",VLOOKUP($B8,'Section 2'!$C$16:$M$115,COLUMNS('Section 2'!$C$13:D$13),0)))","v":""},{"$f":"IF($D8=\"\",\"\",IF(ISBLANK(VLOOKUP($B8,'Section 2'!$C$16:$M$115,COLUMNS('Section 2'!$C$13:E$13),0)),\"\",VLOOKUP($B8,'Section 2'!$C$16:$M$115,COLUMNS('Section 2'!$C$13:E$13),0)))","v":""},{"$f":"IF($D8=\"\",\"\",IF(ISBLANK(VLOOKUP($B8,'Section 2'!$C$16:$M$115,COLUMNS('Section 2'!$C$13:F$13),0)),\"\",VLOOKUP($B8,'Section 2'!$C$16:$M$115,COLUMNS('Section 2'!$C$13:F$13),0)))","v":""},{"$f":"IF($D8=\"\",\"\",IF(ISBLANK(VLOOKUP($B8,'Section 2'!$C$16:$M$115,COLUMNS('Section 2'!$C$13:G$13),0)),\"\",VLOOKUP($B8,'Section 2'!$C$16:$M$115,COLUMNS('Section 2'!$C$13:G$13),0)))","v":""},{"$f":"IF($D8=\"\",\"\",IF(ISBLANK(VLOOKUP($B8,'Section 2'!$C$16:$M$115,COLUMNS('Section 2'!$C$13:H$13),0)),\"\",VLOOKUP($B8,'Section 2'!$C$16:$M$115,COLUMNS('Section 2'!$C$13:H$13),0)))","v":""},{"$f":"IF($D8=\"\",\"\",IF(ISBLANK(VLOOKUP($B8,'Section 2'!$C$16:$M$115,COLUMNS('Section 2'!$C$13:I$13),0)),\"\",VLOOKUP($B8,'Section 2'!$C$16:$M$115,COLUMNS('Section 2'!$C$13:I$13),0)))","v":""},{"$f":"IF($D8=\"\",\"\",IF(ISBLANK(VLOOKUP($B8,'Section 2'!$C$16:$M$115,COLUMNS('Section 2'!$C$13:J$13),0)),\"\",VLOOKUP($B8,'Section 2'!$C$16:$M$115,COLUMNS('Section 2'!$C$13:J$13),0)))","v":""},{"$f":"IF($D8=\"\",\"\",IF(ISBLANK(VLOOKUP($B8,'Section 2'!$C$16:$M$115,COLUMNS('Section 2'!$C$13:K$13),0)),\"\",VLOOKUP($B8,'Section 2'!$C$16:$M$115,COLUMNS('Section 2'!$C$13:K$13),0)))","v":""},{"$f":"IF($D8=\"\",\"\",IF(ISBLANK(VLOOKUP($B8,'Section 2'!$C$16:$M$115,COLUMNS('Section 2'!$C$13:L$13),0)),\"\",VLOOKUP($B8,'Section 2'!$C$16:$M$115,COLUMNS('Section 2'!$C$13:L$13),0)))","v":""},{"$f":"IF($D8=\"\",\"\",IF(ISBLANK(VLOOKUP($B8,'Section 2'!$C$16:$M$115,COLUMNS('Section 2'!$C$13:M$13),0)),\"\",VLOOKUP($B8,'Section 2'!$C$16:$M$115,COLUMNS('Section 2'!$C$13:M$13),0)))","v":""}]
{"$rows_left_out":109}
{"sheet":"TempOutput","index":10,"n_rows":115,"n_cols":10,"rows_kept":115,"hidden":true}
["MaxRow",1,"IMPT3","1","2017-11-03","TEST ORG","Original Submission",2016,4,"222333444"]
[{"$f":"IF(OR(B2=\"\",B2=0),\"\",ROWS($A$1:A2))","v":""}]
[{"$f":"IF(OR(B3=\"\",B3=0),\"\",ROWS($A$1:A3))","v":""}]
[{"$f":"IF(OR(B4=\"\",B4=0),\"\",ROWS($A$1:A4))","v":""}]
[{"$f":"IF(OR(B5=\"\",B5=0),\"\",ROWS($A$1:A5))","v":""}]
[{"$f":"IF(OR(B6=\"\",B6=0),\"\",ROWS($A$1:A6))","v":""}]
[{"$f":"IF(OR(B7=\"\",B7=0),\"\",ROWS($A$1:A7))","v":""}]
[{"$f":"IF(OR(B8=\"\",B8=0),\"\",ROWS($A$1:A8))","v":""}]
{"$rows_left_out":108}
{"sheet":"Data for Summary","index":11,"n_rows":103,"n_cols":10,"rows_kept":103,"hidden":true}
[]
[null,"Column Set","Chemical","Quantity Imported","Transaction Type","Intended Use",{"$nulls":3},"Chem List"]
[null,1,{"$f":"IF(ISBLANK('Section 2'!F16),\"\",'Section 2'!F16)","v":""},{"$f":"IF($C3=\"\",\"\",'Section 2'!G16)","v":""},{"$f":"IF($C3=\"\",\"\",'Section 2'!L16)","v":""},{"$f":"IF($C3=\"\",\"\",'Section 2'!M16)","v":""},null,null,{"$f":"IF(COUNTIF($C$3:$C$103,J3)>0,1,0)","v":0},"CH3Br"]
[null,1,{"$f":"IF(ISBLANK('Section 2'!F17),\"\",'Section 2'!F17)","v":""},{"$f":"IF($C4=\"\",\"\",'Section 2'!G17)","v":""},{"$f":"IF($C4=\"\",\"\",'Section 2'!L17)","v":""},{"$f":"IF($C4=\"\",\"\",'Section 2'!M17)","v":""}]
[null,1,{"$f":"IF(ISBLANK('Section 2'!F18),\"\",'Section 2'!F18)","v":""},{"$f":"IF($C5=\"\",\"\",'Section 2'!G18)","v":""},{"$f":"IF($C5=\"\",\"\",'Section 2'!L18)","v":""},{"$f":"IF($C5=\"\",\"\",'Section 2'!M18)","v":""}]
[null,1,{"$f":"IF(ISBLANK('Section 2'!F19),\"\",'Section 2'!F19)","v":""},{"$f":"IF($C6=\"\",\"\",'Section 2'!G19)","v":""},{"$f":"IF($C6=\"\",\"\",'Section 2'!L19)","v":""},{"$f":"IF($C6=\"\",\"\",'Section 2'!M19)","v":""}]
[null,1,{"$f":"IF(ISBLANK('Section 2'!F20),\"\",'Section 2'!F20)","v":""},{"$f":"IF($C7=\"\",\"\",'Section 2'!G20)","v":""},{"$f":"IF($C7=\"\",\"\",'Section 2'!L20)","v":""},{"$f":"IF($C7=\"\",\"\",'Section 2'!M20)","v":""}]
[null,1,{"$f":"IF(ISBLANK('Section 2'!F21),\"\",'Section 2'!F21)","v":""},{"$f":"IF($C8=\"\",\"\",'Section 2'!G21)","v":""},{"$f":"IF($C8=\"\",\"\",'Section 2'!L21)","v":""},{"$f":"IF($C8=\"\",\"\",'Section 2'!M21)","v":""}]
{"$rows_left_out":95}