{"text_format":"3","workbook":"xlsx","n_sheets":8,"sheets":["Instructions","Section 1","Section 2","Summary","Reference List","Checks","Lists","OutputForCSV"],"not_rendered":{"macros":1,"defined_names":36,"comments":4},"read":"whole","date_system":"1900"}

{"sheet":"Instructions","index":0,"n_rows":21,"n_cols":3,"rows_kept":21}
[]
[null,null,"U.S. Environmental Protection Agency"]
[null,null,"Stratospheric Ozone Protection Program"]
[]
[null,null,"Class II Trades Report (Sec 82.23)"]
[null,null,"Version 1.0 "]
[null,null,"Last Updated: April 2018"]
[]
[null,null,"Instructions"]
[null,null,"Complete this form by filling in the data fields that are highlighted in blue.  Guidance on how to complete individual data fields are provided in comment bubbles. Use the arrows to navigate between the tabs. Once completed, use the 'prepare submission' button on the Summary tab to generate your CSV file.  "]
{"$rows_left_out":12}
{"sheet":"Section 1","index":1,"n_rows":14,"n_cols":9,"rows_kept":14,"merged":[[2,2,2,3],[7,2,7,3]]}
[]
[null,null,"U.S. Environmental Protection Agency"]
[null,null,"Class II Trades Report "]
[]
[null,null,"   Date Prepared:",{"$f":"TODAY()","v":"2018-05-22"}]
[]
[null,null,"Section 1: Transferor Identification Information "]
[null,null,"Complete all fields below.  No fields may be left blank."]
[null,null,"Company Name: ",null,null,{"$f":"IF(D9=0,1,0)","v":1}]
[null,null,"Submission Type:",null,null,{"$f":"IF(D10=0,1,0)","v":1}]
{"$rows_left_out":5}
{"sheet":"Section 2","index":2,"n_rows":234,"n_cols":24,"rows_kept":234,"merged":[[9,3,10,3],[9,4,10,4],[9,5,10,5],[9,6,10,6],[9,7,10,7],[9,8,10,8],[9,9,10,9],[9,10,10,10],[16,3,16,14],[17,3,18,3],[17,4,17,6],[17,7,17,9],[17,10,17,11],[17,12,17,14]]}
[]
[{"$nulls":3},"U.S. Environmental Protection Agency"]
[null,null,{"$f":"IFERROR(VLOOKUP($A3,'Section 2'!E$22:$O$31,COLUMNS('Section 2'!$D$18:D$19),0),\"\")","v":""},"Class II Trades Report "]
[]
[{"$nulls":3},"Company Name:",{"$f":"IF('Section 1'!D9=0,\"\",'Section 1'!D9)","v":""}]
[{"$nulls":3},"Reporting Period:",{"$f":"IF('Section 1'!D11=0,\"\",'Section 1'!D11)","v":""}]
[]
[{"$nulls":3},"Section 2: Transaction Data"]
[{"$nulls":3},"In the table below, enter the contact information for the recipient of the trade.  If reporting on an inter-pollutant, intra-company trade, enter your company's name as the transferee company; the other fields may be left blank. "]
[{"$nulls":3},"Transferee Company Name","Transferee Contact Name","Transferee Contact Phone Number","Transferee Street Address","Transferee City","Transferee State/Province","Transferee Country","Transferee Postal Code"]
{"$rows_left_out":225}
{"sheet":"Summary","index":3,"n_rows":18,"n_cols":7,"rows_kept":18,"merged":[[2,3,2,6],[8,3,8,6],[9,3,10,3],[9,4,9,6]]}
[]
[{"$nulls":3},"U.S. Environmental Protection Agency"]
[{"$nulls":3},"Class II Trades Report "]
[]
[{"$nulls":3},"Company Name:",{"$f":"IF('Section 1'!D9=0,\"\",'Section 1'!D9)","v":""}]
[{"$nulls":3},"Reporting Period:",{"$f":"IF('Section 1'!D11=0,\"\",'Section 1'!D11)","v":""}]
[]
[{"$nulls":3},"Allowance Summary"]
[{"$nulls":3},"The values in the table below are calculated based on data entered in Section 2.  If the totals appear to be incorrect, please return to Section 2 to review your data."]
[{"$nulls":3},"Chemical Name","Allowances Expended by Transferor (kg)"]
{"$rows_left_out":9}
{"sheet":"Reference List","index":4,"n_rows":78,"n_cols":9,"rows_kept":78,"merged":[[5,2,5,8],[6,2,6,4],[6,6,6,8],[8,2,8,4],[8,6,8,8],[13,2,14,4],[16,2,16,4],[51,8,52,8],[64,8,65,8],[71,7,72,7]]}
[]
[null,null,"U.S. Environmental Protection Agency"]
[null,null,"Class II Trades Report "]
[null,null,"Reference List"]
[]
[null,null,"Copying and Pasting Data: If data is pasted into this reporting form from another spreadsheet, the formatting of specific cells must be consistent with the requirements of the form in order to be accepted into EPA’s ODS tracking system. When copying and pasting data into the form, please ensure consistency with the formatting of the lists provided below."]
[null,null,"Chemical Name List: The table below lists the valid chemical names that may be used when entering data into Section 2 of this form. ",{"$nulls":3},"Country List: The table below lists the valid country names that may be used when entering data into Section 2 of this form. "]
[]
[null,null,"Class II Chemicals with Allowances",{"$nulls":3},"Source Country "]
[null,null,"HCFC-22 ","HCFC-123 ","HCFC-124",null,"Afghanistan","Greece","Papua New Guinea"]
{"$rows_left_out":69}
{"sheet":"Checks","index":5,"n_rows":16,"n_cols":5,"rows_kept":16,"hidden":true}
[]
[null,"Section","Check Description","Status (1 = Incomplete, 0 = Complete)","Check Type"]
[null,"Section 1","All",{"$f":"IF(SUM('Section 1'!F9:F11)>0,1,0)","v":1},"Error"]
[null,"Section 2","Complete?",{"$f":"IF(SUM('Section 2'!$U$22:$U$31,'Section 2'!$T$14:$V$14)>0,1,0)","v":0},"Stopper"]
[null,"Section 2","Valid State if USA",{"$f":"IF('Section 2'!$U$14>0,1,0)","v":0},"Stopper"]
[null,"Section 2","Valid Country",{"$f":"IF('Section 2'!$V$14>0,1,0)","v":0},"Stopper"]
[null,"Section 2","Valid Chemical",{"$f":"IF(SUM('Section 2'!V22:W31)>0, 1, 0)","v":0},"Stopper"]
[null,"Section 2","Inter-pollutant check (Baseline)",{"$f":"IF(SUM('Section 2'!$X$22:$X$31)>0,1,0)","v":0},"Stopper"]
[null,"Section 2","Error Check",{"$f":"IF(SUM(D4:D8)>0,1,0)","v":0},"Error"]
[null,"All","Error Check",{"$f":"IF(SUM(Sec1Status,Sec2Error)>0,1,0)","v":1},"Error"]
{"$rows_left_out":7}
{"sheet":"Lists","index":6,"n_rows":204,"n_cols":16,"rows_kept":204,"hidden":true,"merged":[[0,10,0,11],[0,14,0,15]]}
[{"$nulls":10},"ODP Table",{"$nulls":3},"FOR REFERENCE ONLY"]
[null,"Country List","States","Submission Type","Reporting Year","Year Range","Class II Allownace Types","Allowance Type: Current or Baseline","Allowance Type: Domestic or International","Class II Chemicals w/ Allowances","Class II Chemicals","ODP","Date for CSV Title","Form Name for CSV Title","Form Type","Form Code"]
[null,"Afghanistan","Alaska","Original Submission",2018,{"$f":"IF(ReportYr=Lists!$E$3,DATE(Lists!$E$3,1,1),IF(ReportYr=Lists!$E$4,DATE(Lists!$E$4,1,1),IF(ReportYr=Lists!$E$5,DATE(Lists!$E$5,1,1),0)))","v":"00:00:00"},"Production","Current","Domestic","HCFC-22","HCFC-22",0.055,{"$f":"MONTH('Section 1'!D5)&\"-\"&DAY('Section 1'!D5)&\"-\"&YEAR('Section 1'!D5)","v":"5-22-2018"},"Class II Trades","Class I Producer","PROD1"]
[null,"Albania","Alabama","Re-Submittal",2019,{"$f":"IF(ReportYr=Lists!$E$3,DATE(Lists!$E$3,12,31),IF(ReportYr=Lists!$E$4,DATE(Lists!$E$4,12,31),IF(ReportYr=Lists!$E$5,DATE(Lists!$E$5,12,31),0)))","v":"00:00:00"},"Consumption","Baseline",null,"HCFC-123","HCFC-123",0.02,null,null,"MeBr Producer","PROD3"]
[null,"Algeria","Arkansas",null,2020,null,"Article 5",null,null,"HCFC-124","HCFC-124",0.022,null,null,"Class II Producer","PROD2"]
[null,"Andorra","Arizona",{"$nulls":6},"HCFC-141b","HCFC-141b",0.11,null,null,"Class I Importer","IMPT1"]
[null,"Angola","California",{"$nulls":6},"HCFC-142b","HCFC-142b",0.065,null,null,"MeBr Importer","IMPT3"]
[null,"Antigua and Barbuda","Colorado",{"$nulls":6},"HCFC-225ca","HCFC-225ca",0.025,null,null,"Class II Importer","IMPT2"]
[null,"Argentina","Connecticut",{"$nulls":6},"HCFC-225cb","HCFC-225cb",0.033,null,null,"Class I Exporter","EXPT1"]
[null,"Armenia","District of Columbia",{"$nulls":11},"MeBr Exporter","EXPT3"]
{"$rows_left_out":195}
{"sheet":"OutputForCSV","index":7,"n_rows":12,"n_cols":23,"rows_kept":12,"hidden":true}
["Entry",1,"TRAD2",1,{"$f":"'Section 1'!D5","v":"2018-05-22"},{"$f":"'Section 1'!D9","v":0},{"$f":"'Section 1'!D10","v":0},{"$f":"'Section 1'!D11","v":0},"N/A",{"$nulls":13},"LastColumn"]
[1,{"$f":"IF(C2=\"\",\"\",2)","v":""},{"$f":"IFERROR(VLOOKUP($A2,'Section 2'!$D$22:$O$31,COLUMNS('Section 2'!$D$18:D$19),0),\"\")","v":""},{"$f":"IF(C2=\"\",\"\",'Section 2'!$D$14)","v":""},{"$f":"IF('Section 2'!$E$14=0,\"\",'Section 2'!$E$14)","v":""},{"$f":"IF('Section 2'!$F$14=0,\"\",'Section 2'!$F$14)","v":""},{"$f":"IF('Section 2'!$G$14=0,\"\",'Section 2'!$G$14)","v":""},{"$f":"IF('Section 2'!$H$14=0,\"\",'Section 2'!$H$14)","v":""},{"$f":"IF('Section 2'!$I$14=0,\"\",'Section 2'!$I$14)","v":""},{"$f":"IF('Section 2'!$J$14=0,\"\",'Section 2'!$J$14)","v":""},{"$f":"IF('Section 2'!$K$14=0,\"\",'Section 2'!$K$14)","v":""},{"$f":"IFERROR(VLOOKUP($A2,'Section 2'!$D$22:$O$31,COLUMNS('Section 2'!$D$18:E$19),0),\"\")","v":""},{"$f":"IFERROR(VLOOKUP($A2,'Section 2'!$D$22:$O$31,COLUMNS('Section 2'!$D$18:F$19),0),\"\")","v":""},{"$f":"IFERROR(VLOOKUP($A2,'Section 2'!$D$22:$O$31,COLUMNS('Section 2'!$D$18:G$19),0),\"\")","v":""},{"$f":"IFERROR(VLOOKUP($A2,'Section 2'!$D$22:$O$31,COLUMNS('Section 2'!$D$18:H$19),0),\"\")","v":""},{"$f":"IFERROR(VLOOKUP($A2,'Section 2'!$D$22:$O$31,COLUMNS('Section 2'!$D$18:I$19),0),\"\")","v":""},{"$f":"IFERROR(VLOOKUP($A2,'Section 2'!$D$22:$O$31,COLUMNS('Section 2'!$D$18:J$19),0),\"\")","v":""},{"$f":"IFERROR(VLOOKUP($A2,'Section 2'!$D$22:$O$31,COLUMNS('Section 2'!$D$18:K$19),0),\"\")","v":""},{"$f":"IFERROR(VLOOKUP($A2,'Section 2'!$D$22:$O$31,COLUMNS('Section 2'!$D$18:L$19),0),\"\")","v":""},{"$f":"IFERROR(VLOOKUP($A2,'Section 2'!$D$22:$O$31,COLUMNS('Section 2'!$D$18:M$19),0),\"\")","v":""},{"$f":"IFERROR(VLOOKUP($A2,'Section 2'!$D$22:$O$31,COLUMNS('Section 2'!$D$18:N$19),0),\"\")","v":""},{"$f":"IFERROR(VLOOKUP($A2,'Section 2'!$D$22:$O$31,COLUMNS('Section 2'!$D$18:O$19),0),\"\")","v":""}]
[2,{"$f":"IF(C3=\"\",\"\",2)","v":""},{"$f":"IFERROR(VLOOKUP($A3,'Section 2'!$D$22:$O$31,COLUMNS('Section 2'!$D$18:D$19),0),\"\")","v":""},{"$f":"IF(C3=\"\",\"\",'Section 2'!$D$14)","v":""},{"$f":"IF(C3=\"\",\"\",IF('Section 2'!$E$14=0,\"\",'Section 2'!$E$14))","v":""},{"$f":"IF(C3=\"\",\"\",IF('Section 2'!$F$14=0,\"\",'Section 2'!$F$14))","v":""},{"$f":"IF(C3=\"\",\"\",IF('Section 2'!$G$14=0,\"\",'Section 2'!$G$14))","v":""},{"$f":"IF(C3=\"\",\"\",IF('Section 2'!$H$14=0,\"\",'Section 2'!$H$14))","v":""},{"$f":"IF(C3=\"\",\"\",IF('Section 2'!$I$14=0,\"\",'Section 2'!$I$14))","v":""},{"$f":"IF(C3=\"\",\"\",IF('Section 2'!$J$14=0,\"\",'Section 2'!$J$14))","v":""},{"$f":"IF(C3=\"\",\"\",IF('Section 2'!$K$14=0,\"\",'Section 2'!$K$14))","v":""},{"$f":"IFERROR(VLOOKUP($A3,'Section 2'!$D$22:$O$31,COLUMNS('Section 2'!$D$18:E$19),0),\"\")","v":""},{"$f":"IFERROR(VLOOKUP($A3,'Section 2'!$D$22:$O$31,COLUMNS('Section 2'!$D$18:F$19),0),\"\")","v":""},{"$f":"IFERROR(VLOOKUP($A3,'Section 2'!$D$22:$O$31,COLUMNS('Section 2'!$D$18:G$19),0),\"\")","v":""},{"$f":"IFERROR(VLOOKUP($A3,'Section 2'!$D$22:$O$31,COLUMNS('Section 2'!$D$18:H$19),0),\"\")","v":""},{"$f":"IFERROR(VLOOKUP($A3,'Section 2'!$D$22:$O$31,COLUMNS('Section 2'!$D$18:I$19),0),\"\")","v":""},{"$f":"IFERROR(VLOOKUP($A3,'Section 2'!$D$22:$O$31,COLUMNS('Section 2'!$D$18:J$19),0),\"\")","v":""},{"$f":"IFERROR(VLOOKUP($A3,'Section 2'!$D$22:$O$31,COLUMNS('Section 2'!$D$18:K$19),0),\"\")","v":""},{"$f":"IFERROR(VLOOKUP($A3,'Section 2'!$D$22:$O$31,COLUMNS('Section 2'!$D$18:L$19),0),\"\")","v":""},{"$f":"IFERROR(VLOOKUP($A3,'Section 2'!$D$22:$O$31,COLUMNS('Section 2'!$D$18:M$19),0),\"\")","v":""},{"$f":"IFERROR(VLOOKUP($A3,'Section 2'!$D$22:$O$31,COLUMNS('Section 2'!$D$18:N$19),0),\"\")","v":""},{"$f":"IFERROR(VLOOKUP($A3,'Section 2'!$D$22:$O$31,COLUMNS('Section 2'!$D$18:O$19),0),\"\")","v":""}]
[3,"",{"$f":"IFERROR(VLOOKUP($A4,'Section 2'!$D$22:$O$31,COLUMNS('Section 2'!$D$18:D$19),0),\"\")","v":""},{"$f":"IF(C4=\"\",\"\",'Section 2'!$D$14)","v":""},{"$f":"IF(C4=\"\",\"\",IF('Section 2'!$E$14=0,\"\",'Section 2'!$E$14))","v":""},{"$f":"IF(C4=\"\",\"\",IF('Section 2'!$F$14=0,\"\",'Section 2'!$F$14))","v":""},{"$f":"IF(C4=\"\",\"\",IF('Section 2'!$G$14=0,\"\",'Section 2'!$G$14))","v":""},{"$f":"IF(C4=\"\",\"\",IF('Section 2'!$H$14=0,\"\",'Section 2'!$H$14))","v":""},{"$f":"IF(C4=\"\",\"\",IF('Section 2'!$I$14=0,\"\",'Section 2'!$I$14))","v":""},{"$f":"IF(C4=\"\",\"\",IF('Section 2'!$J$14=0,\"\",'Section 2'!$J$14))","v":""},{"$f":"IF(C4=\"\",\"\",IF('Section 2'!$K$14=0,\"\",'Section 2'!$K$14))","v":""},{"$f":"IFERROR(VLOOKUP($A4,'Section 2'!$D$22:$O$31,COLUMNS('Section 2'!$D$18:E$19),0),\"\")","v":""},{"$f":"IFERROR(VLOOKUP($A4,'Section 2'!$D$22:$O$31,COLUMNS('Section 2'!$D$18:F$19),0),\"\")","v":""},{"$f":"IFERROR(VLOOKUP($A4,'Section 2'!$D$22:$O$31,COLUMNS('Section 2'!$D$18:G$19),0),\"\")","v":""},{"$f":"IFERROR(VLOOKUP($A4,'Section 2'!$D$22:$O$31,COLUMNS('Section 2'!$D$18:H$19),0),\"\")","v":""},{"$f":"IFERROR(VLOOKUP($A4,'Section 2'!$D$22:$O$31,COLUMNS('Section 2'!$D$18:I$19),0),\"\")","v":""},{"$f":"IFERROR(VLOOKUP($A4,'Section 2'!$D$22:$O$31,COLUMNS('Section 2'!$D$18:J$19),0),\"\")","v":""},{"$f":"IFERROR(VLOOKUP($A4,'Section 2'!$D$22:$O$31,COLUMNS('Section 2'!$D$18:K$19),0),\"\")","v":""},{"$f":"IFERROR(VLOOKUP($A4,'Section 2'!$D$22:$O$31,COLUMNS('Section 2'!$D$18:L$19),0),\"\")","v":""},{"$f":"IFERROR(VLOOKUP($A4,'Section 2'!$D$22:$O$31,COLUMNS('Section 2'!$D$18:M$19),0),\"\")","v":""},{"$f":"IFERROR(VLOOKUP($A4,'Section 2'!$D$22:$O$31,COLUMNS('Section 2'!$D$18:N$19),0),\"\")","v":""},{"$f":"IFERROR(VLOOKUP($A4,'Section 2'!$D$22:$O$31,COLUMNS('Section 2'!$D$18:O$19),0),\"\")","v":""}]
[4,"",{"$f":"IFERROR(VLOOKUP($A5,'Section 2'!$D$22:$O$31,COLUMNS('Section 2'!$D$18:D$19),0),\"\")","v":""},{"$f":"IF(C5=\"\",\"\",'Section 2'!$D$14)","v":""},{"$f":"IF(C5=\"\",\"\",IF('Section 2'!$E$14=0,\"\",'Section 2'!$E$14))","v":""},{"$f":"IF(C5=\"\",\"\",IF('Section 2'!$F$14=0,\"\",'Section 2'!$F$14))","v":""},{"$f":"IF(C5=\"\",\"\",IF('Section 2'!$G$14=0,\"\",'Section 2'!$G$14))","v":""},{"$f":"IF(C5=\"\",\"\",IF('Section 2'!$H$14=0,\"\",'Section 2'!$H$14))","v":""},{"$f":"IF(C5=\"\",\"\",IF('Section 2'!$I$14=0,\"\",'Section 2'!$I$14))","v":""},{"$f":"IF(C5=\"\",\"\",IF('Section 2'!$J$14=0,\"\",'Section 2'!$J$14))","v":""},{"$f":"IF(C5=\"\",\"\",IF('Section 2'!$K$14=0,\"\",'Section 2'!$K$14))","v":""},{"$f":"IFERROR(VLOOKUP($A5,'Section 2'!$D$22:$O$31,COLUMNS('Section 2'!$D$18:E$19),0),\"\")","v":""},{"$f":"IFERROR(VLOOKUP($A5,'Section 2'!$D$22:$O$31,COLUMNS('Section 2'!$D$18:F$19),0),\"\")","v":""},{"$f":"IFERROR(VLOOKUP($A5,'Section 2'!$D$22:$O$31,COLUMNS('Section 2'!$D$18:G$19),0),\"\")","v":""},{"$f":"IFERROR(VLOOKUP($A5,'Section 2'!$D$22:$O$31,COLUMNS('Section 2'!$D$18:H$19),0),\"\")","v":""},{"$f":"IFERROR(VLOOKUP($A5,'Section 2'!$D$22:$O$31,COLUMNS('Section 2'!$D$18:I$19),0),\"\")","v":""},{"$f":"IFERROR(VLOOKUP($A5,'Section 2'!$D$22:$O$31,COLUMNS('Section 2'!$D$18:J$19),0),\"\")","v":""},{"$f":"IFERROR(VLOOKUP($A5,'Section 2'!$D$22:$O$31,COLUMNS('Section 2'!$D$18:K$19),0),\"\")","v":""},{"$f":"IFERROR(VLOOKUP($A5,'Section 2'!$D$22:$O$31,COLUMNS('Section 2'!$D$18:L$19),0),\"\")","v":""},{"$f":"IFERROR(VLOOKUP($A5,'Section 2'!$D$22:$O$31,COLUMNS('Section 2'!$D$18:M$19),0),\"\")","v":""},{"$f":"IFERROR(VLOOKUP($A5,'Section 2'!$D$22:$O$31,COLUMNS('Section 2'!$D$18:N$19),0),\"\")","v":""},{"$f":"IFERROR(VLOOKUP($A5,'Section 2'!$D$22:$O$31,COLUMNS('Section 2'!$D$18:O$19),0),\"\")","v":""}]
[5,"",{"$f":"IFERROR(VLOOKUP($A6,'Section 2'!$D$22:$O$31,COLUMNS('Section 2'!$D$18:D$19),0),\"\")","v":""},{"$f":"IF(C6=\"\",\"\",'Section 2'!$D$14)","v":""},{"$f":"IF(C6=\"\",\"\",IF('Section 2'!$E$14=0,\"\",'Section 2'!$E$14))","v":""},{"$f":"IF(C6=\"\",\"\",IF('Section 2'!$F$14=0,\"\",'Section 2'!$F$14))","v":""},{"$f":"IF(C6=\"\",\"\",IF('Section 2'!$G$14=0,\"\",'Section 2'!$G$14))","v":""},{"$f":"IF(C6=\"\",\"\",IF('Section 2'!$H$14=0,\"\",'Section 2'!$H$14))","v":""},{"$f":"IF(C6=\"\",\"\",IF('Section 2'!$I$14=0,\"\",'Section 2'!$I$14))","v":""},{"$f":"IF(C6=\"\",\"\",IF('Section 2'!$J$14=0,\"\",'Section 2'!$J$14))","v":""},{"$f":"IF(C6=\"\",\"\",IF('Section 2'!$K$14=0,\"\",'Section 2'!$K$14))","v":""},{"$f":"IFERROR(VLOOKUP($A6,'Section 2'!$D$22:$O$31,COLUMNS('Section 2'!$D$18:E$19),0),\"\")","v":""},{"$f":"IFERROR(VLOOKUP($A6,'Section 2'!$D$22:$O$31,COLUMNS('Section 2'!$D$18:F$19),0),\"\")","v":""},{"$f":"IFERROR(VLOOKUP($A6,'Section 2'!$D$22:$O$31,COLUMNS('Section 2'!$D$18:G$19),0),\"\")","v":""},{"$f":"IFERROR(VLOOKUP($A6,'Section 2'!$D$22:$O$31,COLUMNS('Section 2'!$D$18:H$19),0),\"\")","v":""},{"$f":"IFERROR(VLOOKUP($A6,'Section 2'!$D$22:$O$31,COLUMNS('Section 2'!$D$18:I$19),0),\"\")","v":""},{"$f":"IFERROR(VLOOKUP($A6,'Section 2'!$D$22:$O$31,COLUMNS('Section 2'!$D$18:J$19),0),\"\")","v":""},{"$f":"IFERROR(VLOOKUP($A6,'Section 2'!$D$22:$O$31,COLUMNS('Section 2'!$D$18:K$19),0),\"\")","v":""},{"$f":"IFERROR(VLOOKUP($A6,'Section 2'!$D$22:$O$31,COLUMNS('Section 2'!$D$18:L$19),0),\"\")","v":""},{"$f":"IFERROR(VLOOKUP($A6,'Section 2'!$D$22:$O$31,COLUMNS('Section 2'!$D$18:M$19),0),\"\")","v":""},{"$f":"IFERROR(VLOOKUP($A6,'Section 2'!$D$22:$O$31,COLUMNS('Section 2'!$D$18:N$19),0),\"\")","v":""},{"$f":"IFERROR(VLOOKUP($A6,'Section 2'!$D$22:$O$31,COLUMNS('Section 2'!$D$18:O$19),0),\"\")","v":""}]
[6,"",{"$f":"IFERROR(VLOOKUP($A7,'Section 2'!$D$22:$O$31,COLUMNS('Section 2'!$D$18:D$19),0),\"\")","v":""},{"$f":"IF(C7=\"\",\"\",'Section 2'!$D$14)","v":""},{"$f":"IF(C7=\"\",\"\",IF('Section 2'!$E$14=0,\"\",'Section 2'!$E$14))","v":""},{"$f":"IF(C7=\"\",\"\",IF('Section 2'!$F$14=0,\"\",'Section 2'!$F$14))","v":""},{"$f":"IF(C7=\"\",\"\",IF('Section 2'!$G$14=0,\"\",'Section 2'!$G$14))","v":""},{"$f":"IF(C7=\"\",\"\",IF('Section 2'!$H$14=0,\"\",'Section 2'!$H$14))","v":""},{"$f":"IF(C7=\"\",\"\",IF('Section 2'!$I$14=0,\"\",'Section 2'!$I$14))","v":""},{"$f":"IF(C7=\"\",\"\",IF('Section 2'!$J$14=0,\"\",'Section 2'!$J$14))","v":""},{"$f":"IF(C7=\"\",\"\",IF('Section 2'!$K$14=0,\"\",'Section 2'!$K$14))","v":""},{"$f":"IFERROR(VLOOKUP($A7,'Section 2'!$D$22:$O$31,COLUMNS('Section 2'!$D$18:E$19),0),\"\")","v":""},{"$f":"IFERROR(VLOOKUP($A7,'Section 2'!$D$22:$O$31,COLUMNS('Section 2'!$D$18:F$19),0),\"\")","v":""},{"$f":"IFERROR(VLOOKUP($A7,'Section 2'!$D$22:$O$31,COLUMNS('Section 2'!$D$18:G$19),0),\"\")","v":""},{"$f":"IFERROR(VLOOKUP($A7,'Section 2'!$D$22:$O$31,COLUMNS('Section 2'!$D$18:H$19),0),\"\")","v":""},{"$f":"IFERROR(VLOOKUP($A7,'Section 2'!$D$22:$O$31,COLUMNS('Section 2'!$D$18:I$19),0),\"\")","v":""},{"$f":"IFERROR(VLOOKUP($A7,'Section 2'!$D$22:$O$31,COLUMNS('Section 2'!$D$18:J$19),0),\"\")","v":""},{"$f":"IFERROR(VLOOKUP($A7,'Section 2'!$D$22:$O$31,COLUMNS('Section 2'!$D$18:K$19),0),\"\")","v":""},{"$f":"IFERROR(VLOOKUP($A7,'Section 2'!$D$22:$O$31,COLUMNS('Section 2'!$D$18:L$19),0),\"\")","v":""},{"$f":"IFERROR(VLOOKUP($A7,'Section 2'!$D$22:$O$31,COLUMNS('Section 2'!$D$18:M$19),0),\"\")","v":""},{"$f":"IFERROR(VLOOKUP($A7,'Section 2'!$D$22:$O$31,COLUMNS('Section 2'!$D$18:N$19),0),\"\")","v":""},{"$f":"IFERROR(VLOOKUP($A7,'Section 2'!$D$22:$O$31,COLUMNS('Section 2'!$D$18:O$19),0),\"\")","v":""}]
[7,"",{"$f":"IFERROR(VLOOKUP($A8,'Section 2'!$D$22:$O$31,COLUMNS('Section 2'!$D$18:D$19),0),\"\")","v":""},{"$f":"IF(C8=\"\",\"\",'Section 2'!$D$14)","v":""},{"$f":"IF(C8=\"\",\"\",IF('Section 2'!$E$14=0,\"\",'Section 2'!$E$14))","v":""},{"$f":"IF(C8=\"\",\"\",IF('Section 2'!$F$14=0,\"\",'Section 2'!$F$14))","v":""},{"$f":"IF(C8=\"\",\"\",IF('Section 2'!$G$14=0,\"\",'Section 2'!$G$14))","v":""},{"$f":"IF(C8=\"\",\"\",IF('Section 2'!$H$14=0,\"\",'Section 2'!$H$14))","v":""},{"$f":"IF(C8=\"\",\"\",IF('Section 2'!$I$14=0,\"\",'Section 2'!$I$14))","v":""},{"$f":"IF(C8=\"\",\"\",IF('Section 2'!$J$14=0,\"\",'Section 2'!$J$14))","v":""},{"$f":"IF(C8=\"\",\"\",IF('Section 2'!$K$14=0,\"\",'Section 2'!$K$14))","v":""},{"$f":"IFERROR(VLOOKUP($A8,'Section 2'!$D$22:$O$31,COLUMNS('Section 2'!$D$18:E$19),0),\"\")","v":""},{"$f":"IFERROR(VLOOKUP($A8,'Section 2'!$D$22:$O$31,COLUMNS('Section 2'!$D$18:F$19),0),\"\")","v":""},{"$f":"IFERROR(VLOOKUP($A8,'Section 2'!$D$22:$O$31,COLUMNS('Section 2'!$D$18:G$19),0),\"\")","v":""},{"$f":"IFERROR(VLOOKUP($A8,'Section 2'!$D$22:$O$31,COLUMNS('Section 2'!$D$18:H$19),0),\"\")","v":""},{"$f":"IFERROR(VLOOKUP($A8,'Section 2'!$D$22:$O$31,COLUMNS('Section 2'!$D$18:I$19),0),\"\")","v":""},{"$f":"IFERROR(VLOOKUP($A8,'Section 2'!$D$22:$O$31,COLUMNS('Section 2'!$D$18:J$19),0),\"\")","v":""},{"$f":"IFERROR(VLOOKUP($A8,'Section 2'!$D$22:$O$31,COLUMNS('Section 2'!$D$18:K$19),0),\"\")","v":""},{"$f":"IFERROR(VLOOKUP($A8,'Section 2'!$D$22:$O$31,COLUMNS('Section 2'!$D$18:L$19),0),\"\")","v":""},{"$f":"IFERROR(VLOOKUP($A8,'Section 2'!$D$22:$O$31,COLUMNS('Section 2'!$D$18:M$19),0),\"\")","v":""},{"$f":"IFERROR(VLOOKUP($A8,'Section 2'!$D$22:$O$31,COLUMNS('Section 2'!$D$18:N$19),0),\"\")","v":""},{"$f":"IFERROR(VLOOKUP($A8,'Section 2'!$D$22:$O$31,COLUMNS('Section 2'!$D$18:O$19),0),\"\")","v":""}]
[8,"",{"$f":"IFERROR(VLOOKUP($A9,'Section 2'!$D$22:$O$31,COLUMNS('Section 2'!$D$18:D$19),0),\"\")","v":""},{"$f":"IF(C9=\"\",\"\",'Section 2'!$D$14)","v":""},{"$f":"IF(C9=\"\",\"\",IF('Section 2'!$E$14=0,\"\",'Section 2'!$E$14))","v":""},{"$f":"IF(C9=\"\",\"\",IF('Section 2'!$F$14=0,\"\",'Section 2'!$F$14))","v":""},{"$f":"IF(C9=\"\",\"\",IF('Section 2'!$G$14=0,\"\",'Section 2'!$G$14))","v":""},{"$f":"IF(C9=\"\",\"\",IF('Section 2'!$H$14=0,\"\",'Section 2'!$H$14))","v":""},{"$f":"IF(C9=\"\",\"\",IF('Section 2'!$I$14=0,\"\",'Section 2'!$I$14))","v":""},{"$f":"IF(C9=\"\",\"\",IF('Section 2'!$J$14=0,\"\",'Section 2'!$J$14))","v":""},{"$f":"IF(C9=\"\",\"\",IF('Section 2'!$K$14=0,\"\",'Section 2'!$K$14))","v":""},{"$f":"IFERROR(VLOOKUP($A9,'Section 2'!$D$22:$O$31,COLUMNS('Section 2'!$D$18:E$19),0),\"\")","v":""},{"$f":"IFERROR(VLOOKUP($A9,'Section 2'!$D$22:$O$31,COLUMNS('Section 2'!$D$18:F$19),0),\"\")","v":""},{"$f":"IFERROR(VLOOKUP($A9,'Section 2'!$D$22:$O$31,COLUMNS('Section 2'!$D$18:G$19),0),\"\")","v":""},{"$f":"IFERROR(VLOOKUP($A9,'Section 2'!$D$22:$O$31,COLUMNS('Section 2'!$D$18:H$19),0),\"\")","v":""},{"$f":"IFERROR(VLOOKUP($A9,'Section 2'!$D$22:$O$31,COLUMNS('Section 2'!$D$18:I$19),0),\"\")","v":""},{"$f":"IFERROR(VLOOKUP($A9,'Section 2'!$D$22:$O$31,COLUMNS('Section 2'!$D$18:J$19),0),\"\")","v":""},{"$f":"IFERROR(VLOOKUP($A9,'Section 2'!$D$22:$O$31,COLUMNS('Section 2'!$D$18:K$19),0),\"\")","v":""},{"$f":"IFERROR(VLOOKUP($A9,'Section 2'!$D$22:$O$31,COLUMNS('Section 2'!$D$18:L$19),0),\"\")","v":""},{"$f":"IFERROR(VLOOKUP($A9,'Section 2'!$D$22:$O$31,COLUMNS('Section 2'!$D$18:M$19),0),\"\")","v":""},{"$f":"IFERROR(VLOOKUP($A9,'Section 2'!$D$22:$O$31,COLUMNS('Section 2'!$D$18:N$19),0),\"\")","v":""},{"$f":"IFERROR(VLOOKUP($A9,'Section 2'!$D$22:$O$31,COLUMNS('Section 2'!$D$18:O$19),0),\"\")","v":""}]
[9,"",{"$f":"IFERROR(VLOOKUP($A10,'Section 2'!$D$22:$O$31,COLUMNS('Section 2'!$D$18:D$19),0),\"\")","v":""},{"$f":"IF(C10=\"\",\"\",'Section 2'!$D$14)","v":""},{"$f":"IF(C10=\"\",\"\",IF('Section 2'!$E$14=0,\"\",'Section 2'!$E$14))","v":""},{"$f":"IF(C10=\"\",\"\",IF('Section 2'!$F$14=0,\"\",'Section 2'!$F$14))","v":""},{"$f":"IF(C10=\"\",\"\",IF('Section 2'!$G$14=0,\"\",'Section 2'!$G$14))","v":""},{"$f":"IF(C10=\"\",\"\",IF('Section 2'!$H$14=0,\"\",'Section 2'!$H$14))","v":""},{"$f":"IF(C10=\"\",\"\",IF('Section 2'!$I$14=0,\"\",'Section 2'!$I$14))","v":""},{"$f":"IF(C10=\"\",\"\",IF('Section 2'!$J$14=0,\"\",'Section 2'!$J$14))","v":""},{"$f":"IF(C10=\"\",\"\",IF('Section 2'!$K$14=0,\"\",'Section 2'!$K$14))","v":""},{"$f":"IFERROR(VLOOKUP($A10,'Section 2'!$D$22:$O$31,COLUMNS('Section 2'!$D$18:E$19),0),\"\")","v":""},{"$f":"IFERROR(VLOOKUP($A10,'Section 2'!$D$22:$O$31,COLUMNS('Section 2'!$D$18:F$19),0),\"\")","v":""},{"$f":"IFERROR(VLOOKUP($A10,'Section 2'!$D$22:$O$31,COLUMNS('Section 2'!$D$18:G$19),0),\"\")","v":""},{"$f":"IFERROR(VLOOKUP($A10,'Section 2'!$D$22:$O$31,COLUMNS('Section 2'!$D$18:H$19),0),\"\")","v":""},{"$f":"IFERROR(VLOOKUP($A10,'Section 2'!$D$22:$O$31,COLUMNS('Section 2'!$D$18:I$19),0),\"\")","v":""},{"$f":"IFERROR(VLOOKUP($A10,'Section 2'!$D$22:$O$31,COLUMNS('Section 2'!$D$18:J$19),0),\"\")","v":""},{"$f":"IFERROR(VLOOKUP($A10,'Section 2'!$D$22:$O$31,COLUMNS('Section 2'!$D$18:K$19),0),\"\")","v":""},{"$f":"IFERROR(VLOOKUP($A10,'Section 2'!$D$22:$O$31,COLUMNS('Section 2'!$D$18:L$19),0),\"\")","v":""},{"$f":"IFERROR(VLOOKUP($A10,'Section 2'!$D$22:$O$31,COLUMNS('Section 2'!$D$18:M$19),0),\"\")","v":""},{"$f":"IFERROR(VLOOKUP($A10,'Section 2'!$D$22:$O$31,COLUMNS('Section 2'!$D$18:N$19),0),\"\")","v":""},{"$f":"IFERROR(VLOOKUP($A10,'Section 2'!$D$22:$O$31,COLUMNS('Section 2'!$D$18:O$19),0),\"\")","v":""}]
{"$rows_left_out":2}