{"text_format":"3","workbook":"xlsx","n_sheets":10,"sheets":["VETS-704 Applicant Synopsis","plans","VETS-704 Instruction Sheet","Continuum of Care List","Opportunity Zones","export","Counties","CoCs","extra & old","dropdowns"],"not_rendered":{"macros":1,"defined_names":126},"read":"whole","date_system":"1900"}

{"sheet":"VETS-704 Applicant Synopsis","index":0,"n_rows":52,"n_cols":11,"rows_kept":52,"merged":[[0,1,0,11],[1,4,1,6],[1,9,1,11],[2,4,2,6],[2,9,2,11],[3,4,3,6],[3,9,3,11],[4,9,4,11],[5,4,5,6],[6,4,6,6],[6,9,6,11],[7,4,7,6],[7,9,7,11],[8,4,8,6],[8,9,8,11],[9,4,9,6],[9,9,9,11],[12,1,12,11],[20,1,20,11],[21,9,21,10],[22,9,22,10],[23,9,23,10],[26,1,26,10],[28,2,32,10],[35,1,35,10],[49,1,49,11]]}
[null,"Applicant Synopsis"]
[{"$nulls":3},"Organization Name",{"$nulls":4},"Organization Address"]
[{"$nulls":3},"DUNS Number"]
[{"$nulls":3},"EIN"]
[]
[{"$nulls":3},"Authorized Rep Name"]
[{"$nulls":3},"Authored Rep Phone",{"$nulls":4},"Main Project Address"]
[{"$nulls":3},"POC Name"]
[{"$nulls":3},"POC Phone"]
[{"$nulls":3},"POC Email"]
[]
[]
[null,"Other Federal Homeless Funding: Please indicate whether your organization expects to receive the following funding during the award period."]
[]
[{"$nulls":3},"Veterans Affairs Supportive Services for Veteran Families (SSVF)"]
[{"$nulls":3},"VA Grant and Per Diem Program (GPD)"]
[{"$nulls":3},"VA Supportive Housing (VASH)"]
[{"$nulls":3},"Department of Housing and Urban Development (HUD) Continuum of Care (CoC) Program"]
[]
[]
[null,"About You: Please provide the following information about your organization and the participants and area you propose to serve."]
[{"$nulls":3},"Prior HVRP Grantee?",{"$nulls":4},"Proposed Category"]
[{"$nulls":3},"Opportunity Zone",{"$nulls":4},"Requested Grant Amount"]
[{"$nulls":3},"Service Area Type",{"$nulls":4},"Number of Participants to be served"]
[]
[]
[null,"Service Delivery Area: Please indicate the county or counties whose participants you will serve, even if your area includes only a part of the county. Click on \"FIPS Finder\" and follow its prompts to submit your covered areas."]
[]
[null,null,"[FIPS Builder tool to be applied here]"]
[]
[]
[]
[]
[]
[]
[null,"Contiuum(s) of Care (CoCs) served: Please indicate every CoC where the proposed program will operate. Select the state(s) at the head of each column, and then the CoC(s) beneath. Coverage areas are shown in the Continuum of Care List tab."]
[]
[{"$nulls":3},"State:",null,null,"State:",null,null,"State:"]
[{"$nulls":3},"CoC:",null,null,"CoC:",null,null,"CoC:"]
[{"$nulls":3},"CoC:",null,null,"CoC:",null,null,"CoC:"]
[{"$nulls":3},"CoC:",null,null,"CoC:",null,null,"CoC:"]
[{"$nulls":3},"CoC:",null,null,"CoC:",null,null,"CoC:"]
[{"$nulls":3},"CoC:",null,null,"CoC:",null,null,"CoC:"]
[{"$nulls":3},"CoC:",null,null,"CoC:",null,null,"CoC:"]
[{"$nulls":3},"CoC:",null,null,"CoC:",null,null,"CoC:"]
[{"$nulls":3},"CoC:",null,null,"CoC:",null,null,"CoC:"]
[{"$nulls":3},"CoC:",null,null,"CoC:",null,null,"CoC:"]
[]
[]
[null,"Public Burden Statement - According to the Paperwork Reduction Act of 1995, no persons are required to respond to a collection of information unless such collection displays a valid OMB control number. The valid OMB control number for this information collection is 1293-0014. The time required to complete this information collection is 1 hour per response, including the time to review instructions, search existing data sources, gather the data needed, and complete and review the information collection. The obligation to respond is required to obtain or retain a benefit (38 U.S.C. 2021 and 2023). If you have any comments concerning the accuracy of the time estimate(s) or suggestions for improving this form, please write to: U.S. Department of Labor, Veterans' Employment and Training Service, 200 Constitution Avenue, N.W., Washington D.C. 20210."]
[]
[{"$nulls":10},"OMB Approval 1293-0014 \nExpires X/XX/XXXX"]

{"sheet":"plans","index":1,"n_rows":32,"n_cols":4,"rows_kept":32,"hidden":true}
[]
[]
[null,"rollup speculation"]
[null,null,"all applicants' Synopsis forms will be saved to one folder"]
[null,null,"a rollup workbook will be in that folder"]
[null,null,"the rollup will run a power query to gather all synopsis export tabs into one table"]
[null,null,"need a CoC layer - seems to be available on HUD's site through ArcGIS; just need the kml file"]
[null,null,"need Point In TIme homeless vet count by area - again, get kml file from ArcGIS"]
[null,null,"this would all be easier with Excel 2019!!!"]
[null,null,"need an Opportunity Zone layer - doesn't seem to be well defined yet"]
[null,null,"another tab will organize the county/state data into cohesive groups"]
[{"$nulls":3},"each applicant will need a name - suggest App001, App002 etc"]
[{"$nulls":3},"# participants should be averaged across each applicant's counties for the Value"]
[null,null,"done","need a way to ensure any locations with zero in the name are ignored before # participants are averaged"]
[{"$nulls":3},"need an indicator to include/exclude applicants - so, if the applicant is not being considered for award, check No to remove them from the map"]
[{"$nulls":3},"need a slicer so user can select whether to view all applicants or exclude No"]
[null,null,"a third tab will become Amanda's rollup, where all of the CoCs are grouped into one cell"]
[null,null,"users will need to know how to break the link but maintain the data so the rollup can be shared"]
[]
[]
[]
[]
[null,"improving this form"]
[null,"sort of","remove or prevent duplicate counties and CoCs (conditional format to highlight duplicates; explanation in instructions)"]
[null,"no","ensure the counties and CoCs crosswalk (might could conditional format for states, but is super hard)"]
[null,"no","ensure the counties are contiguous? (can't even begin to try without 2019)"]
[null,"no","have another tab that displays their map? (can't without 2019)"]
[null,"yes","add opportunity zone (yes/no selector, and all opp zones added to Op Zone tab)"]
[null,"yes","remove blanks (on export)"]
[null,"yes","concatenate counties and CoCs (on export)"]
[null,null,"create a clear form button"]
[null,"done","macro to clear selected counties/CoCs in the list when a new state is selected at top"]

{"sheet":"VETS-704 Instruction Sheet","index":2,"n_rows":31,"n_cols":3,"rows_kept":31,"merged":[[0,1,0,2],[1,1,1,2]]}
[null,"Applicant Synopsis Form Instructions"]
[]
[null,"About this form","This form is used by VETS to roll up all applicants' information automatically. It must be submitted in Excel format (.xls or .xslx)."]
[]
[null,"Applicant Name","Legal organization name, as listed on the SF-424."]
[]
[null,"Requested Amount","Should be the same as listed on the SF-424, Budget Narrative, Direct Cost Descriptions, and Planned Goals Sheet."]
[]
[null,"# of Participants","List the total number of participants you plan to enroll in the program, if awarded. This should croswalk with the VETS-700 Planned Goals."]
[]
[null,"Opportunity Zone","Select Yes or No from the dropdown menu to indicate whether the project will operate in a designated Opportunity Zone. Please see the Opportunity Zones tab of this workbook for a complete list."]
[]
[null,"Proposed Priority","Select the priority from the dropdown menu. For a description of priorities, please see the FOA, Section III.C.2."]
[]
[null,"Authorized Rep Name","Should be the same as listed on the SF-424."]
[]
[null,"Authored Rep Phone","Should be the same as listed on the SF-424."]
[]
[null,"POC Name","Should be the same as listed on the SF-424."]
[]
[null,"POC Phone","Should be the same as listed on the SF-424."]
[]
[null,"POC Email","Should be the same as listed on the SF-424."]
[]
[null,"Main physical address","Address where most of the participants will be served."]
[]
[null,"Other Federal Homeless Funding","Indicate whether your organization expects to receive funding for each of these grants during the program year award period."]
[]
[null,"Service Delivery Area","Follow the prompts to build FIPS codes for your entire proposed service delivery area. [Will be built prior to release.]"]
[]
[null,"Contiuum(s) of Care (CoCs) served","Select the state(s) that you propose to serve at the top of each column, and then select the CoCs under each state. For a full listing of CoC areas, please see the Continuum of Care tab in this workbook. If the same CoC is selected multiple times, all duplicates will be highlighted in red and should be corrected prior to submission."]

{"sheet":"Continuum of Care List","index":3,"n_rows":396,"n_cols":3,"rows_kept":396}
["State","COC #","COC Location"]
["Alabama","AL-500","Birmingham/Jefferson, Saint Clair, Shelby Counties CoC"]
["Alabama","AL-501","Mobile City and County/Baldwin County CoC"]
["Alabama","AL-502","Florence/Northwest Alabama CoC"]
["Alabama","AL-503","Huntsville/North Alabama CoC"]
["Alabama","AL-504","Montgomery City and County CoC"]
["Alabama","AL-506","Tuscaloosa City and County CoC"]
["Alabama","AL-507","Alabama Balance of State CoC"]
["Alaska","AK-500","Anchorage CoC"]
["Alaska","AK-501","Alaska Balance of State CoC"]
["Arizona","AZ-500","Arizona Balance of State CoC"]
["Arizona","AZ-501","Tucson/Pima County CoC"]
["Arizona","AZ-502","Phoenix, Mesa/Maricopa County CoC"]
["Arkansas","AR-500","Little Rock/Central Arkansas CoC"]
["Arkansas","AR-501","Fayetteville/Northwest Arkansas CoC"]
["Arkansas","AR-503","Arkansas Balance of State CoC"]
["Arkansas","AR-505","Southeast Arkansas CoC"]
["Arkansas","AR-512","Boone, Baxter, Marion, Newton Counties CoC"]
["California","CA-500","San Jose, Santa Clara City and County CoC"]
["California","CA-501","San Francisco CoC"]
["California","CA-502","Oakland, Berkeley/Alameda County CoC"]
["California","CA-503","Sacramento City and County CoC"]
["California","CA-504","Santa Rosa, Petaluma/Sonoma County CoC"]
["California","CA-505","Richmond/Contra Costa County CoC"]
["California","CA-506","Salinas/Monterey, San Benito Counties CoC"]
["California","CA-507","Marin County CoC"]
["California","CA-508","Watsonville/Santa Cruz City and County CoC"]
["California","CA-509","Mendocino County CoC"]
["California","CA-510","Turlock, Modesto/Stanislaus County CoC"]
["California","CA-511","Stockton/San Joaquin County CoC"]
["California","CA-512","Daly City/San Mateo County CoC"]
["California","CA-513","Visalia/Kings, Tulare Counties CoC"]
["California","CA-514","Fresno City and County/Madera County CoC"]
["California","CA-515","Roseville, Rocklin/Placer, Nevada Counties CoC"]
["California","CA-516","Redding/Shasta, Siskiyou, Lassen, Plumas, Del Norte, Modoc, Sierra Counties CoC"]
["California","CA-517","Napa City and County CoC"]
["California","CA-518","Vallejo/Solano County CoC"]
["California","CA-519","Chico, Paradise/Butte County CoC"]
["California","CA-520","Merced City and County CoC"]
["California","CA-521","Davis, Woodland/Yolo County CoC"]
["California","CA-522","Humboldt County CoC"]
["California","CA-523","Colusa, Glenn, Trinity Counties CoC"]
["California","CA-524","Yuba City and County/Sutter County CoC"]
["California","CA-525","El Dorado County CoC"]
["California","CA-526","Amador, Calaveras, Mariposa, Tuolumne Counties CoC"]
["California","CA-527","Tehama County CoC"]
["California","CA-530","Alpine, Inyo, Mono Counties CoC"]
["California","CA-600","Los Angeles City and County CoC"]
["California","CA-601","San Diego City and County CoC"]
["California","CA-602","Santa Ana, Anaheim/Orange County CoC"]
["California","CA-603","Santa Maria/Santa Barbara County CoC"]
["California","CA-604","Bakersfield/Kern County CoC"]
["California","CA-606","Long Beach CoC"]
["California","CA-607","Pasadena CoC"]
["California","CA-608","Riverside City and County CoC"]
["California","CA-609","San Bernardino City and County CoC"]
["California","CA-611","Oxnard, San Buenaventura/Ventura County CoC"]
["California","CA-612","Glendale CoC"]
["California","CA-613","Imperial County CoC"]
["California","CA-614","San Luis Obispo County CoC"]
["Colorado","CO-500","Colorado Balance of State CoC"]
["Colorado","CO-503","Metropolitan Denver CoC"]
["Colorado","CO-504","Colorado Springs/El Paso County CoC"]
["Connecticut","CT-503","Bridgeport, Stamford, Norwalk/Fairfield County CoC"]
["Connecticut","CT-505","Connecticut Balance of State CoC"]
["Delaware","DE-500","Delaware Statewide CoC"]
["District of Columbia","DC-500","District of Columbia CoC"]
["Florida","FL-500","Sarasota, Bradenton/Manatee, Sarasota Counties CoC"]
["Florida","FL-501","Tampa/Hillsborough County CoC"]
["Florida","FL-502","Saint Petersburg, Clearwater, Largo/Pinellas County CoC"]
["Florida","FL-503","Lakeland, Winterhaven/Polk County CoC"]
["Florida","FL-504","Deltona, Daytona Beach/Volusia, Flagler Counties CoC"]
["Florida","FL-505","Fort Walton Beach/Okaloosa, Walton Counties CoC"]
["Florida","FL-506","Tallahassee/Leon County CoC"]
["Florida","FL-507","Orlando/Orange, Osceola, Seminole Counties CoC"]
["Florida","FL-508","Gainesville/Alachua, Putnam Counties CoC"]
["Florida","FL-509","Fort Pierce/Saint Lucie, Indian River, Martin Counties CoC"]
["Florida","FL-510","Jacksonville-Duval, Clay Counties CoC"]
["Florida","FL-511","Pensacola/Escambia, Santa Rosa Counties CoC"]
["Florida","FL-512","Saint Johns County CoC"]
["Florida","FL-513","Palm Bay, Melbourne/Brevard County CoC"]
["Florida","FL-514","Ocala/Marion County CoC"]
["Florida","FL-515","Panama City/Bay, Jackson Counties CoC"]
["Florida","FL-517","Hendry, Hardee, Highlands Counties CoC"]
["Florida","FL-518","Columbia, Hamilton, Lafayette, Suwannee Counties CoC"]
["Florida","FL-519","Pasco County CoC"]
["Florida","FL-520","Citrus, Hernando, Lake, Sumter Counties CoC"]
["Florida","FL-600","Miami-Dade County CoC"]
["Florida","FL-601","Ft Lauderdale/Broward County CoC"]
["Florida","FL-602","Punta Gorda/Charlotte County CoC"]
["Florida","FL-603","Ft Myers, Cape Coral/Lee County CoC"]
["Florida","FL-604","Monroe County CoC"]
["Florida","FL-605","West Palm Beach/Palm Beach County CoC"]
["Florida","FL-606","Naples/Collier County CoC"]
["Georgia","GA-500","Atlanta CoC"]
["Georgia","GA-501","Georgia Balance of State CoC"]
["Georgia","GA-502","Fulton County CoC"]
["Georgia","GA-503","Athens-Clarke County CoC"]
["Georgia","GA-504","Augusta-Richmond County CoC"]
["Georgia","GA-505","Columbus-Muscogee CoC"]
["Georgia","GA-506","Marietta/Cobb County CoC"]
["Georgia","GA-507","Savannah/Chatham County CoC"]
["Georgia","GA-508","DeKalb County CoC"]
["Guam","GU-500","Guam CoC"]
["Hawaiʻi","HI-500","Hawaii Balance of State CoC"]
["Hawaiʻi","HI-501","Honolulu City and County CoC"]
["Idaho","ID-500","Boise/Ada County CoC"]
["Idaho","ID-501","Idaho Balance of State CoC"]
["Illinois","IL-500","McHenry County CoC"]
["Illinois","IL-501","Rockford/Winnebago, Boone Counties CoC"]
["Illinois","IL-502","Waukegan, North Chicago/Lake County CoC"]
["Illinois","IL-503","Champaign, Urbana, Rantoul/Champaign County CoC"]
["Illinois","IL-504","Madison County CoC"]
["Illinois","IL-506","Joliet, Bolingbrook/Will County CoC"]
["Illinois","IL-507","Peoria, Pekin/Fulton, Tazewell, Peoria, Woodford Counties CoC"]
["Illinois","IL-508","East Saint Louis, Belleville/Saint Clair County CoC"]
["Illinois","IL-509","DeKalb City and County CoC"]
["Illinois","IL-510","Chicago CoC"]
["Illinois","IL-511","Cook County CoC"]
["Illinois","IL-512","Bloomington/Central Illinois CoC"]
["Illinois","IL-513","Springfield/Sangamon County CoC"]
["Illinois","IL-514","DuPage County CoC"]
["Illinois","IL-515","South Central Illinois CoC"]
["Illinois","IL-516","Decatur/Macon County CoC"]
["Illinois","IL-517","Aurora, Elgin/Kane County CoC"]
["Illinois","IL-518","Rock Island, Moline/Northwestern Illinois CoC"]
["Illinois","IL-519","West Central Illinois CoC"]
["Illinois","IL-520","Southern Illinois CoC"]
["Indiana","IN-502","Indiana Balance of State CoC"]
["Indiana","IN-503","Indianapolis CoC"]
["Iowa","IA-500","Sioux City/Dakota, Woodbury Counties CoC"]
["Iowa","IA-501","Iowa Balance of State CoC"]
["Iowa","IA-502","Des Moines/Polk County CoC"]
["Kansas","KS-502","Wichita/Sedgwick County CoC"]
["Kansas","KS-503","Topeka/Shawnee County CoC"]
["Kansas","KS-505","Overland Park, Shawnee/Johnson County CoC"]
["Kansas","KS-507","Kansas Balance of State CoC"]
["Kentucky","KY-500","Kentucky Balance of State CoC"]
["Kentucky","KY-501","Louisville-Jefferson County CoC"]
["Kentucky","KY-502","Lexington-Fayette County CoC"]
["Louisiana","LA-500","Lafayette/Acadiana Regional CoC"]
["Louisiana","LA-502","Shreveport/Bossier/Northwest Louisiana CoC"]
["Louisiana","LA-503","New Orleans/Jefferson Parish CoC"]
["Louisiana","LA-505","Monroe/Northeast Louisiana CoC"]
["Louisiana","LA-506","Slidell/Southeast Louisiana CoC"]
["Louisiana","LA-507","Alexandria/Central Louisiana CoC"]
["Louisiana","LA-508","Houma-Terrebonne, Thibodaux CoC"]
["Louisiana","LA-509","Louisiana Balance of State CoC"]
["Maine","ME-500","Maine Statewide CoC"]
["Maryland","MD-500","Cumberland/Allegany County CoC"]
["Maryland","MD-501","Baltimore CoC"]
["Maryland","MD-502","Harford County CoC"]
["Maryland","MD-503","Annapolis/Anne Arundel County CoC"]
["Maryland","MD-504","Howard County CoC"]
["Maryland","MD-505","Baltimore County CoC"]
["Maryland","MD-506","Carroll County CoC"]
["Maryland","MD-507","Cecil County CoC"]
["Maryland","MD-508","Charles, Calvert, Saint Mary's Counties CoC"]
["Maryland","MD-509","Frederick City and County CoC"]
["Maryland","MD-510","Garrett County CoC"]
["Maryland","MD-511","Mid-Shore Regional CoC"]
["Maryland","MD-512","Hagerstown/Washington County CoC"]
["Maryland","MD-513","Wicomico, Somerset, Worcester Counties CoC"]
["Maryland","MD-600","Prince George's County CoC"]
["Maryland","MD-601","Montgomery County CoC"]
["Massachusetts","MA-500","Boston CoC"]
["Massachusetts","MA-502","Lynn CoC"]
["Massachusetts","MA-503","Cape Cod Islands CoC"]
["Massachusetts","MA-504","Springfield/Hampden County CoC"]
["Massachusetts","MA-505","New Bedford CoC"]
["Massachusetts","MA-506","Worcester City and County CoC"]
["Massachusetts","MA-507","Pittsfield/Berkshire, Franklin, Hampshire Counties CoC"]
["Massachusetts","MA-508","Lowell CoC"]
["Massachusetts","MA-509","Cambridge CoC"]
["Massachusetts","MA-510","Gloucester, Haverhill, Salem/Essex County CoC"]
["Massachusetts","MA-511","Quincy, Brockton, Weymouth, Plymouth City and County CoC"]
["Massachusetts","MA-515","Fall River CoC"]
["Massachusetts","MA-516","Massachusetts Balance of State CoC"]
["Massachusetts","MA-517","Somerville CoC"]
["Massachusetts","MA-519","Attleboro, Taunton/Bristol County CoC"]
["Michigan","MI-500","Michigan Balance of State CoC"]
["Michigan","MI-501","Detroit CoC"]
["Michigan","MI-502","Dearborn, Dearborn Heights, Westland/Wayne County CoC"]
["Michigan","MI-503","Saint Clair Shores, Warren/Macomb County CoC"]
["Michigan","MI-504","Pontiac, Royal Oak/Oakland County CoC"]
["Michigan","MI-505","Flint/Genesee County CoC"]
["Michigan","MI-506","Grand Rapids/Wyoming/Kent County CoC"]
["Michigan","MI-507","Portage, Kalamazoo City and County CoC"]
["Michigan","MI-508","Lansing, East Lansing/Ingham County CoC"]
["Michigan","MI-509","Washtenaw County CoC"]
["Michigan","MI-510","Saginaw City and County CoC"]
["Michigan","MI-511","Lenawee County CoC"]
["Michigan","MI-512","Grand Traverse, Antrim, Leelanau Counties CoC"]
["Michigan","MI-513","Marquette, Alger Counties CoC"]
["Michigan","MI-514","Battle Creek/Calhoun County CoC"]
["Michigan","MI-515","Monroe City and County CoC"]
["Michigan","MI-516","Norton Shores, Muskegon City and County CoC"]
["Michigan","MI-517","Jackson City and County CoC"]
["Michigan","MI-518","Livingston County CoC"]
["Michigan","MI-519","Holland/Ottawa County CoC"]
["Michigan","MI-523","Eaton County CoC"]
["Minnesota","MN-500","Minneapolis/Hennepin County CoC"]
["Minnesota","MN-501","Saint Paul/Ramsey County CoC"]
["Minnesota","MN-502","Rochester/Southeast Minnesota CoC"]
["Minnesota","MN-503","Dakota, Anoka, Washington, Scott, Carver Counties CoC"]
["Minnesota","MN-504","Northeast Minnesota CoC"]
["Minnesota","MN-505","Saint Cloud/Central Minnesota CoC"]
["Minnesota","MN-506","Northwest Minnesota CoC"]
["Minnesota","MN-508","Moorhead/West Central Minnesota CoC"]
["Minnesota","MN-509","Duluth/Saint Louis County CoC"]
["Minnesota","MN-511","Southwest Minnesota CoC"]
["Mississippi","MS-500","Jackson/Rankin, Madison Counties CoC"]
["Mississippi","MS-501","Mississippi Balance of State CoC"]
["Mississippi","MS-503","Gulf Port/Gulf Coast Regional CoC"]
["Missouri","MO-500","Saint Louis County CoC"]
["Missouri","MO-501","Saint Louis CoC"]
["Missouri","MO-503","Saint Charles City and County, Lincoln, Warren Counties CoC"]
["Missouri","MO-600","Springfield/Greene, Christian, Webster Counties CoC"]
["Missouri","MO-602","Joplin/Jasper, Newton Counties CoC"]
["Missouri","MO-603","Saint Joseph/Andrew, Buchanan, DeKalb Counties CoC"]
["Missouri","MO-604","Kansas City, Independence, Lee's Summit/Jackson, Wyandotte Counties CoC"]
["Missouri","MO-606","Missouri Balance of State CoC"]
["Montana","MT-500","Montana Statewide CoC"]
["Nebraska","NE-500","Nebraska Balance of State CoC"]
["Nebraska","NE-501","Omaha, Council Bluffs CoC"]
["Nebraska","NE-502","Lincoln CoC"]
["Nevada","NV-500","Las Vegas/Clark County CoC"]
["Nevada","NV-501","Reno, Sparks/Washoe County CoC"]
["Nevada","NV-502","Nevada Balance of State CoC"]
["New Hampshire","NH-500","New Hampshire Balance of State CoC"]
["New Hampshire","NH-501","Manchester CoC"]
["New Hampshire","NH-502","Nashua/Hillsborough County CoC"]
["New Jersey","NJ-500","Atlantic City and County CoC"]
["New Jersey","NJ-501","Bergen County CoC"]
["New Jersey","NJ-502","Burlington County CoC"]
["New Jersey","NJ-503","Camden City and County/Gloucester, Cape May, Cumberland Counties CoC"]
["New Jersey","NJ-504","Newark/Essex County CoC"]
["New Jersey","NJ-506","Jersey City, Bayonne/Hudson County CoC"]
["New Jersey","NJ-507","New Brunswick/Middlesex County CoC"]
["New Jersey","NJ-508","Monmouth County CoC"]
["New Jersey","NJ-509","Morris County CoC"]
["New Jersey","NJ-510","Lakewood Township/Ocean County CoC"]
["New Jersey","NJ-511","Paterson/Passaic County CoC"]
["New Jersey","NJ-512","Salem County CoC"]
["New Jersey","NJ-513","Somerset County CoC"]
["New Jersey","NJ-514","Trenton/Mercer County CoC"]
["New Jersey","NJ-515","Elizabeth/Union County CoC"]
["New Jersey","NJ-516","Warren, Sussex, Hunterdon Counties CoC"]
["New Mexico","NM-500","Albuquerque CoC"]
["New Mexico","NM-501","New Mexico Balance of State CoC"]
["New York","NY-501","Elmira/Steuben, Allegany, Livingston, Chemung, Schuyler Counties CoC"]
["New York","NY-503","Albany City and County CoC"]
["New York","NY-504","Cattaraugus County CoC"]
["New York","NY-505","Syracuse, Auburn/Onondaga, Oswego, Cayuga Counties CoC"]
["New York","NY-507","Schenectady City and County CoC"]
["New York","NY-508","Buffalo, Niagara Falls/Erie, Niagara, Orleans, Genesee, Wyoming Counties CoC"]
["New York","NY-510","Ithaca/Tompkins County CoC"]
["New York","NY-511","Binghamton, Union Town/Broome, Otsego, Chenango, Delaware, Cortland, Tioga Counties CoC"]
["New York","NY-512","Troy/Rensselaer County CoC"]
["New York","NY-513","Wayne, Ontario, Seneca, Yates Counties CoC"]
["New York","NY-514","Jamestown, Dunkirk/Chautauqua County CoC"]
["New York","NY-516","Clinton County CoC"]
["New York","NY-518","Utica, Rome/Oneida, Madison Counties CoC"]
["New York","NY-519","Columbia, Greene Counties CoC"]
["New York","NY-520","Franklin, Essex Counties CoC"]
["New York","NY-522","Jefferson, Lewis, Saint Lawrence Counties CoC"]
["New York","NY-523","Glens Falls, Saratoga Springs/Saratoga, Washington, Warren, Hamilton Counties CoC"]
["New York","NY-600","New York City CoC"]
["New York","NY-601","Poughkeepsie/Dutchess County CoC"]
["New York","NY-602","Newburgh, Middletown/Orange County CoC"]
["New York","NY-603","Nassau, Suffolk Counties CoC"]
["New York","NY-604","Yonkers, Mount Vernon/Westchester County CoC"]
["New York","NY-606","Rockland County CoC"]
["New York","NY-607","Sullivan County CoC"]
["New York","NY-608","Kingston/Ulster County CoC"]
["New York","NY-500","Rochester, Irondequoit, Greece/Monroe County CoC"]
["North Carolina","NC-500","Winston-Salem/Forsyth County CoC"]
["North Carolina","NC-501","Asheville/Buncombe County CoC"]
["North Carolina","NC-502","Durham City and County CoC"]
["North Carolina","NC-503","North Carolina Balance of State CoC"]
["North Carolina","NC-504","Greensboro, High Point CoC"]
["North Carolina","NC-505","Charlotte/Mecklenburg County CoC"]
["North Carolina","NC-506","Wilmington/Brunswick, New Hanover, Pender Counties CoC"]
["North Carolina","NC-507","Raleigh/Wake County CoC"]
["North Carolina","NC-509","Gastonia/Cleveland, Gaston, Lincoln Counties CoC"]
["North Carolina","NC-511","Fayetteville/Cumberland County CoC"]
["North Carolina","NC-513","Chapel Hill/Orange County CoC"]
["North Carolina","NC-516","Northwest North Carolina CoC"]
["North Dakota","ND-500","North Dakota Statewide CoC"]
["Ohio","OH-500","Cincinnati/Hamilton County CoC"]
["Ohio","OH-501","Toledo/Lucas County CoC"]
["Ohio","OH-502","Cleveland/Cuyahoga County CoC"]
["Ohio","OH-503","Columbus/Franklin County CoC"]
["Ohio","OH-504","Youngstown/Mahoning County CoC"]
["Ohio","OH-505","Dayton, Kettering/Montgomery County CoC"]
["Ohio","OH-506","Akron, Barberton/Summit County CoC"]
["Ohio","OH-507","Ohio Balance of State CoC"]
["Ohio","OH-508","Canton, Massillon, Alliance/Stark County CoC"]
["Oklahoma","OK-500","North Central Oklahoma CoC"]
["Oklahoma","OK-501","Tulsa City and County CoC"]
["Oklahoma","OK-502","Oklahoma City CoC"]
["Oklahoma","OK-503","Oklahoma Balance of State CoC"]
["Oklahoma","OK-504","Norman/Cleveland County CoC"]
["Oklahoma","OK-505","Northeast Oklahoma CoC"]
["Oklahoma","OK-506","Southwest Oklahoma Regional CoC"]
["Oklahoma","OK-507","Southeastern Oklahoma Regional CoC"]
["Oregon","OR-500","Eugene, Springfield/Lane County CoC"]
["Oregon","OR-501","Portland, Gresham/Multnomah County CoC"]
["Oregon","OR-502","Medford, Ashland/Jackson County CoC"]
["Oregon","OR-503","Central Oregon CoC"]
["Oregon","OR-505","Oregon Balance of State CoC"]
["Oregon","OR-506","Hillsboro, Beaverton/Washington County CoC"]
["Oregon","OR-507","Clackamas County CoC"]
["Pennsylvania","PA-500","Philadelphia CoC"]
["Pennsylvania","PA-501","Harrisburg/Dauphin County CoC"]
["Pennsylvania","PA-502","Upper Darby, Chester, Haverford/Delaware County CoC"]
["Pennsylvania","PA-503","Wilkes-Barre, Hazleton, Luzerne County CoC"]
["Pennsylvania","PA-504","Lower Merion, Norristown, Abington/Montgomery County CoC"]
["Pennsylvania","PA-505","Chester County CoC"]
["Pennsylvania","PA-506","Reading/Berks County CoC"]
["Pennsylvania","PA-508","Scranton/Lackawanna County CoC"]
["Pennsylvania","PA-509","Eastern Pennsylvania CoC"]
["Pennsylvania","PA-510","Lancaster City and County CoC"]
["Pennsylvania","PA-511","Bristol, Bensalem/Bucks County CoC"]
["Pennsylvania","PA-512","York City and County CoC"]
["Pennsylvania","PA-600","Pittsburgh, McKeesport, Penn Hills/Allegheny County CoC"]
["Pennsylvania","PA-601","Western Pennsylvania CoC"]
["Pennsylvania","PA-603","Beaver County CoC"]
["Pennsylvania","PA-605","Erie City and County CoC"]
["Puerto Rico","PR-502","Puerto Rico Balance of Commonwealth CoC"]
["Puerto Rico","PR-503","South-Southeast Puerto Rico CoC"]
["Rhode Island","RI-500","Rhode Island Statewide CoC"]
["South Carolina","SC-500","Charleston/Low Country CoC"]
["South Carolina","SC-501","Greenville, Anderson, Spartanburg/Upstate CoC"]
["South Carolina","SC-502","Columbia/Midlands CoC"]
["South Carolina","SC-503","Myrtle Beach, Sumter City and County CoC"]
["South Dakota","SD-500","South Dakota Statewide CoC"]
["Tennessee","TN-500","Chattanooga/Southeast Tennessee CoC"]
["Tennessee","TN-501","Memphis/Shelby County CoC"]
["Tennessee","TN-502","Knoxville/Knox County CoC"]
["Tennessee","TN-503","Central Tennessee CoC"]
["Tennessee","TN-504","Nashville-Davidson County CoC"]
["Tennessee","TN-506","Upper Cumberland CoC"]
["Tennessee","TN-507","Jackson/West Tennessee CoC"]
["Tennessee","TN-509","Appalachian Regional CoC"]
["Tennessee","TN-510","Murfreesboro/Rutherford County CoC"]
["Tennessee","TN-512","Morristown/Blount, Sevier, Campbell, Cocke Counties CoC"]
["Texas","TX-500","San Antonio/Bexar County CoC"]
["Texas","TX-503","Austin/Travis County CoC"]
["Texas","TX-600","Dallas City and County, Irving CoC"]
["Texas","TX-601","Fort Worth, Arlington/Tarrant County CoC"]
["Texas","TX-603","El Paso City and County CoC"]
["Texas","TX-604","Waco/McLennan County CoC"]
["Texas","TX-607","Texas Balance of State CoC"]
["Texas","TX-611","Amarillo CoC"]
["Texas","TX-624","Wichita Falls/Wise, Palo Pinto, Wichita, Archer Counties CoC"]
["Texas","TX-700","Houston, Pasadena, Conroe/Harris, Fort Bend, Montgomery Counties CoC"]
["Texas","TX-701","Bryan, College Station/Brazos Valley CoC"]
["Utah","UT-500","Salt Lake City and County CoC"]
["Utah","UT-503","Utah Balance of State CoC"]
["Utah","UT-504","Provo/Mountainland CoC"]
["Vermont","VT-500","Vermont Balance of State CoC"]
["Vermont","VT-501","Burlington/Chittenden County CoC"]
["Virgin Islands (U.S.)","VI-500","Virgin Islands CoC"]
["Virginia","VA-500","Richmond/Henrico, Chesterfield, Hanover Counties CoC"]
["Virginia","VA-501","Norfolk, Chesapeake, Suffolk/Isle of Wight, Southampton Counties CoC"]
["Virginia","VA-502","Roanoke City and County, Salem CoC"]
["Virginia","VA-503","Virginia Beach CoC"]
["Virginia","VA-504","Charlottesville CoC"]
["Virginia","VA-505","Newport News, Hampton/Virginia Peninsula CoC"]
["Virginia","VA-507","Portsmouth CoC"]
["Virginia","VA-508","Lynchburg CoC"]
["Virginia","VA-513","Harrisonburg, Winchester/Western Virginia CoC"]
["Virginia","VA-514","Fredericksburg/Spotsylvania, Stafford Counties CoC"]
["Virginia","VA-521","Virginia Balance of State CoC"]
["Virginia","VA-600","Arlington County CoC"]
["Virginia","VA-601","Fairfax County CoC"]
["Virginia","VA-602","Loudoun County CoC"]
["Virginia","VA-603","Alexandria CoC"]
["Virginia","VA-604","Prince William County CoC"]
["Washington","WA-500","Seattle/King County CoC"]
["Washington","WA-501","Washington Balance of State CoC"]
["Washington","WA-502","Spokane City and County CoC"]
["Washington","WA-503","Tacoma, Lakewood/Pierce County CoC"]
["Washington","WA-504","Everett/Snohomish County CoC"]
["Washington","WA-507","Yakima City and County CoC"]
["Washington","WA-508","Vancouver/Clark County CoC"]
["West Virginia","WV-500","Wheeling, Weirton Area CoC"]
["West Virginia","WV-501","Huntington/Cabell, Wayne Counties CoC"]
["West Virginia","WV-503","Charleston/Kanawha, Putnam, Boone, Clay Counties CoC"]
["West Virginia","WV-508","West Virginia Balance of State CoC"]
["Wisconsin","WI-500","Wisconsin Balance of State CoC"]
["Wisconsin","WI-501","Milwaukee City and County CoC"]
["Wisconsin","WI-502","Racine City and County CoC"]
["Wisconsin","WI-503","Madison/Dane County CoC"]
["Wyoming","WY-500","Wyoming Statewide CoC"]

{"sheet":"Opportunity Zones","index":4,"n_rows":8767,"n_cols":5,"rows_kept":8767}
[null,"Designated Qualified Opportunity Zones"]
["This document was updated December 14, 2018, to reflect the final Qualified Opportunity Zone designations for all States."]
["State","County","Census Tract Number","Tract Type","ACS Data Source"]
["Alabama","Autauga","01001020700","Low-Income Community","2011-2015"]
["Alabama","Baldwin","01003010200","Low-Income Community","2011-2015"]
["Alabama","Baldwin","01003010400","Non-LIC Contiguous","2011-2015"]
["Alabama","Baldwin","01003010500","Low-Income Community","2011-2015"]
["Alabama","Baldwin","01003010600","Low-Income Community","2011-2015"]
["Alabama","Baldwin","01003011501","Non-LIC Contiguous","2011-2015"]
["Alabama","Baldwin","01003011502","Low-Income Community","2011-2015"]
["Alabama","Barbour","01005950100","Low-Income Community","2011-2015"]
["Alabama","Bibb","01007010002","Low-Income Community","2011-2015"]
["Alabama","Blount","01009050500","Low-Income Community","2011-2015"]
["Alabama","Bullock","01011952200","Low-Income Community","2011-2015"]
["Alabama","Butler","01013952800","Low-Income Community","2012-2016"]
["Alabama","Calhoun","01015000700","Low-Income Community","2011-2015"]
["Alabama","Calhoun","01015000800","Low-Income Community","2011-2015"]
["Alabama","Calhoun","01015002101","Low-Income Community","2011-2015"]
["Alabama","Chambers","01017954300","Low-Income Community","2011-2015"]
["Alabama","Cherokee","01019955900","Low-Income Community","2011-2015"]
["Alabama","Chilton","01021060102","Low-Income Community","2011-2015"]
["Alabama","Choctaw","01023956800","Low-Income Community","2011-2015"]
["Alabama","Clarke","01025957902","Low-Income Community","2011-2015"]
["Alabama","Clay","01027959000","Low-Income Community","2011-2015"]
["Alabama","Cleburne","01029959600","Low-Income Community","2011-2015"]
["Alabama","Coffee","01031010900","Low-Income Community","2011-2015"]
["Alabama","Colbert","01033020200","Low-Income Community","2011-2015"]
["Alabama","Conecuh","01035960400","Low-Income Community","2011-2015"]
["Alabama","Coosa","01037961000","Low-Income Community","2011-2015"]
["Alabama","Covington","01039962000","Low-Income Community","2011-2015"]
["Alabama","Covington","01039962700","Low-Income Community","2011-2015"]
["Alabama","Crenshaw","01041963700","Low-Income Community","2011-2015"]
["Alabama","Cullman","01043964800","Low-Income Community","2011-2015"]
["Alabama","Cullman","01043965000","Low-Income Community","2011-2015"]
["Alabama","Dale","01045020700","Low-Income Community","2011-2015"]
["Alabama","Dallas","01047956500","Low-Income Community","2011-2015"]
["Alabama","DeKalb","01049960900","Low-Income Community","2011-2015"]
["Alabama","Elmore","01051031000","Low-Income Community","2011-2015"]
["Alabama","Elmore","01051031300","Low-Income Community","2011-2015"]
["Alabama","Escambia","01053970400","Low-Income Community","2011-2015"]
["Alabama","Etowah","01055001200","Low-Income Community","2011-2015"]
["Alabama","Fayette","01057020300","Low-Income Community","2011-2015"]
["Alabama","Franklin","01059973700","Low-Income Community","2011-2015"]
["Alabama","Geneva","01061050300","Low-Income Community","2011-2015"]
["Alabama","Greene","01063060200","Low-Income Community","2011-2015"]
["Alabama","Hale","01065040400","Low-Income Community","2011-2015"]
["Alabama","Henry","01067030200","Low-Income Community","2011-2015"]
["Alabama","Houston","01069041500","Low-Income Community","2011-2015"]
["Alabama","Jackson","01071950600","Low-Income Community","2011-2015"]
["Alabama","Jefferson","01073000100","Low-Income Community","2011-2015"]
["Alabama","Jefferson","01073000300","Low-Income Community","2011-2015"]
["Alabama","Jefferson","01073000400","Low-Income Community","2011-2015"]
["Alabama","Jefferson","01073000500","Low-Income Community","2011-2015"]
["Alabama","Jefferson","01073000700","Low-Income Community","2011-2015"]
["Alabama","Jefferson","01073000800","Low-Income Community","2011-2015"]
["Alabama","Jefferson","01073001200","Low-Income Community","2011-2015"]
["Alabama","Jefferson","01073001400","Low-Income Community","2011-2015"]
["Alabama","Jefferson","01073001500","Low-Income Community","2011-2015"]
["Alabama","Jefferson","01073001600","Low-Income Community","2011-2015"]
["Alabama","Jefferson","01073001902","Low-Income Community","2011-2015"]
["Alabama","Jefferson","01073002200","Low-Income Community","2011-2015"]
["Alabama","Jefferson","01073002303","Low-Income Community","2011-2015"]
["Alabama","Jefferson","01073002400","Low-Income Community","2011-2015"]
["Alabama","Jefferson","01073002700","Low-Income Community","2011-2015"]
["Alabama","Jefferson","01073002900","Low-Income Community","2011-2015"]
["Alabama","Jefferson","01073003001","Low-Income Community","2011-2015"]
["Alabama","Jefferson","01073003002","Low-Income Community","2011-2015"]
["Alabama","Jefferson","01073003200","Low-Income Community","2011-2015"]
["Alabama","Jefferson","01073003900","Low-Income Community","2011-2015"]
["Alabama","Jefferson","01073004200","Low-Income Community","2011-2015"]
["Alabama","Jefferson","01073004500","Low-Income Community","2011-2015"]
["Alabama","Jefferson","01073010200","Low-Income Community","2011-2015"]
["Alabama","Jefferson","01073011209","Low-Income Community","2011-2015"]
["Alabama","Jefferson","01073011705","Non-LIC Contiguous","2011-2015"]
["Alabama","Jefferson","01073012002","Low-Income Community","2011-2015"]
["Alabama","Jefferson","01073012701","Low-Income Community","2011-2015"]
["Alabama","Jefferson","01073013100","Low-Income Community","2011-2015"]
["Alabama","Lamar","01075030100","Low-Income Community","2011-2015"]
["Alabama","Lauderdale","01077010100","Low-Income Community","2011-2015"]
["Alabama","Lauderdale","01077010900","Low-Income Community","2011-2015"]
["Alabama","Lawrence","01079979100","Low-Income Community","2011-2015"]
["Alabama","Lee","01081040200","Low-Income Community","2011-2015"]
["Alabama","Lee","01081040300","Low-Income Community","2011-2015"]
["Alabama","Lee","01081040604","Low-Income Community","2011-2015"]
["Alabama","Lee","01081040700","Low-Income Community","2011-2015"]
["Alabama","Lee","01081040800","Low-Income Community","2011-2015"]
["Alabama","Lee","01081041100","Low-Income Community","2011-2015"]
["Alabama","Lee","01081041300","Low-Income Community","2011-2015"]
["Alabama","Limestone","01083020201","Low-Income Community","2011-2015"]
["Alabama","Limestone","01083020600","Low-Income Community","2011-2015"]
["Alabama","Limestone","01083020700","Low-Income Community","2011-2015"]
["Alabama","Lowndes","01085780800","Low-Income Community","2011-2015"]
["Alabama","Macon","01087231500","Low-Income Community","2011-2015"]
["Alabama","Macon","01087231603","Low-Income Community","2011-2015"]
["Alabama","Macon","01087232200","Low-Income Community","2011-2015"]
["Alabama","Madison","01089000201","Low-Income Community","2011-2015"]
["Alabama","Madison","01089000202","Low-Income Community","2011-2015"]
["Alabama","Madison","01089001301","Low-Income Community","2011-2015"]
["Alabama","Madison","01089001402","Low-Income Community","2011-2015"]
["Alabama","Madison","01089001500","Low-Income Community","2011-2015"]
["Alabama","Madison","01089002100","Low-Income Community","2011-2015"]
["Alabama","Madison","01089002501","Low-Income Community","2011-2015"]
["Alabama","Madison","01089003000","Low-Income Community","2011-2015"]
["Alabama","Madison","01089003100","Low-Income Community","2011-2015"]
["Alabama","Madison","01089010622","Low-Income Community","2011-2015"]
["Alabama","Marengo","01091972900","Low-Income Community","2011-2015"]
["Alabama","Marion","01093964400","Low-Income Community","2011-2015"]
["Alabama","Marion","01093964500","Non-LIC Contiguous","2011-2015"]
["Alabama","Marshall","01095030100","Low-Income Community","2011-2015"]
["Alabama","Mobile","01097000200","Low-Income Community","2011-2015"]
["Alabama","Mobile","01097000401","Low-Income Community","2011-2015"]
["Alabama","Mobile","01097000600","Low-Income Community","2011-2015"]
["Alabama","Mobile","01097001002","Low-Income Community","2011-2015"]
["Alabama","Mobile","01097001200","Low-Income Community","2011-2015"]
["Alabama","Mobile","01097001302","Low-Income Community","2011-2015"]
["Alabama","Mobile","01097001400","Low-Income Community","2011-2015"]
["Alabama","Mobile","01097001501","Low-Income Community","2011-2015"]
["Alabama","Mobile","01097001502","Low-Income Community","2011-2015"]
["Alabama","Mobile","01097002600","Low-Income Community","2011-2015"]
["Alabama","Mobile","01097002800","Low-Income Community","2011-2015"]
["Alabama","Mobile","01097003402","Low-Income Community","2011-2015"]
["Alabama","Mobile","01097006403","Low-Income Community","2011-2015"]
["Alabama","Mobile","01097007400","Low-Income Community","2011-2015"]
["Alabama","Monroe","01099076000","Low-Income Community","2011-2015"]
["Alabama","Montgomery","01101000100","Low-Income Community","2011-2015"]
["Alabama","Montgomery","01101000200","Low-Income Community","2011-2015"]
["Alabama","Montgomery","01101000300","Low-Income Community","2011-2015"]
["Alabama","Montgomery","01101000500","Low-Income Community","2011-2015"]
["Alabama","Montgomery","01101000600","Low-Income Community","2011-2015"]
["Alabama","Montgomery","01101001000","Low-Income Community","2011-2015"]
["Alabama","Montgomery","01101001100","Low-Income Community","2011-2015"]
["Alabama","Montgomery","01101002100","Low-Income Community","2011-2015"]
["Alabama","Montgomery","01101002900","Low-Income Community","2011-2015"]
["Alabama","Montgomery","01101005603","Low-Income Community","2011-2015"]
["Alabama","Montgomery","01101005902","Low-Income Community","2011-2015"]
["Alabama","Montgomery","01101006000","Low-Income Community","2011-2015"]
["Alabama","Morgan","01103000100","Low-Income Community","2011-2015"]
["Alabama","Perry","01105687000","Low-Income Community","2011-2015"]
["Alabama","Pickens","01107050100","Low-Income Community","2011-2015"]
["Alabama","Pike","01109189100","Low-Income Community","2011-2015"]
["Alabama","Randolph","01111000500","Low-Income Community","2011-2015"]
["Alabama","Russell","01113030200","Low-Income Community","2011-2015"]
["Alabama","St. Clair","01115040203","Low-Income Community","2011-2015"]
["Alabama","Shelby","01117030703","Low-Income Community","2011-2015"]
["Alabama","Sumter","01119011300","Low-Income Community","2011-2015"]
["Alabama","Talladega","01121010900","Low-Income Community","2011-2015"]
["Alabama","Tallapoosa","01123962300","Low-Income Community","2011-2015"]
["Alabama","Tuscaloosa","01125010403","Low-Income Community","2011-2015"]
["Alabama","Tuscaloosa","01125010404","Low-Income Community","2011-2015"]
["Alabama","Tuscaloosa","01125011600","Low-Income Community","2011-2015"]
["Alabama","Tuscaloosa","01125011701","Low-Income Community","2011-2015"]
["Alabama","Tuscaloosa","01125011800","Low-Income Community","2011-2015"]
["Alabama","Tuscaloosa","01125012100","Low-Income Community","2011-2015"]
["Alabama","Tuscaloosa","01125012303","Non-LIC Contiguous","2011-2015"]
["Alabama","Tuscaloosa","01125012405","Low-Income Community","2011-2015"]
["Alabama","Tuscaloosa","01125012600","Low-Income Community","2011-2015"]
["Alabama","Tuscaloosa","01125012800","Low-Income Community","2011-2015"]
["Alabama","Walker","01127020400","Low-Income Community","2011-2015"]
["Alabama","Washington","01129044200","Low-Income Community","2011-2015"]
["Alabama","Wilcox","01131035100","Low-Income Community","2011-2015"]
["Alabama","Winston","01133965700","Low-Income Community","2011-2015"]
["Alaska","Aleutians East","02013000100","Low-Income Community","2011-2015"]
["Alaska","Aleutians West","02016000100","Low-Income Community","2011-2015"]
["Alaska","Anchorage","02020000300","Low-Income Community","2011-2015"]
["Alaska","Anchorage","02020000600","Low-Income Community","2011-2015"]
["Alaska","Anchorage","02020000702","Low-Income Community","2011-2015"]
["Alaska","Anchorage","02020000703","Low-Income Community","2011-2015"]
["Alaska","Anchorage","02020001000","Low-Income Community","2011-2015"]
["Alaska","Anchorage","02020001900","Low-Income Community","2011-2015"]
["Alaska","Anchorage","02020002000","Low-Income Community","2011-2015"]
["Alaska","Bethel","02050000300","Low-Income Community","2011-2015"]
["Alaska","Fairbanks North Star","02090000100","Low-Income Community","2011-2015"]
["Alaska","Fairbanks North Star","02090000200","Low-Income Community","2011-2015"]
["Alaska","Fairbanks North Star","02090001100","Low-Income Community","2011-2015"]
["Alaska","Haines","02100000100","Low-Income Community","2012-2016"]
["Alaska","Hoonah-Angoon","02105000300","Low-Income Community","2011-2015"]
["Alaska","Kenai Peninsula","02122000100","Low-Income Community","2011-2015"]
["Alaska","Matanuska-Susitna","02170000401","Low-Income Community","2011-2015"]
["Alaska","Matanuska-Susitna","02170000701","Low-Income Community","2012-2016"]
["Alaska","Nome","02180000100","Low-Income Community","2011-2015"]
["Alaska","North Slope","02185000200","Low-Income Community","2011-2015"]
["Alaska","Northwest Arctic","02188000100","Low-Income Community","2011-2015"]
["Alaska","Prince of Wales-Hyder","02198000100","Low-Income Community","2011-2015"]
["Alaska","Prince of Wales-Hyder","02198940100","Low-Income Community","2011-2015"]
["Alaska","Wrangell","02275000300","Low-Income Community","2011-2015"]
["Alaska","Yukon-Koyukuk","02290000200","Low-Income Community","2011-2015"]
["American Samoa","Eastern","60010950100","Low-Income Community","2011-2015"]
["American Samoa","Eastern","60010950200","Low-Income Community","2011-2015"]
["American Samoa","Eastern","60010950300","Low-Income Community","2011-2015"]
["American Samoa","Eastern","60010950500","Low-Income Community","2011-2015"]
["American Samoa","Eastern","60010950600","Low-Income Community","2011-2015"]
["American Samoa","Eastern","60010950700","Low-Income Community","2011-2015"]
["American Samoa","Eastern","60010950900","Low-Income Community","2011-2015"]
["American Samoa","Manu'a ","60020951800","Low-Income Community","2011-2015"]
["American Samoa","Western ","60050951000","Low-Income Community","2011-2015"]
["American Samoa","Western ","60050951100","Low-Income Community","2011-2015"]
["American Samoa","Western ","60050951201","Low-Income Community","2011-2015"]
["American Samoa","Western ","60050951202","Low-Income Community","2011-2015"]
["American Samoa","Western ","60050951203","Low-Income Community","2011-2015"]
["American Samoa","Western ","60050951300","Low-Income Community","2011-2015"]
["American Samoa","Western ","60050951500","Low-Income Community","2011-2015"]
["American Samoa","Western ","60050951600","Low-Income Community","2011-2015"]
["Arizona","Apache","04001945100","Low-Income Community","2011-2015"]
["Arizona","Apache","04001970200","Low-Income Community","2011-2015"]
["Arizona","Apache","04001970502","Non-LIC Contiguous","2011-2015"]
["Arizona","Cochise","04003000301","Low-Income Community","2011-2015"]
["Arizona","Cochise","04003000600","Low-Income Community","2011-2015"]
["Arizona","Cochise","04003001100","Low-Income Community","2011-2015"]
["Arizona","Cochise","04003001702","Low-Income Community","2011-2015"]
["Arizona","Coconino","04005000900","Low-Income Community","2011-2015"]
["Arizona","Coconino","04005002200","Non-LIC Contiguous","2011-2015"]
["Arizona","Coconino","04005002300","Low-Income Community","2011-2015"]
["Arizona","Coconino","04005942202","Low-Income Community","2011-2015"]
["Arizona","Coconino","04005945000","Low-Income Community","2011-2015"]
["Arizona","Coconino","04005945100","Low-Income Community","2011-2015"]
["Arizona","Coconino","04005945200","Low-Income Community","2011-2015"]
["Arizona","Gila","04007000900","Low-Income Community","2011-2015"]
["Arizona","Gila","04007001100","Low-Income Community","2012-2016"]
["Arizona","Gila","04007940400","Low-Income Community","2011-2015"]
["Arizona","Graham","04009961201","Low-Income Community","2011-2015"]
["Arizona","Greenlee","04011960100","Non-LIC Contiguous","2011-2015"]
["Arizona","Greenlee","04011960300","Low-Income Community","2011-2015"]
["Arizona","La Paz","04012020100","Low-Income Community","2011-2015"]
["Arizona","La Paz","04012940300","Low-Income Community","2011-2015"]
["Arizona","Maricopa","04013040502","Low-Income Community","2011-2015"]
["Arizona","Maricopa","04013050604","Low-Income Community","2011-2015"]
["Arizona","Maricopa","04013050607","Low-Income Community","2011-2015"]
["Arizona","Maricopa","04013050609","Low-Income Community","2011-2015"]
["Arizona","Maricopa","04013060801","Low-Income Community","2011-2015"]
["Arizona","Maricopa","04013060902","Low-Income Community","2011-2015"]
["Arizona","Maricopa","04013061024","Non-LIC Contiguous","2011-2015"]
["Arizona","Maricopa","04013061200","Low-Income Community","2011-2015"]
["Arizona","Maricopa","04013061300","Low-Income Community","2011-2015"]
["Arizona","Maricopa","04013071910","Low-Income Community","2011-2015"]
["Arizona","Maricopa","04013071913","Low-Income Community","2011-2015"]
["Arizona","Maricopa","04013082024","Low-Income Community","2011-2015"]
["Arizona","Maricopa","04013082208","Low-Income Community","2011-2015"]
["Arizona","Maricopa","04013092401","Low-Income Community","2011-2015"]
["Arizona","Maricopa","04013092500","Low-Income Community","2011-2015"]
["Arizona","Maricopa","04013092600","Low-Income Community","2011-2015"]
["Arizona","Maricopa","04013092900","Low-Income Community","2011-2015"]
["Arizona","Maricopa","04013093001","Low-Income Community","2011-2015"]
["Arizona","Maricopa","04013093104","Low-Income Community","2011-2015"]
["Arizona","Maricopa","04013103210","Low-Income Community","2011-2015"]
["Arizona","Maricopa","04013104205","Low-Income Community","2011-2015"]
["Arizona","Maricopa","04013104401","Low-Income Community","2011-2015"]
["Arizona","Maricopa","04013104402","Low-Income Community","2011-2015"]
["Arizona","Maricopa","04013105501","Low-Income Community","2011-2015"]
["Arizona","Maricopa","04013105502","Low-Income Community","2011-2015"]
["Arizona","Maricopa","04013105503","Low-Income Community","2011-2015"]
["Arizona","Maricopa","04013106003","Low-Income Community","2011-2015"]
["Arizona","Maricopa","04013106802","Low-Income Community","2011-2015"]
["Arizona","Maricopa","04013107201","Low-Income Community","2011-2015"]
["Arizona","Maricopa","04013107300","Low-Income Community","2011-2015"]
["Arizona","Maricopa","04013107400","Low-Income Community","2011-2015"]
["Arizona","Maricopa","04013108902","Low-Income Community","2011-2015"]
["Arizona","Maricopa","04013109002","Low-Income Community","2011-2015"]
["Arizona","Maricopa","04013109003","Low-Income Community","2011-2015"]
["Arizona","Maricopa","04013109200","Low-Income Community","2011-2015"]
["Arizona","Maricopa","04013109300","Low-Income Community","2011-2015"]
["Arizona","Maricopa","04013110100","Low-Income Community","2011-2015"]
["Arizona","Maricopa","04013111700","Low-Income Community","2011-2015"]
["Arizona","Maricopa","04013112100","Low-Income Community","2011-2015"]
["Arizona","Maricopa","04013112509","Low-Income Community","2011-2015"]
["Arizona","Maricopa","04013112512","Low-Income Community","2011-2015"]
["Arizona","Maricopa","04013112513","Low-Income Community","2011-2015"]
["Arizona","Maricopa","04013113100","Low-Income Community","2011-2015"]
["Arizona","Maricopa","04013113203","Low-Income Community","2011-2015"]
["Arizona","Maricopa","04013113300","Low-Income Community","2011-2015"]
["Arizona","Maricopa","04013113801","Low-Income Community","2011-2015"]
["Arizona","Maricopa","04013113900","Low-Income Community","2011-2015"]
["Arizona","Maricopa","04013114000","Low-Income Community","2011-2015"]
["Arizona","Maricopa","04013114100","Low-Income Community","2011-2015"]
["Arizona","Maricopa","04013114200","Low-Income Community","2011-2015"]
["Arizona","Maricopa","04013114800","Low-Income Community","2011-2015"]
["Arizona","Maricopa","04013114900","Low-Income Community","2011-2015"]
["Arizona","Maricopa","04013115200","Low-Income Community","2011-2015"]
["Arizona","Maricopa","04013115300","Low-Income Community","2011-2015"]
["Arizona","Maricopa","04013115400","Low-Income Community","2011-2015"]
["Arizona","Maricopa","04013115801","Low-Income Community","2011-2015"]
["Arizona","Maricopa","04013116500","Low-Income Community","2011-2015"]
["Arizona","Maricopa","04013116900","Low-Income Community","2011-2015"]
["Arizona","Maricopa","04013117200","Low-Income Community","2011-2015"]
["Arizona","Maricopa","04013117300","Low-Income Community","2011-2015"]
["Arizona","Maricopa","04013217201","Low-Income Community","2011-2015"]
["Arizona","Maricopa","04013218000","Low-Income Community","2011-2015"]
["Arizona","Maricopa","04013318400","Low-Income Community","2011-2015"]
["Arizona","Maricopa","04013318800","Low-Income Community","2011-2015"]
["Arizona","Maricopa","04013319104","Low-Income Community","2011-2015"]
["Arizona","Maricopa","04013319202","Low-Income Community","2011-2015"]
["Arizona","Maricopa","04013319705","Low-Income Community","2011-2015"]
["Arizona","Maricopa","04013420206","Low-Income Community","2011-2015"]
["Arizona","Maricopa","04013421302","Low-Income Community","2011-2015"]
["Arizona","Maricopa","04013421303","Low-Income Community","2011-2015"]
["Arizona","Maricopa","04013421304","Low-Income Community","2011-2015"]
["Arizona","Maricopa","04013421400","Low-Income Community","2011-2015"]
["Arizona","Maricopa","04013421501","Low-Income Community","2011-2015"]
["Arizona","Maricopa","04013421502","Low-Income Community","2011-2015"]
["Arizona","Maricopa","04013422203","Low-Income Community","2011-2015"]
["Arizona","Maricopa","04013422401","Low-Income Community","2011-2015"]
["Arizona","Maricopa","04013422641","Non-LIC Contiguous","2011-2015"]
["Arizona","Maricopa","04013522800","Low-Income Community","2011-2015"]
["Arizona","Maricopa","04013523102","Low-Income Community","2011-2015"]
["Arizona","Maricopa","04013523104","Low-Income Community","2011-2015"]
["Arizona","Maricopa","04013614700","Low-Income Community","2011-2015"]
["Arizona","Maricopa","04013723305","Low-Income Community","2011-2015"]
["Arizona","Maricopa","04013817600","Low-Income Community","2011-2015"]
["Arizona","Maricopa","04013941100","Low-Income Community","2011-2015"]
["Arizona","Maricopa","04013941300","Low-Income Community","2011-2015"]
["Arizona","Mohave","04015940400","Low-Income Community","2011-2015"]
["Arizona","Mohave","04015951602","Low-Income Community","2011-2015"]
["Arizona","Mohave","04015951900","Low-Income Community","2011-2015"]
["Arizona","Mohave","04015952400","Low-Income Community","2011-2015"]
["Arizona","Mohave","04015953900","Non-LIC Contiguous","2011-2015"]
["Arizona","Mohave","04015954800","Low-Income Community","2011-2015"]
["Arizona","Mohave","04015955000","Low-Income Community","2011-2015"]
["Arizona","Navajo","04017960500","Low-Income Community","2011-2015"]
["Arizona","Navajo","04017963300","Low-Income Community","2011-2015"]
["Arizona","Navajo","04017965300","Low-Income Community","2011-2015"]
["Arizona","Pima","04019000100","Low-Income Community","2011-2015"]
["Arizona","Pima","04019000200","Low-Income Community","2011-2015"]
["Arizona","Pima","04019000300","Low-Income Community","2011-2015"]
["Arizona","Pima","04019000400","Low-Income Community","2011-2015"]
["Arizona","Pima","04019000800","Low-Income Community","2011-2015"]
["Arizona","Pima","04019001200","Low-Income Community","2011-2015"]
["Arizona","Pima","04019001302","Low-Income Community","2011-2015"]
["Arizona","Pima","04019001303","Low-Income Community","2011-2015"]
["Arizona","Pima","04019001801","Low-Income Community","2011-2015"]
["Arizona","Pima","04019002201","Low-Income Community","2011-2015"]
["Arizona","Pima","04019002202","Low-Income Community","2011-2015"]
["Arizona","Pima","04019002300","Low-Income Community","2011-2015"]
["Arizona","Pima","04019002501","Low-Income Community","2011-2015"]
["Arizona","Pima","04019002901","Low-Income Community","2011-2015"]
["Arizona","Pima","04019003501","Low-Income Community","2011-2015"]
["Arizona","Pima","04019003802","Low-Income Community","2011-2015"]
["Arizona","Pima","04019004011","Low-Income Community","2011-2015"]
["Arizona","Pima","04019004067","Low-Income Community","2011-2015"]
["Arizona","Pima","04019004112","Low-Income Community","2011-2015"]
["Arizona","Pima","04019004115","Low-Income Community","2011-2015"]
["Arizona","Pima","04019004116","Low-Income Community","2011-2015"]
["Arizona","Pima","04019004117","Low-Income Community","2011-2015"]
["Arizona","Pima","04019004122","Low-Income Community","2011-2015"]
["Arizona","Pima","04019004504","Low-Income Community","2011-2015"]
["Arizona","Pima","04019004613","Low-Income Community","2011-2015"]
["Arizona","Pima","04019410502","Non-LIC Contiguous","2011-2015"]
["Arizona","Pima","04019940900","Low-Income Community","2011-2015"]
["Arizona","Pima","04019941000","Low-Income Community","2011-2015"]
["Arizona","Pinal","04021000310","Low-Income Community","2011-2015"]
["Arizona","Pinal","04021000400","Low-Income Community","2012-2016"]
["Arizona","Pinal","04021000700","Low-Income Community","2011-2015"]
["Arizona","Pinal","04021000901","Low-Income Community","2011-2015"]
["Arizona","Pinal","04021001000","Low-Income Community","2011-2015"]
["Arizona","Pinal","04021001500","Low-Income Community","2011-2015"]
["Arizona","Pinal","04021001900","Low-Income Community","2011-2015"]
["Arizona","Pinal","04021002103","Low-Income Community","2011-2015"]
["Arizona","Pinal","04021002300","Non-LIC Contiguous","2011-2015"]
["Arizona","Santa Cruz","04023966302","Low-Income Community","2011-2015"]
["Arizona","Santa Cruz","04023966402","Low-Income Community","2011-2015"]
["Arizona","Yavapai","04025000606","Low-Income Community","2011-2015"]
["Arizona","Yavapai","04025000900","Low-Income Community","2011-2015"]
["Arizona","Yavapai","04025001601","Low-Income Community","2011-2015"]
["Arizona","Yavapai","04025002100","Low-Income Community","2011-2015"]
["Arizona","Yuma","04027000100","Low-Income Community","2011-2015"]
["Arizona","Yuma","04027000700","Low-Income Community","2011-2015"]
["Arizona","Yuma","04027010913","Low-Income Community","2011-2015"]
["Arizona","Yuma","04027011202","Low-Income Community","2011-2015"]
["Arizona","Yuma","04027011403","Low-Income Community","2011-2015"]
["Arizona","Yuma","04027011501","Low-Income Community","2011-2015"]
["Arizona","Yuma","04027011600","Low-Income Community","2011-2015"]
["Arizona","Yuma","04027012100","Low-Income Community","2011-2015"]
["Arkansas","Arkansas","05001480400","Low-Income Community","2011-2015"]
["Arkansas","Ashley","05003960600","Low-Income Community","2011-2015"]
["Arkansas","Benton","05007020301","Low-Income Community","2011-2015"]
["Arkansas","Benton","05007021101","Low-Income Community","2011-2015"]
["Arkansas","Boone","05009790501","Low-Income Community","2011-2015"]
["Arkansas","Bradley","05011950300","Low-Income Community","2011-2015"]
["Arkansas","Carroll","05015950300","Low-Income Community","2011-2015"]
["Arkansas","Chicot","05017080300","Low-Income Community","2011-2015"]
["Arkansas","Clark","05019953900","Low-Income Community","2011-2015"]
["Arkansas","Cleburne","05023480300","Low-Income Community","2011-2015"]
["Arkansas","Columbia","05027950200","Low-Income Community","2011-2015"]
["Arkansas","Conway","05029950300","Low-Income Community","2011-2015"]
["Arkansas","Craighead","05031000101","Low-Income Community","2011-2015"]
["Arkansas","Craighead","05031000502","Low-Income Community","2011-2015"]
["Arkansas","Craighead","05031000602","Low-Income Community","2011-2015"]
["Arkansas","Crawford","05033020501","Low-Income Community","2011-2015"]
["Arkansas","Crittenden","05035030600","Low-Income Community","2011-2015"]
["Arkansas","Crittenden","05035030703","Low-Income Community","2011-2015"]
["Arkansas","Dallas","05039970300","Low-Income Community","2011-2015"]
["Arkansas","Desha","05041950100","Low-Income Community","2011-2015"]
["Arkansas","Desha","05041950200","Low-Income Community","2011-2015"]
["Arkansas","Drew","05043490300","Low-Income Community","2011-2015"]
["Arkansas","Drew","05043490400","Low-Income Community","2011-2015"]
["Arkansas","Faulkner","05045030403","Low-Income Community","2011-2015"]
["Arkansas","Faulkner","05045030702","Low-Income Community","2011-2015"]
["Arkansas","Faulkner","05045030900","Low-Income Community","2011-2015"]
["Arkansas","Franklin","05047950200","Low-Income Community","2011-2015"]
["Arkansas","Garland","05051010700","Low-Income Community","2011-2015"]
["Arkansas","Garland","05051010800","Low-Income Community","2011-2015"]
["Arkansas","Garland","05051011500","Low-Income Community","2011-2015"]
["Arkansas","Grant","05053470300","Low-Income Community","2011-2015"]
["Arkansas","Greene","05055480500","Low-Income Community","2011-2015"]
["Arkansas","Greene","05055480700","Low-Income Community","2011-2015"]
["Arkansas","Hempstead","05057480300","Low-Income Community","2011-2015"]
["Arkansas","Hot Spring","05059020200","Low-Income Community","2011-2015"]
["Arkansas","Howard","05061950300","Low-Income Community","2011-2015"]
["Arkansas","Independence","05063490200","Low-Income Community","2011-2015"]
["Arkansas","Independence","05063490600","Low-Income Community","2011-2015"]
["Arkansas","Jackson","05067480400","Low-Income Community","2011-2015"]
["Arkansas","Jefferson","05069000502","Low-Income Community","2011-2015"]
["Arkansas","Jefferson","05069001000","Low-Income Community","2011-2015"]
["Arkansas","Jefferson","05069002400","Non-LIC Contiguous","2011-2015"]
["Arkansas","Jefferson","05069002500","Low-Income Community","2011-2015"]
["Arkansas","Johnson","05071952000","Low-Income Community","2011-2015"]
["Arkansas","Lafayette","05073470100","Low-Income Community","2011-2015"]
["Arkansas","Lawrence","05075470100","Low-Income Community","2011-2015"]
["Arkansas","Little River","05081030102","Low-Income Community","2011-2015"]
["Arkansas","Logan","05083950500","Low-Income Community","2011-2015"]
["Arkansas","Marion","05089960202","Low-Income Community","2011-2015"]
["Arkansas","Miller","05091020500","Low-Income Community","2011-2015"]
["Arkansas","Mississippi","05093010700","Non-LIC Contiguous","2011-2015"]
["Arkansas","Mississippi","05093010800","Low-Income Community","2011-2015"]
["Arkansas","Mississippi","05093011100","Low-Income Community","2011-2015"]
["Arkansas","Nevada","05099090200","Low-Income Community","2011-2015"]
["Arkansas","Ouachita","05103950200","Low-Income Community","2011-2015"]
["Arkansas","Ouachita","05103950600","Low-Income Community","2011-2015"]
["Arkansas","Phillips","05107480400","Low-Income Community","2011-2015"]
["Arkansas","Phillips","05107480600","Low-Income Community","2011-2015"]
["Arkansas","Polk","05113950400","Low-Income Community","2011-2015"]
["Arkansas","Pope","05115951300","Low-Income Community","2011-2015"]
["Arkansas","Pope","05115951600","Low-Income Community","2011-2015"]
["Arkansas","Pulaski","05119000200","Low-Income Community","2011-2015"]
["Arkansas","Pulaski","05119001800","Low-Income Community","2011-2015"]
["Arkansas","Pulaski","05119002500","Low-Income Community","2011-2015"]
["Arkansas","Pulaski","05119002800","Low-Income Community","2011-2015"]
["Arkansas","Pulaski","05119003001","Low-Income Community","2011-2015"]
["Arkansas","Pulaski","05119003605","Low-Income Community","2011-2015"]
["Arkansas","Pulaski","05119004600","Low-Income Community","2011-2015"]
["Arkansas","Pulaski","05119004700","Low-Income Community","2011-2015"]
["Arkansas","St. Francis","05123960400","Low-Income Community","2011-2015"]
["Arkansas","St. Francis","05123960600","Low-Income Community","2011-2015"]
["Arkansas","Sebastian","05131000200","Low-Income Community","2011-2015"]
["Arkansas","Sebastian","05131000300","Low-Income Community","2011-2015"]
["Arkansas","Sebastian","05131000800","Low-Income Community","2011-2015"]
["Arkansas","Sevier","05133080300","Low-Income Community","2011-2015"]
["Arkansas","Union","05139950900","Low-Income Community","2011-2015"]
["Arkansas","Union","05139951000","Low-Income Community","2011-2015"]
["Arkansas","Van Buren","05141460200","Low-Income Community","2011-2015"]
["Arkansas","Washington","05143010200","Low-Income Community","2011-2015"]
["Arkansas","Washington","05143010301","Low-Income Community","2011-2015"]
["Arkansas","Washington","05143010302","Low-Income Community","2011-2015"]
["Arkansas","Washington","05143010600","Low-Income Community","2011-2015"]
["Arkansas","Washington","05143011101","Low-Income Community","2011-2015"]
["Arkansas","Washington","05143011200","Low-Income Community","2011-2015"]
["Arkansas","White","05145070800","Low-Income Community","2011-2015"]
["California","Alameda","06001401000","Low-Income Community","2011-2015"]
["California","Alameda","06001401400","Low-Income Community","2011-2015"]
["California","Alameda","06001401500","Low-Income Community","2011-2015"]
["California","Alameda","06001401600","Low-Income Community","2011-2015"]
["California","Alameda","06001401700","Low-Income Community","2011-2015"]
["California","Alameda","06001402200","Low-Income Community","2011-2015"]
["California","Alameda","06001402400","Low-Income Community","2011-2015"]
["California","Alameda","06001402500","Low-Income Community","2011-2015"]
["California","Alameda","06001402600","Low-Income Community","2011-2015"]
["California","Alameda","06001402700","Low-Income Community","2011-2015"]
["California","Alameda","06001402800","Low-Income Community","2011-2015"]
["California","Alameda","06001403300","Low-Income Community","2011-2015"]
["California","Alameda","06001405901","Low-Income Community","2011-2015"]
["California","Alameda","06001405902","Low-Income Community","2011-2015"]
["California","Alameda","06001406000","Low-Income Community","2011-2015"]
["California","Alameda","06001406100","Low-Income Community","2011-2015"]
["California","Alameda","06001406201","Low-Income Community","2011-2015"]
["California","Alameda","06001406202","Low-Income Community","2011-2015"]
["California","Alameda","06001407200","Low-Income Community","2011-2015"]
["California","Alameda","06001407300","Low-Income Community","2011-2015"]
["California","Alameda","06001408400","Low-Income Community","2011-2015"]
["California","Alameda","06001408500","Low-Income Community","2011-2015"]
["California","Alameda","06001408600","Low-Income Community","2011-2015"]
["California","Alameda","06001408700","Low-Income Community","2011-2015"]
["California","Alameda","06001408800","Low-Income Community","2011-2015"]
["California","Alameda","06001408900","Low-Income Community","2011-2015"]
["California","Alameda","06001409000","Low-Income Community","2011-2015"]
["California","Alameda","06001409500","Low-Income Community","2011-2015"]
["California","Alameda","06001409700","Low-Income Community","2011-2015"]
["California","Alameda","06001410500","Low-Income Community","2011-2015"]
["California","Alameda","06001422900","Low-Income Community","2011-2015"]
["California","Alameda","06001423200","Low-Income Community","2011-2015"]
["California","Alameda","06001423500","Low-Income Community","2011-2015"]
["California","Alameda","06001423901","Non-LIC Contiguous","2011-2015"]
["California","Alameda","06001424001","Low-Income Community","2011-2015"]
["California","Alameda","06001433102","Low-Income Community","2011-2015"]
["California","Alameda","06001433700","Low-Income Community","2011-2015"]
["California","Alameda","06001433800","Low-Income Community","2011-2015"]
["California","Alameda","06001434000","Low-Income Community","2011-2015"]
["California","Alameda","06001435400","Low-Income Community","2011-2015"]
["California","Alameda","06001435602","Low-Income Community","2011-2015"]
["California","Alameda","06001437500","Low-Income Community","2011-2015"]
["California","Alameda","06001437600","Low-Income Community","2011-2015"]
["California","Alameda","06001437701","Low-Income Community","2011-2015"]
["California","Alameda","06001438201","Low-Income Community","2011-2015"]
["California","Alameda","06001441923","Low-Income Community","2011-2015"]
["California","Alameda","06001451404","Low-Income Community","2011-2015"]
["California","Alpine","06003010000","Non-LIC Contiguous","2011-2015"]
["California","Amador","06005000102","Low-Income Community","2012-2016"]
["California","Butte","06007000502","Low-Income Community","2011-2015"]
["California","Butte","06007000604","Low-Income Community","2011-2015"]
["California","Butte","06007001000","Low-Income Community","2011-2015"]
["California","Butte","06007001100","Low-Income Community","2011-2015"]
["California","Butte","06007001200","Low-Income Community","2011-2015"]
["California","Butte","06007001300","Low-Income Community","2011-2015"]
["California","Butte","06007002800","Low-Income Community","2011-2015"]
["California","Butte","06007003001","Low-Income Community","2011-2015"]
["California","Butte","06007003002","Low-Income Community","2011-2015"]
["California","Calaveras","06009000400","Low-Income Community","2011-2015"]
["California","Colusa","06011000300","Low-Income Community","2011-2015"]
["California","Colusa","06011000500","Low-Income Community","2011-2015"]
["California","Contra Costa","06013306002","Low-Income Community","2011-2015"]
["California","Contra Costa","06013307201","Low-Income Community","2011-2015"]
["California","Contra Costa","06013307202","Low-Income Community","2011-2015"]
["California","Contra Costa","06013307205","Low-Income Community","2011-2015"]
["California","Contra Costa","06013312000","Low-Income Community","2011-2015"]
["California","Contra Costa","06013313101","Low-Income Community","2011-2015"]
["California","Contra Costa","06013313206","Low-Income Community","2011-2015"]
["California","Contra Costa","06013314103","Low-Income Community","2011-2015"]
["California","Contra Costa","06013314104","Low-Income Community","2011-2015"]
["California","Contra Costa","06013328000","Low-Income Community","2011-2015"]
["California","Contra Costa","06013336101","Low-Income Community","2011-2015"]
["California","Contra Costa","06013336202","Low-Income Community","2011-2015"]
["California","Contra Costa","06013337200","Low-Income Community","2011-2015"]
["California","Contra Costa","06013365002","Low-Income Community","2011-2015"]
["California","Contra Costa","06013369001","Low-Income Community","2011-2015"]
["California","Contra Costa","06013376000","Low-Income Community","2011-2015"]
["California","Contra Costa","06013386000","Low-Income Community","2011-2015"]
["California","Del Norte","06015000101","Low-Income Community","2011-2015"]
["California","Del Norte","06015000102","Low-Income Community","2011-2015"]
["California","El Dorado","06017030302","Low-Income Community","2011-2015"]
["California","El Dorado","06017031600","Low-Income Community","2011-2015"]
["California","El Dorado","06017031900","Low-Income Community","2011-2015"]
["California","Fresno","06019000100","Low-Income Community","2011-2015"]
["California","Fresno","06019000200","Low-Income Community","2011-2015"]
["California","Fresno","06019000300","Low-Income Community","2011-2015"]
["California","Fresno","06019000400","Low-Income Community","2011-2015"]
["California","Fresno","06019000501","Low-Income Community","2011-2015"]
["California","Fresno","06019000502","Low-Income Community","2011-2015"]
["California","Fresno","06019000600","Low-Income Community","2011-2015"]
["California","Fresno","06019000700","Low-Income Community","2011-2015"]
["California","Fresno","06019000800","Low-Income Community","2011-2015"]
["California","Fresno","06019000901","Low-Income Community","2011-2015"]
["California","Fresno","06019000902","Low-Income Community","2011-2015"]
["California","Fresno","06019001000","Low-Income Community","2011-2015"]
["California","Fresno","06019001100","Low-Income Community","2011-2015"]
["California","Fresno","06019001201","Low-Income Community","2011-2015"]
["California","Fresno","06019001202","Low-Income Community","2011-2015"]
["California","Fresno","06019001301","Low-Income Community","2011-2015"]
["California","Fresno","06019001303","Low-Income Community","2011-2015"]
["California","Fresno","06019001407","Low-Income Community","2011-2015"]
["California","Fresno","06019001410","Low-Income Community","2011-2015"]
["California","Fresno","06019001411","Low-Income Community","2011-2015"]
["California","Fresno","06019001500","Low-Income Community","2011-2015"]
["California","Fresno","06019001700","Low-Income Community","2011-2015"]
["California","Fresno","06019001800","Low-Income Community","2011-2015"]
["California","Fresno","06019001900","Low-Income Community","2011-2015"]
["California","Fresno","06019002000","Low-Income Community","2011-2015"]
["California","Fresno","06019002300","Low-Income Community","2011-2015"]
["California","Fresno","06019002400","Low-Income Community","2011-2015"]
["California","Fresno","06019002501","Low-Income Community","2011-2015"]
["California","Fresno","06019002602","Low-Income Community","2011-2015"]
["California","Fresno","06019002702","Low-Income Community","2011-2015"]
["California","Fresno","06019002800","Low-Income Community","2011-2015"]
["California","Fresno","06019002903","Low-Income Community","2011-2015"]
["California","Fresno","06019003500","Low-Income Community","2011-2015"]
["California","Fresno","06019004505","Low-Income Community","2011-2015"]
["California","Fresno","06019004901","Low-Income Community","2011-2015"]
["California","Fresno","06019005000","Low-Income Community","2011-2015"]
["California","Fresno","06019005100","Low-Income Community","2011-2015"]
["California","Fresno","06019005403","Low-Income Community","2011-2015"]
["California","Fresno","06019005408","Low-Income Community","2011-2015"]
["California","Fresno","06019006201","Low-Income Community","2011-2015"]
["California","Fresno","06019006202","Low-Income Community","2011-2015"]
["California","Fresno","06019006501","Low-Income Community","2011-2015"]
["California","Fresno","06019006602","Low-Income Community","2011-2015"]
["California","Fresno","06019007802","Low-Income Community","2011-2015"]
["California","Fresno","06019008200","Low-Income Community","2011-2015"]
["California","Fresno","06019008302","Low-Income Community","2011-2015"]
["California","Fresno","06019008501","Low-Income Community","2011-2015"]
["California","Glenn","06021010100","Low-Income Community","2011-2015"]
["California","Glenn","06021010200","Low-Income Community","2011-2015"]
["California","Humboldt","06023000100","Low-Income Community","2011-2015"]
["California","Humboldt","06023000300","Low-Income Community","2011-2015"]
["California","Humboldt","06023000500","Low-Income Community","2011-2015"]
["California","Humboldt","06023001300","Low-Income Community","2011-2015"]
["California","Humboldt","06023010102","Low-Income Community","2011-2015"]
["California","Humboldt","06023010501","Low-Income Community","2011-2015"]
["California","Humboldt","06023940000","Low-Income Community","2011-2015"]
["California","Imperial","06025010400","Low-Income Community","2011-2015"]
["California","Imperial","06025010900","Low-Income Community","2011-2015"]
["California","Imperial","06025011300","Low-Income Community","2011-2015"]
["California","Imperial","06025011400","Low-Income Community","2011-2015"]
["California","Imperial","06025011900","Low-Income Community","2011-2015"]
["California","Imperial","06025012100","Low-Income Community","2011-2015"]
["California","Imperial","06025012200","Low-Income Community","2011-2015"]
["California","Inyo","06027000400","Low-Income Community","2011-2015"]
["California","Inyo","06027000800","Low-Income Community","2011-2015"]
["California","Kern","06029000200","Low-Income Community","2011-2015"]
["California","Kern","06029000300","Low-Income Community","2011-2015"]
["California","Kern","06029000400","Low-Income Community","2011-2015"]
["California","Kern","06029000600","Low-Income Community","2011-2015"]
["California","Kern","06029001202","Low-Income Community","2011-2015"]
["California","Kern","06029001400","Low-Income Community","2011-2015"]
["California","Kern","06029001600","Low-Income Community","2011-2015"]
["California","Kern","06029001902","Low-Income Community","2011-2015"]
["California","Kern","06029002000","Low-Income Community","2011-2015"]
["California","Kern","06029002100","Low-Income Community","2011-2015"]
["California","Kern","06029002200","Low-Income Community","2011-2015"]
["California","Kern","06029002301","Low-Income Community","2011-2015"]
["California","Kern","06029002302","Low-Income Community","2011-2015"]
["California","Kern","06029002400","Low-Income Community","2011-2015"]
["California","Kern","06029002500","Low-Income Community","2011-2015"]
["California","Kern","06029002600","Low-Income Community","2011-2015"]
["California","Kern","06029003103","Low-Income Community","2011-2015"]
["California","Kern","06029003121","Low-Income Community","2011-2015"]
["California","Kern","06029003303","Low-Income Community","2011-2015"]
["California","Kern","06029003500","Low-Income Community","2011-2015"]
["California","Kern","06029004101","Low-Income Community","2011-2015"]
["California","Kern","06029004401","Low-Income Community","2011-2015"]
["California","Kern","06029004402","Low-Income Community","2011-2015"]
["California","Kern","06029004701","Low-Income Community","2011-2015"]
["California","Kern","06029004800","Low-Income Community","2011-2015"]
["California","Kern","06029005003","Low-Income Community","2011-2015"]
["California","Kern","06029005300","Low-Income Community","2011-2015"]
["California","Kern","06029005507","Low-Income Community","2011-2015"]
["California","Kern","06029005600","Low-Income Community","2011-2015"]
["California","Kern","06029005802","Low-Income Community","2011-2015"]
["California","Kern","06029005900","Low-Income Community","2011-2015"]
["California","Kern","06029006100","Low-Income Community","2011-2015"]
["California","Kern","06029006303","Low-Income Community","2011-2015"]
["California","Kern","06029006304","Low-Income Community","2011-2015"]
["California","Kern","06029006401","Low-Income Community","2011-2015"]
["California","Kings","06031001100","Low-Income Community","2011-2015"]
["California","Kings","06031001300","Low-Income Community","2011-2015"]
["California","Kings","06031001402","Low-Income Community","2011-2015"]
["California","Kings","06031001601","Low-Income Community","2011-2015"]
["California","Kings","06031001701","Low-Income Community","2011-2015"]
["California","Lake","06033000702","Low-Income Community","2011-2015"]
["California","Lake","06033000801","Low-Income Community","2011-2015"]
["California","Lake","06033000802","Low-Income Community","2011-2015"]
["California","Lassen","06035040303","Low-Income Community","2011-2015"]
["California","Lassen","06035040304","Low-Income Community","2011-2015"]
["California","Los Angeles","06037102105","Low-Income Community","2011-2015"]
["California","Los Angeles","06037104201","Low-Income Community","2011-2015"]
["California","Los Angeles","06037104203","Low-Income Community","2011-2015"]
["California","Los Angeles","06037104310","Low-Income Community","2011-2015"]
["California","Los Angeles","06037104320","Low-Income Community","2011-2015"]
["California","Los Angeles","06037104404","Low-Income Community","2011-2015"]
["California","Los Angeles","06037104701","Low-Income Community","2011-2015"]
["California","Los Angeles","06037104703","Low-Income Community","2011-2015"]
["California","Los Angeles","06037104704","Low-Income Community","2011-2015"]
["California","Los Angeles","06037106520","Low-Income Community","2011-2015"]
["California","Los Angeles","06037106604","Low-Income Community","2011-2015"]
["California","Los Angeles","06037113233","Low-Income Community","2011-2015"]
["California","Los Angeles","06037113234","Low-Income Community","2011-2015"]
["California","Los Angeles","06037113421","Low-Income Community","2011-2015"]
["California","Los Angeles","06037115103","Low-Income Community","2011-2015"]
["California","Los Angeles","06037115201","Low-Income Community","2011-2015"]
["California","Los Angeles","06037120010","Low-Income Community","2011-2015"]
["California","Los Angeles","06037120020","Low-Income Community","2011-2015"]
["California","Los Angeles","06037120030","Low-Income Community","2011-2015"]
["California","Los Angeles","06037120103","Low-Income Community","2011-2015"]
["California","Los Angeles","06037121101","Low-Income Community","2011-2015"]
["California","Los Angeles","06037121801","Low-Income Community","2011-2015"]
["California","Los Angeles","06037121900","Low-Income Community","2011-2015"]
["California","Los Angeles","06037122120","Low-Income Community","2011-2015"]
["California","Los Angeles","06037122121","Low-Income Community","2011-2015"]
["California","Los Angeles","06037122122","Low-Income Community","2011-2015"]
["California","Los Angeles","06037122200","Non-LIC Contiguous","2011-2015"]
["California","Los Angeles","06037122410","Low-Income Community","2011-2015"]
["California","Los Angeles","06037123020","Low-Income Community","2011-2015"]
["California","Los Angeles","06037123103","Low-Income Community","2011-2015"]
["California","Los Angeles","06037123203","Low-Income Community","2011-2015"]
["California","Los Angeles","06037123205","Low-Income Community","2011-2015"]
["California","Los Angeles","06037123206","Low-Income Community","2011-2015"]
["California","Los Angeles","06037123303","Low-Income Community","2011-2015"]
["California","Los Angeles","06037123420","Low-Income Community","2011-2015"]
["California","Los Angeles","06037123901","Low-Income Community","2011-2015"]
["California","Los Angeles","06037124102","Low-Income Community","2011-2015"]
["California","Los Angeles","06037124103","Low-Income Community","2011-2015"]
["California","Los Angeles","06037124104","Low-Income Community","2011-2015"]
["California","Los Angeles","06037124105","Low-Income Community","2011-2015"]
["California","Los Angeles","06037124204","Low-Income Community","2011-2015"]
["California","Los Angeles","06037125310","Low-Income Community","2011-2015"]
["California","Los Angeles","06037125320","Low-Income Community","2011-2015"]
["California","Los Angeles","06037127210","Low-Income Community","2011-2015"]
["California","Los Angeles","06037127300","Low-Income Community","2011-2015"]
["California","Los Angeles","06037127400","Low-Income Community","2011-2015"]
["California","Los Angeles","06037127520","Low-Income Community","2011-2015"]
["California","Los Angeles","06037127712","Low-Income Community","2011-2015"]
["California","Los Angeles","06037127803","Low-Income Community","2011-2015"]
["California","Los Angeles","06037127804","Low-Income Community","2011-2015"]
["California","Los Angeles","06037127805","Low-Income Community","2011-2015"]
["California","Los Angeles","06037127806","Low-Income Community","2011-2015"]
["California","Los Angeles","06037127910","Low-Income Community","2011-2015"]
["California","Los Angeles","06037128210","Low-Income Community","2011-2015"]
["California","Los Angeles","06037128302","Low-Income Community","2011-2015"]
["California","Los Angeles","06037128303","Low-Income Community","2011-2015"]
["California","Los Angeles","06037132300","Low-Income Community","2011-2015"]
["California","Los Angeles","06037134305","Low-Income Community","2011-2015"]
["California","Los Angeles","06037134520","Low-Income Community","2011-2015"]
["California","Los Angeles","06037134521","Low-Income Community","2011-2015"]
["California","Los Angeles","06037134522","Low-Income Community","2011-2015"]
["California","Los Angeles","06037134903","Low-Income Community","2011-2015"]
["California","Los Angeles","06037135114","Low-Income Community","2012-2016"]
["California","Los Angeles","06037185203","Low-Income Community","2011-2015"]
["California","Los Angeles","06037185320","Low-Income Community","2011-2015"]
["California","Los Angeles","06037186401","Low-Income Community","2011-2015"]
["California","Los Angeles","06037186404","Low-Income Community","2011-2015"]
["California","Los Angeles","06037187102","Low-Income Community","2011-2015"]
["California","Los Angeles","06037187200","Low-Income Community","2011-2015"]
["California","Los Angeles","06037190100","Low-Income Community","2011-2015"]
["California","Los Angeles","06037190201","Low-Income Community","2011-2015"]
["California","Los Angeles","06037190202","Low-Income Community","2011-2015"]
["California","Los Angeles","06037190510","Low-Income Community","2011-2015"]
["California","Los Angeles","06037190700","Low-Income Community","2011-2015"]
["California","Los Angeles","06037190801","Low-Income Community","2011-2015"]
["California","Los Angeles","06037190802","Low-Income Community","2011-2015"]
["California","Los Angeles","06037190901","Low-Income Community","2011-2015"]
["California","Los Angeles","06037190902","Low-Income Community","2011-2015"]
["California","Los Angeles","06037191000","Low-Income Community","2011-2015"]
["California","Los Angeles","06037191110","Low-Income Community","2011-2015"]
["California","Los Angeles","06037191120","Low-Income Community","2011-2015"]
["California","Los Angeles","06037191201","Low-Income Community","2011-2015"]
["California","Los Angeles","06037191203","Low-Income Community","2011-2015"]
["California","Los Angeles","06037191204","Low-Income Community","2011-2015"]
["California","Los Angeles","06037191410","Low-Income Community","2011-2015"]
["California","Los Angeles","06037191420","Low-Income Community","2011-2015"]
["California","Los Angeles","06037191500","Low-Income Community","2011-2015"]
["California","Los Angeles","06037191710","Low-Income Community","2011-2015"]
["California","Los Angeles","06037191720","Low-Income Community","2011-2015"]
["California","Los Angeles","06037191810","Low-Income Community","2011-2015"]
["California","Los Angeles","06037191820","Low-Income Community","2011-2015"]
["California","Los Angeles","06037192610","Low-Income Community","2011-2015"]
["California","Los Angeles","06037192620","Low-Income Community","2011-2015"]
["California","Los Angeles","06037192700","Low-Income Community","2011-2015"]
["California","Los Angeles","06037199000","Low-Income Community","2011-2015"]
["California","Los Angeles","06037199120","Low-Income Community","2011-2015"]
["California","Los Angeles","06037199201","Low-Income Community","2011-2015"]
["California","Los Angeles","06037199202","Low-Income Community","2011-2015"]
["California","Los Angeles","06037199700","Low-Income Community","2011-2015"]
["California","Los Angeles","06037199800","Low-Income Community","2011-2015"]
["California","Los Angeles","06037199900","Low-Income Community","2011-2015"]
["California","Los Angeles","06037201402","Low-Income Community","2011-2015"]
["California","Los Angeles","06037201700","Low-Income Community","2011-2015"]
["California","Los Angeles","06037203300","Low-Income Community","2011-2015"]
["California","Los Angeles","06037203500","Low-Income Community","2011-2015"]
["California","Los Angeles","06037204920","Low-Income Community","2011-2015"]
["California","Los Angeles","06037205120","Low-Income Community","2011-2015"]
["California","Los Angeles","06037206020","Low-Income Community","2011-2015"]
["California","Los Angeles","06037206031","Non-LIC Contiguous","2011-2015"]
["California","Los Angeles","06037206032","Low-Income Community","2011-2015"]
["California","Los Angeles","06037206200","Low-Income Community","2011-2015"]
["California","Los Angeles","06037206300","Low-Income Community","2011-2015"]
["California","Los Angeles","06037208801","Low-Income Community","2011-2015"]
["California","Los Angeles","06037208902","Low-Income Community","2011-2015"]
["California","Los Angeles","06037208903","Low-Income Community","2011-2015"]
["California","Los Angeles","06037209401","Low-Income Community","2011-2015"]
["California","Los Angeles","06037211120","Low-Income Community","2011-2015"]
["California","Los Angeles","06037211122","Low-Income Community","2011-2015"]
["California","Los Angeles","06037211201","Low-Income Community","2011-2015"]
["California","Los Angeles","06037211202","Low-Income Community","2011-2015"]
["California","Los Angeles","06037211310","Low-Income Community","2011-2015"]
["California","Los Angeles","06037211320","Low-Income Community","2011-2015"]
["California","Los Angeles","06037211802","Low-Income Community","2011-2015"]
["California","Los Angeles","06037212101","Low-Income Community","2011-2015"]
["California","Los Angeles","06037212102","Low-Income Community","2011-2015"]
["California","Los Angeles","06037212203","Low-Income Community","2011-2015"]
["California","Los Angeles","06037212204","Low-Income Community","2011-2015"]
["California","Los Angeles","06037212303","Low-Income Community","2011-2015"]
["California","Los Angeles","06037212304","Low-Income Community","2011-2015"]
["California","Los Angeles","06037212410","Low-Income Community","2011-2015"]
["California","Los Angeles","06037213201","Low-Income Community","2011-2015"]
["California","Los Angeles","06037213310","Low-Income Community","2011-2015"]
["California","Los Angeles","06037213320","Low-Income Community","2011-2015"]
["California","Los Angeles","06037213402","Low-Income Community","2011-2015"]
["California","Los Angeles","06037218300","Low-Income Community","2011-2015"]
["California","Los Angeles","06037218400","Low-Income Community","2011-2015"]
["California","Los Angeles","06037218500","Low-Income Community","2011-2015"]
["California","Los Angeles","06037218702","Low-Income Community","2011-2015"]
["California","Los Angeles","06037219300","Low-Income Community","2011-2015"]
["California","Los Angeles","06037219800","Low-Income Community","2011-2015"]
["California","Los Angeles","06037219901","Low-Income Community","2011-2015"]
["California","Los Angeles","06037219902","Low-Income Community","2011-2015"]
["California","Los Angeles","06037220000","Low-Income Community","2011-2015"]
["California","Los Angeles","06037220100","Low-Income Community","2011-2015"]
["California","Los Angeles","06037222700","Low-Income Community","2011-2015"]
["California","Los Angeles","06037224010","Low-Income Community","2011-2015"]
["California","Los Angeles","06037224020","Low-Income Community","2011-2015"]
["California","Los Angeles","06037224200","Low-Income Community","2011-2015"]
["California","Los Angeles","06037224600","Low-Income Community","2011-2015"]
["California","Los Angeles","06037224700","Low-Income Community","2011-2015"]
["California","Los Angeles","06037226001","Low-Income Community","2011-2015"]
["California","Los Angeles","06037226002","Low-Income Community","2011-2015"]
["California","Los Angeles","06037226410","Low-Income Community","2011-2015"]
["California","Los Angeles","06037226420","Low-Income Community","2011-2015"]
["California","Los Angeles","06037227010","Low-Income Community","2011-2015"]
["California","Los Angeles","06037228600","Low-Income Community","2011-2015"]
["California","Los Angeles","06037231100","Low-Income Community","2011-2015"]
["California","Los Angeles","06037231210","Low-Income Community","2011-2015"]
["California","Los Angeles","06037231220","Low-Income Community","2011-2015"]
["California","Los Angeles","06037231300","Low-Income Community","2011-2015"]
["California","Los Angeles","06037231400","Low-Income Community","2011-2015"]
["California","Los Angeles","06037231500","Low-Income Community","2011-2015"]
["California","Los Angeles","06037231600","Low-Income Community","2011-2015"]
["California","Los Angeles","06037231800","Low-Income Community","2011-2015"]
["California","Los Angeles","06037232400","Low-Income Community","2011-2015"]
["California","Los Angeles","06037232500","Low-Income Community","2011-2015"]
["California","Los Angeles","06037234501","Low-Income Community","2011-2015"]
["California","Los Angeles","06037234502","Low-Income Community","2011-2015"]
["California","Los Angeles","06037234600","Low-Income Community","2011-2015"]
["California","Los Angeles","06037236100","Low-Income Community","2011-2015"]
["California","Los Angeles","06037237202","Low-Income Community","2011-2015"]
["California","Los Angeles","06037239202","Low-Income Community","2011-2015"]
["California","Los Angeles","06037239330","Low-Income Community","2011-2015"]
["California","Los Angeles","06037241001","Low-Income Community","2011-2015"]
["California","Los Angeles","06037242000","Low-Income Community","2011-2015"]
["California","Los Angeles","06037242100","Low-Income Community","2011-2015"]
["California","Los Angeles","06037242200","Low-Income Community","2011-2015"]
["California","Los Angeles","06037242300","Low-Income Community","2011-2015"]
["California","Los Angeles","06037242600","Low-Income Community","2011-2015"]
["California","Los Angeles","06037243000","Low-Income Community","2011-2015"]
["California","Los Angeles","06037243100","Low-Income Community","2011-2015"]
["California","Los Angeles","06037292000","Low-Income Community","2011-2015"]
["California","Los Angeles","06037293201","Low-Income Community","2012-2016"]
["California","Los Angeles","06037294120","Low-Income Community","2011-2015"]
["California","Los Angeles","06037294620","Low-Income Community","2011-2015"]
["California","Los Angeles","06037294701","Low-Income Community","2011-2015"]
["California","Los Angeles","06037294820","Low-Income Community","2011-2015"]
["California","Los Angeles","06037294830","Low-Income Community","2011-2015"]
["California","Los Angeles","06037296210","Low-Income Community","2011-2015"]
["California","Los Angeles","06037296220","Low-Income Community","2011-2015"]
["California","Los Angeles","06037296500","Low-Income Community","2011-2015"]
["California","Los Angeles","06037296600","Low-Income Community","2011-2015"]
["California","Los Angeles","06037402304","Low-Income Community","2011-2015"]
["California","Los Angeles","06037402702","Low-Income Community","2011-2015"]
["California","Los Angeles","06037403200","Low-Income Community","2011-2015"]
["California","Los Angeles","06037404201","Low-Income Community","2011-2015"]
["California","Los Angeles","06037408138","Low-Income Community","2011-2015"]
["California","Los Angeles","06037408800","Low-Income Community","2011-2015"]
["California","Los Angeles","06037433302","Low-Income Community","2011-2015"]
["California","Los Angeles","06037433403","Low-Income Community","2011-2015"]
["California","Los Angeles","06037433501","Low-Income Community","2011-2015"]
["California","Los Angeles","06037433901","Low-Income Community","2011-2015"]
["California","Los Angeles","06037501803","Low-Income Community","2011-2015"]
["California","Los Angeles","06037530902","Low-Income Community","2011-2015"]
["California","Los Angeles","06037531301","Low-Income Community","2011-2015"]
["California","Los Angeles","06037532304","Low-Income Community","2011-2015"]
["California","Los Angeles","06037532606","Low-Income Community","2011-2015"]
["California","Los Angeles","06037532800","Low-Income Community","2011-2015"]
["California","Los Angeles","06037532900","Low-Income Community","2011-2015"]
["California","Los Angeles","06037533103","Low-Income Community","2011-2015"]
["California","Los Angeles","06037533104","Low-Income Community","2011-2015"]
["California","Los Angeles","06037533105","Low-Income Community","2011-2015"]
["California","Los Angeles","06037533403","Low-Income Community","2011-2015"]
["California","Los Angeles","06037533701","Low-Income Community","2011-2015"]
["California","Los Angeles","06037534202","Low-Income Community","2011-2015"]
["California","Los Angeles","06037534301","Low-Income Community","2011-2015"]
["California","Los Angeles","06037534404","Low-Income Community","2011-2015"]
["California","Los Angeles","06037535002","Low-Income Community","2011-2015"]
["California","Los Angeles","06037535101","Low-Income Community","2011-2015"]
["California","Los Angeles","06037535102","Low-Income Community","2011-2015"]
["California","Los Angeles","06037540201","Low-Income Community","2011-2015"]
["California","Los Angeles","06037540202","Low-Income Community","2011-2015"]
["California","Los Angeles","06037540400","Low-Income Community","2011-2015"]
["California","Los Angeles","06037541400","Low-Income Community","2011-2015"]
["California","Los Angeles","06037541603","Low-Income Community","2011-2015"]
["California","Los Angeles","06037541604","Low-Income Community","2011-2015"]
["California","Los Angeles","06037542105","Low-Income Community","2011-2015"]
["California","Los Angeles","06037542106","Low-Income Community","2011-2015"]
["California","Los Angeles","06037542501","Low-Income Community","2011-2015"]
["California","Los Angeles","06037542502","Low-Income Community","2011-2015"]
["California","Los Angeles","06037542601","Low-Income Community","2011-2015"]
["California","Los Angeles","06037550000","Low-Income Community","2011-2015"]
["California","Los Angeles","06037570603","Low-Income Community","2011-2015"]
["California","Los Angeles","06037571600","Low-Income Community","2011-2015"]
["California","Los Angeles","06037571704","Low-Income Community","2011-2015"]
["California","Los Angeles","06037572500","Low-Income Community","2011-2015"]
["California","Los Angeles","06037572800","Low-Income Community","2011-2015"]
["California","Los Angeles","06037573002","Low-Income Community","2011-2015"]
["California","Los Angeles","06037573004","Low-Income Community","2011-2015"]
["California","Los Angeles","06037573300","Low-Income Community","2011-2015"]
["California","Los Angeles","06037575102","Low-Income Community","2011-2015"]
["California","Los Angeles","06037575202","Low-Income Community","2011-2015"]
["California","Los Angeles","06037575401","Low-Income Community","2011-2015"]
["California","Los Angeles","06037575801","Low-Income Community","2011-2015"]
["California","Los Angeles","06037575802","Low-Income Community","2011-2015"]
["California","Los Angeles","06037575803","Low-Income Community","2011-2015"]
["California","Los Angeles","06037575901","Low-Income Community","2011-2015"]
["California","Los Angeles","06037576200","Low-Income Community","2011-2015"]
["California","Los Angeles","06037576401","Low-Income Community","2011-2015"]
["California","Los Angeles","06037576403","Low-Income Community","2011-2015"]
["California","Los Angeles","06037576901","Low-Income Community","2011-2015"]
["California","Los Angeles","06037600100","Low-Income Community","2011-2015"]
["California","Los Angeles","06037600202","Low-Income Community","2011-2015"]
["California","Los Angeles","06037600303","Low-Income Community","2011-2015"]
["California","Los Angeles","06037600304","Low-Income Community","2011-2015"]
["California","Los Angeles","06037601202","Low-Income Community","2011-2015"]
["California","Los Angeles","06037601700","Low-Income Community","2011-2015"]
["California","Los Angeles","06037601801","Low-Income Community","2011-2015"]
["California","Los Angeles","06037602505","Low-Income Community","2011-2015"]
["California","Los Angeles","06037602801","Low-Income Community","2011-2015"]
["California","Los Angeles","06037604100","Low-Income Community","2011-2015"]
["California","Los Angeles","06037900501","Low-Income Community","2011-2015"]
["California","Los Angeles","06037900606","Low-Income Community","2011-2015"]
["California","Los Angeles","06037900607","Low-Income Community","2011-2015"]
["California","Los Angeles","06037900703","Low-Income Community","2011-2015"]
["California","Los Angeles","06037900704","Low-Income Community","2011-2015"]
["California","Los Angeles","06037900806","Low-Income Community","2011-2015"]
["California","Los Angeles","06037910402","Low-Income Community","2011-2015"]
["California","Los Angeles","06037910403","Low-Income Community","2011-2015"]
["California","Los Angeles","06037910501","Low-Income Community","2011-2015"]
["California","Los Angeles","06037910504","Low-Income Community","2011-2015"]
["California","Los Angeles","06037910601","Low-Income Community","2011-2015"]
["California","Los Angeles","06037910602","Low-Income Community","2011-2015"]
["California","Los Angeles","06037980014","Low-Income Community","2011-2015"]
["California","Madera","06039000103","Low-Income Community","2011-2015"]
["California","Madera","06039000202","Non-LIC Contiguous","2011-2015"]
["California","Madera","06039000503","Non-LIC Contiguous","2011-2015"]
["California","Madera","06039000506","Low-Income Community","2011-2015"]
["California","Madera","06039000800","Low-Income Community","2011-2015"]
["California","Marin","06041112201","Low-Income Community","2011-2015"]
["California","Mariposa","06043000101","Low-Income Community","2011-2015"]
["California","Mariposa","06043000102","Low-Income Community","2011-2015"]
["California","Mendocino","06045010100","Low-Income Community","2011-2015"]
["California","Mendocino","06045011300","Low-Income Community","2011-2015"]
["California","Mendocino","06045011500","Low-Income Community","2011-2015"]
["California","Merced","06047000503","Low-Income Community","2011-2015"]
["California","Merced","06047000602","Low-Income Community","2011-2015"]
["California","Merced","06047000603","Low-Income Community","2011-2015"]
["California","Merced","06047001301","Low-Income Community","2011-2015"]
["California","Merced","06047001302","Low-Income Community","2011-2015"]
["California","Merced","06047001401","Low-Income Community","2011-2015"]
["California","Merced","06047001501","Low-Income Community","2011-2015"]
["California","Merced","06047001601","Low-Income Community","2011-2015"]
["California","Merced","06047001602","Low-Income Community","2011-2015"]
["California","Merced","06047001700","Low-Income Community","2011-2015"]
["California","Merced","06047002201","Low-Income Community","2011-2015"]
["California","Modoc","06049000100","Low-Income Community","2011-2015"]
["California","Modoc","06049000300","Low-Income Community","2011-2015"]
["California","Monterey","06053000400","Low-Income Community","2011-2015"]
["California","Monterey","06053000502","Low-Income Community","2011-2015"]
["California","Monterey","06053001300","Low-Income Community","2011-2015"]
["California","Monterey","06053001802","Low-Income Community","2011-2015"]
["California","Monterey","06053011302","Low-Income Community","2011-2015"]
["California","Monterey","06053013500","Low-Income Community","2011-2015"]
["California","Monterey","06053013700","Low-Income Community","2011-2015"]
["California","Monterey","06053014102","Low-Income Community","2011-2015"]
["California","Monterey","06053014500","Low-Income Community","2011-2015"]
["California","Napa","06055200202","Low-Income Community","2011-2015"]
["California","Napa","06055200804","Low-Income Community","2011-2015"]
["California","Nevada","06057000600","Low-Income Community","2011-2015"]
["California","Nevada","06057000900","Low-Income Community","2011-2015"]
["California","Orange","06059001801","Low-Income Community","2011-2015"]
["California","Orange","06059011601","Low-Income Community","2011-2015"]
["California","Orange","06059011602","Low-Income Community","2011-2015"]
["California","Orange","06059011720","Low-Income Community","2011-2015"]
["California","Orange","06059011721","Low-Income Community","2011-2015"]
["California","Orange","06059042107","Low-Income Community","2011-2015"]
["California","Orange","06059042312","Low-Income Community","2011-2015"]
["California","Orange","06059063605","Low-Income Community","2011-2015"]
["California","Orange","06059063701","Low-Income Community","2011-2015"]
["California","Orange","06059074403","Low-Income Community","2011-2015"]
["California","Orange","06059074405","Low-Income Community","2011-2015"]
["California","Orange","06059074406","Low-Income Community","2011-2015"]
["California","Orange","06059074602","Low-Income Community","2011-2015"]
["California","Orange","06059074802","Low-Income Community","2011-2015"]
["California","Orange","06059075002","Low-Income Community","2011-2015"]
["California","Orange","06059075003","Low-Income Community","2011-2015"]
["California","Orange","06059075100","Low-Income Community","2011-2015"]
["California","Orange","06059075201","Low-Income Community","2011-2015"]
["California","Orange","06059086405","Low-Income Community","2011-2015"]
["California","Orange","06059087403","Low-Income Community","2011-2015"]
["California","Orange","06059087405","Low-Income Community","2011-2015"]
["California","Orange","06059087505","Low-Income Community","2011-2015"]
["California","Orange","06059087803","Low-Income Community","2011-2015"]
["California","Orange","06059088201","Low-Income Community","2011-2015"]
["California","Orange","06059089104","Low-Income Community","2011-2015"]
["California","Orange","06059089105","Low-Income Community","2011-2015"]
["California","Orange","06059099402","Low-Income Community","2011-2015"]
["California","Placer","06061020401","Low-Income Community","2011-2015"]
["California","Placer","06061020901","Low-Income Community","2011-2015"]
["California","Placer","06061021603","Low-Income Community","2011-2015"]
["California","Plumas","06063000202","Low-Income Community","2011-2015"]
["California","Plumas","06063000400","Low-Income Community","2011-2015"]
["California","Riverside","06065030103","Low-Income Community","2011-2015"]
["California","Riverside","06065030300","Low-Income Community","2011-2015"]
["California","Riverside","06065030400","Low-Income Community","2011-2015"]
["California","Riverside","06065030501","Low-Income Community","2011-2015"]
["California","Riverside","06065030502","Low-Income Community","2011-2015"]
["California","Riverside","06065031300","Low-Income Community","2011-2015"]
["California","Riverside","06065040203","Low-Income Community","2011-2015"]
["California","Riverside","06065041101","Low-Income Community","2011-2015"]
["California","Riverside","06065041410","Low-Income Community","2011-2015"]
["California","Riverside","06065041703","Low-Income Community","2011-2015"]
["California","Riverside","06065042010","Low-Income Community","2011-2015"]
["California","Riverside","06065042209","Low-Income Community","2011-2015"]
["California","Riverside","06065042210","Low-Income Community","2011-2015"]
["California","Riverside","06065042404","Low-Income Community","2011-2015"]
["California","Riverside","06065042505","Low-Income Community","2011-2015"]
["California","Riverside","06065042506","Low-Income Community","2011-2015"]
["California","Riverside","06065042514","Low-Income Community","2011-2015"]
["California","Riverside","06065042515","Low-Income Community","2011-2015"]
["California","Riverside","06065042723","Low-Income Community","2011-2015"]
["California","Riverside","06065042800","Low-Income Community","2011-2015"]
["California","Riverside","06065042903","Low-Income Community","2011-2015"]
["California","Riverside","06065042904","Low-Income Community","2011-2015"]
["California","Riverside","06065043307","Low-Income Community","2011-2015"]
["California","Riverside","06065043310","Low-Income Community","2011-2015"]
["California","Riverside","06065043401","Low-Income Community","2011-2015"]
["California","Riverside","06065043403","Low-Income Community","2011-2015"]
["California","Riverside","06065043405","Low-Income Community","2011-2015"]
["California","Riverside","06065043601","Low-Income Community","2011-2015"]
["California","Riverside","06065043602","Low-Income Community","2011-2015"]
["California","Riverside","06065044101","Low-Income Community","2011-2015"]
["California","Riverside","06065044200","Low-Income Community","2011-2015"]
["California","Riverside","06065044507","Low-Income Community","2011-2015"]
["California","Riverside","06065044509","Low-Income Community","2011-2015"]
["California","Riverside","06065044510","Low-Income Community","2011-2015"]
["California","Riverside","06065044702","Low-Income Community","2011-2015"]
["California","Riverside","06065044915","Low-Income Community","2011-2015"]
["California","Riverside","06065045000","Low-Income Community","2011-2015"]
["California","Riverside","06065045303","Low-Income Community","2011-2015"]
["California","Riverside","06065045502","Low-Income Community","2011-2015"]
["California","Riverside","06065045604","Low-Income Community","2011-2015"]
["California","Riverside","06065045605","Low-Income Community","2011-2015"]
["California","Riverside","06065045609","Low-Income Community","2011-2015"]
["California","Riverside","06065045703","Low-Income Community","2011-2015"]
["California","Riverside","06065045705","Low-Income Community","2011-2015"]
["California","Riverside","06065045706","Low-Income Community","2011-2015"]
["California","Riverside","06065046102","Low-Income Community","2011-2015"]
["California","Riverside","06065046200","Low-Income Community","2011-2015"]
["California","Riverside","06065046500","Low-Income Community","2011-2015"]
["California","Riverside","06065051100","Low-Income Community","2011-2015"]
["California","Sacramento","06067000500","Low-Income Community","2011-2015"]
["California","Sacramento","06067000700","Low-Income Community","2011-2015"]
["California","Sacramento","06067001101","Low-Income Community","2011-2015"]
["California","Sacramento","06067002100","Low-Income Community","2011-2015"]
["California","Sacramento","06067002200","Low-Income Community","2011-2015"]
["California","Sacramento","06067002800","Low-Income Community","2011-2015"]
["California","Sacramento","06067003700","Low-Income Community","2011-2015"]
["California","Sacramento","06067004100","Low-Income Community","2011-2015"]
["California","Sacramento","06067004203","Low-Income Community","2011-2015"]
["California","Sacramento","06067004402","Low-Income Community","2011-2015"]
["California","Sacramento","06067004501","Low-Income Community","2011-2015"]
["California","Sacramento","06067004502","Low-Income Community","2011-2015"]
["California","Sacramento","06067004601","Low-Income Community","2011-2015"]
["California","Sacramento","06067004701","Low-Income Community","2011-2015"]
["California","Sacramento","06067004802","Low-Income Community","2011-2015"]
["California","Sacramento","06067004903","Low-Income Community","2011-2015"]
["California","Sacramento","06067004905","Low-Income Community","2011-2015"]
["California","Sacramento","06067005101","Low-Income Community","2011-2015"]
["California","Sacramento","06067005205","Low-Income Community","2011-2015"]
["California","Sacramento","06067005301","Low-Income Community","2011-2015"]
["California","Sacramento","06067005502","Low-Income Community","2011-2015"]
["California","Sacramento","06067005505","Low-Income Community","2011-2015"]
["California","Sacramento","06067005601","Low-Income Community","2011-2015"]
["California","Sacramento","06067005605","Low-Income Community","2011-2015"]
["California","Sacramento","06067006201","Low-Income Community","2011-2015"]
["California","Sacramento","06067006202","Low-Income Community","2011-2015"]
["California","Sacramento","06067006300","Low-Income Community","2011-2015"]
["California","Sacramento","06067006500","Low-Income Community","2011-2015"]
["California","Sacramento","06067006600","Low-Income Community","2011-2015"]
["California","Sacramento","06067006702","Low-Income Community","2011-2015"]
["California","Sacramento","06067006900","Low-Income Community","2011-2015"]
["California","Sacramento","06067007004","Low-Income Community","2011-2015"]
["California","Sacramento","06067007019","Low-Income Community","2011-2015"]
["California","Sacramento","06067007204","Low-Income Community","2011-2015"]
["California","Sacramento","06067007301","Low-Income Community","2011-2015"]
["California","Sacramento","06067007423","Low-Income Community","2011-2015"]
["California","Sacramento","06067008909","Low-Income Community","2011-2015"]
["California","Sacramento","06067008910","Low-Income Community","2011-2015"]
["California","Sacramento","06067008911","Low-Income Community","2011-2015"]
["California","Sacramento","06067009006","Low-Income Community","2011-2015"]
["California","Sacramento","06067009201","Low-Income Community","2011-2015"]
["California","Sacramento","06067009634","Low-Income Community","2011-2015"]
["California","Sacramento","06067009800","Low-Income Community","2011-2015"]
["California","San Benito","06069000200","Low-Income Community","2011-2015"]
["California","San Benito","06069000701","Low-Income Community","2011-2015"]
["California","San Bernardino","06071000823","Low-Income Community","2011-2015"]
["California","San Bernardino","06071001400","Low-Income Community","2011-2015"]
["California","San Bernardino","06071001503","Low-Income Community","2011-2015"]
["California","San Bernardino","06071001504","Low-Income Community","2011-2015"]
["California","San Bernardino","06071001600","Low-Income Community","2011-2015"]
["California","San Bernardino","06071002804","Low-Income Community","2011-2015"]
["California","San Bernardino","06071003000","Low-Income Community","2011-2015"]
["California","San Bernardino","06071003102","Low-Income Community","2011-2015"]
["California","San Bernardino","06071003510","Low-Income Community","2011-2015"]
["California","San Bernardino","06071003606","Low-Income Community","2011-2015"]
["California","San Bernardino","06071003609","Low-Income Community","2011-2015"]
["California","San Bernardino","06071003612","Low-Income Community","2011-2015"]
["California","San Bernardino","06071003700","Low-Income Community","2011-2015"]
["California","San Bernardino","06071004201","Low-Income Community","2011-2015"]
["California","San Bernardino","06071004202","Low-Income Community","2011-2015"]
["California","San Bernardino","06071004302","Low-Income Community","2011-2015"]
["California","San Bernardino","06071004404","Low-Income Community","2011-2015"]
["California","San Bernardino","06071004507","Low-Income Community","2011-2015"]
["California","San Bernardino","06071004604","Low-Income Community","2011-2015"]
["California","San Bernardino","06071004700","Low-Income Community","2011-2015"]
["California","San Bernardino","06071004800","Low-Income Community","2011-2015"]
["California","San Bernardino","06071004900","Low-Income Community","2011-2015"]
["California","San Bernardino","06071005400","Low-Income Community","2011-2015"]
["California","San Bernardino","06071005500","Low-Income Community","2011-2015"]
["California","San Bernardino","06071005600","Low-Income Community","2011-2015"]
["California","San Bernardino","06071005701","Low-Income Community","2011-2015"]
["California","San Bernardino","06071005800","Low-Income Community","2011-2015"]
["California","San Bernardino","06071006203","Low-Income Community","2011-2015"]
["California","San Bernardino","06071006204","Low-Income Community","2011-2015"]
["California","San Bernardino","06071006301","Low-Income Community","2011-2015"]
["California","San Bernardino","06071006302","Low-Income Community","2011-2015"]
["California","San Bernardino","06071006401","Low-Income Community","2011-2015"]
["California","San Bernardino","06071006402","Low-Income Community","2011-2015"]
["California","San Bernardino","06071006500","Low-Income Community","2011-2015"]
["California","San Bernardino","06071007107","Low-Income Community","2011-2015"]
["California","San Bernardino","06071007200","Low-Income Community","2011-2015"]
["California","San Bernardino","06071007303","Low-Income Community","2011-2015"]
["California","San Bernardino","06071007407","Low-Income Community","2011-2015"]
["California","San Bernardino","06071007601","Low-Income Community","2011-2015"]
["California","San Bernardino","06071008002","Low-Income Community","2011-2015"]
["California","San Bernardino","06071008710","Low-Income Community","2011-2015"]
["California","San Bernardino","06071009112","Low-Income Community","2011-2015"]
["California","San Bernardino","06071009116","Low-Income Community","2011-2015"]
["California","San Bernardino","06071009117","Low-Income Community","2011-2015"]
["California","San Bernardino","06071009400","Low-Income Community","2011-2015"]
["California","San Bernardino","06071009500","Low-Income Community","2011-2015"]
["California","San Bernardino","06071009716","Low-Income Community","2011-2015"]
["California","San Bernardino","06071009800","Low-Income Community","2011-2015"]
["California","San Bernardino","06071009904","Low-Income Community","2011-2015"]
["California","San Bernardino","06071009905","Low-Income Community","2011-2015"]
["California","San Bernardino","06071009912","Low-Income Community","2011-2015"]
["California","San Bernardino","06071009913","Low-Income Community","2011-2015"]
["California","San Bernardino","06071010014","Low-Income Community","2011-2015"]
["California","San Bernardino","06071010423","Low-Income Community","2011-2015"]
["California","San Bernardino","06071010700","Low-Income Community","2011-2015"]
["California","San Bernardino","06071012400","Low-Income Community","2011-2015"]
["California","San Bernardino","06071012500","Low-Income Community","2011-2015"]
["California","San Diego","06073000900","Low-Income Community","2011-2015"]
["California","San Diego","06073001600","Low-Income Community","2011-2015"]
["California","San Diego","06073002201","Low-Income Community","2011-2015"]
["California","San Diego","06073002202","Low-Income Community","2011-2015"]
["California","San Diego","06073002301","Low-Income Community","2011-2015"]
["California","San Diego","06073002302","Low-Income Community","2011-2015"]
["California","San Diego","06073002401","Low-Income Community","2011-2015"]
["California","San Diego","06073002601","Low-Income Community","2011-2015"]
["California","San Diego","06073002707","Low-Income Community","2011-2015"]
["California","San Diego","06073002708","Low-Income Community","2011-2015"]
["California","San Diego","06073002709","Low-Income Community","2011-2015"]
["California","San Diego","06073002710","Low-Income Community","2011-2015"]
["California","San Diego","06073003001","Non-LIC Contiguous","2011-2015"]
["California","San Diego","06073003004","Low-Income Community","2011-2015"]
["California","San Diego","06073003101","Low-Income Community","2011-2015"]
["California","San Diego","06073003111","Low-Income Community","2011-2015"]
["California","San Diego","06073003303","Low-Income Community","2011-2015"]
["California","San Diego","06073003304","Low-Income Community","2011-2015"]
["California","San Diego","06073003305","Low-Income Community","2011-2015"]
["California","San Diego","06073003401","Low-Income Community","2011-2015"]
["California","San Diego","06073003404","Low-Income Community","2011-2015"]
["California","San Diego","06073003501","Low-Income Community","2011-2015"]
["California","San Diego","06073003502","Low-Income Community","2011-2015"]
["California","San Diego","06073003601","Low-Income Community","2011-2015"]
["California","San Diego","06073003602","Low-Income Community","2011-2015"]
["California","San Diego","06073003901","Low-Income Community","2011-2015"]
["California","San Diego","06073003902","Low-Income Community","2011-2015"]
["California","San Diego","06073004000","Low-Income Community","2011-2015"]
["California","San Diego","06073004100","Low-Income Community","2011-2015"]
["California","San Diego","06073004700","Low-Income Community","2011-2015"]
["California","San Diego","06073004800","Low-Income Community","2011-2015"]
["California","San Diego","06073004900","Low-Income Community","2011-2015"]
["California","San Diego","06073005000","Low-Income Community","2011-2015"]
["California","San Diego","06073005100","Low-Income Community","2011-2015"]
["California","San Diego","06073010013","Low-Income Community","2011-2015"]
["California","San Diego","06073011700","Low-Income Community","2011-2015"]
["California","San Diego","06073011801","Low-Income Community","2011-2015"]
["California","San Diego","06073013104","Low-Income Community","2011-2015"]
["California","San Diego","06073013205","Low-Income Community","2011-2015"]
["California","San Diego","06073013206","Low-Income Community","2011-2015"]
["California","San Diego","06073015701","Low-Income Community","2011-2015"]
["California","San Diego","06073015703","Low-Income Community","2011-2015"]
["California","San Diego","06073015801","Low-Income Community","2011-2015"]
["California","San Diego","06073015802","Low-Income Community","2011-2015"]
["California","San Diego","06073015901","Low-Income Community","2011-2015"]
["California","San Diego","06073019503","Low-Income Community","2011-2015"]
["California","San Diego","06073020214","Low-Income Community","2011-2015"]
["California","San Francisco","06075017902","Low-Income Community","2011-2015"]
["California","San Francisco","06075023103","Low-Income Community","2011-2015"]
["California","San Francisco","06075023400","Low-Income Community","2011-2015"]
["California","San Francisco","06075026001","Low-Income Community","2011-2015"]
["California","San Francisco","06075026004","Low-Income Community","2011-2015"]
["California","San Francisco","06075026100","Low-Income Community","2011-2015"]
["California","San Francisco","06075026301","Low-Income Community","2011-2015"]
["California","San Francisco","06075026404","Low-Income Community","2011-2015"]
["California","San Francisco","06075060502","Low-Income Community","2011-2015"]
["California","San Francisco","06075061200","Low-Income Community","2011-2015"]
["California","San Francisco","06075980600","Low-Income Community","2011-2015"]
["California","San Joaquin","06077000100","Low-Income Community","2011-2015"]
["California","San Joaquin","06077000300","Low-Income Community","2011-2015"]
["California","San Joaquin","06077000402","Low-Income Community","2011-2015"]
["California","San Joaquin","06077000500","Low-Income Community","2011-2015"]
["California","San Joaquin","06077000600","Low-Income Community","2011-2015"]
["California","San Joaquin","06077000700","Low-Income Community","2011-2015"]
["California","San Joaquin","06077000801","Low-Income Community","2011-2015"]
["California","San Joaquin","06077000900","Low-Income Community","2011-2015"]
["California","San Joaquin","06077001200","Low-Income Community","2011-2015"]
["California","San Joaquin","06077001500","Low-Income Community","2011-2015"]
["California","San Joaquin","06077001600","Low-Income Community","2011-2015"]
["California","San Joaquin","06077001900","Low-Income Community","2011-2015"]
["California","San Joaquin","06077002100","Low-Income Community","2011-2015"]
["California","San Joaquin","06077002201","Low-Income Community","2011-2015"]
["California","San Joaquin","06077002202","Low-Income Community","2011-2015"]
["California","San Joaquin","06077002800","Low-Income Community","2011-2015"]
["California","San Joaquin","06077003307","Low-Income Community","2011-2015"]
["California","San Joaquin","06077003700","Low-Income Community","2011-2015"]
["California","San Joaquin","06077003803","Low-Income Community","2011-2015"]
["California","San Joaquin","06077004403","Low-Income Community","2011-2015"]
["California","San Luis Obispo","06079010102","Low-Income Community","2011-2015"]
["California","San Luis Obispo","06079010902","Low-Income Community","2011-2015"]
["California","San Luis Obispo","06079012200","Low-Income Community","2011-2015"]
["California","San Mateo","06081600200","Low-Income Community","2011-2015"]
["California","San Mateo","06081610201","Low-Income Community","2011-2015"]
["California","San Mateo","06081610500","Low-Income Community","2011-2015"]
["California","San Mateo","06081612100","Low-Income Community","2011-2015"]
["California","Santa Barbara","06083002101","Low-Income Community","2011-2015"]
["California","Santa Barbara","06083002403","Low-Income Community","2011-2015"]
["California","Santa Barbara","06083002404","Low-Income Community","2011-2015"]
["California","Santa Barbara","06083002502","Low-Income Community","2011-2015"]
["California","Santa Barbara","06083002702","Low-Income Community","2011-2015"]
["California","Santa Barbara","06083002705","Low-Income Community","2011-2015"]
["California","Santa Barbara","06083002706","Low-Income Community","2011-2015"]
["California","Santa Clara","06085500800","Low-Income Community","2011-2015"]
["California","Santa Clara","06085500901","Low-Income Community","2011-2015"]
["California","Santa Clara","06085501000","Low-Income Community","2011-2015"]
["California","Santa Clara","06085501401","Low-Income Community","2011-2015"]
["California","Santa Clara","06085501600","Low-Income Community","2011-2015"]
["California","Santa Clara","06085503110","Low-Income Community","2011-2015"]
["California","Santa Clara","06085503122","Low-Income Community","2011-2015"]
["California","Santa Clara","06085503305","Low-Income Community","2011-2015"]
["California","Santa Clara","06085503401","Low-Income Community","2011-2015"]
["California","Santa Clara","06085503601","Low-Income Community","2011-2015"]
["California","Santa Clara","06085505100","Low-Income Community","2011-2015"]
["California","Santa Clara","06085512603","Low-Income Community","2011-2015"]
["California","Santa Clara","06085512604","Low-Income Community","2011-2015"]
["California","Santa Cruz","06087100800","Low-Income Community","2011-2015"]
["California","Santa Cruz","06087101000","Low-Income Community","2011-2015"]
["California","Santa Cruz","06087121402","Low-Income Community","2011-2015"]
["California","Santa Cruz","06087121600","Low-Income Community","2011-2015"]
["California","Shasta","06089010100","Low-Income Community","2011-2015"]
["California","Shasta","06089010200","Low-Income Community","2011-2015"]
["California","Shasta","06089010704","Low-Income Community","2011-2015"]
["California","Shasta","06089011209","Low-Income Community","2011-2015"]
["California","Shasta","06089012000","Low-Income Community","2011-2015"]
["California","Shasta","06089012500","Low-Income Community","2011-2015"]
["California","Sierra","06091010000","Non-LIC Contiguous","2011-2015"]
["California","Siskiyou","06093000500","Low-Income Community","2011-2015"]
["California","Siskiyou","06093000702","Low-Income Community","2011-2015"]
["California","Siskiyou","06093000703","Low-Income Community","2011-2015"]
["California","Solano","06095250801","Low-Income Community","2011-2015"]
["California","Solano","06095250900","Low-Income Community","2011-2015"]
["California","Solano","06095251100","Low-Income Community","2011-2015"]
["California","Solano","06095251500","Low-Income Community","2011-2015"]
["California","Solano","06095251600","Low-Income Community","2011-2015"]
["California","Solano","06095251802","Low-Income Community","2011-2015"]
["California","Solano","06095252605","Low-Income Community","2011-2015"]
["California","Solano","06095252606","Low-Income Community","2011-2015"]
["California","Solano","06095252607","Low-Income Community","2011-2015"]
["California","Sonoma","06097150305","Low-Income Community","2011-2015"]
["California","Sonoma","06097152000","Low-Income Community","2011-2015"]
["California","Sonoma","06097153104","Low-Income Community","2011-2015"]
["California","Stanislaus","06099001400","Low-Income Community","2011-2015"]
["California","Stanislaus","06099001603","Low-Income Community","2011-2015"]
["California","Stanislaus","06099001604","Low-Income Community","2011-2015"]
["California","Stanislaus","06099001700","Low-Income Community","2011-2015"]
["California","Stanislaus","06099001800","Low-Income Community","2011-2015"]
["California","Stanislaus","06099002002","Low-Income Community","2011-2015"]
["California","Stanislaus","06099002100","Low-Income Community","2011-2015"]
["California","Stanislaus","06099002200","Low-Income Community","2011-2015"]
["California","Stanislaus","06099002301","Low-Income Community","2011-2015"]
["California","Stanislaus","06099002402","Low-Income Community","2011-2015"]
["California","Stanislaus","06099002501","Low-Income Community","2011-2015"]
["California","Stanislaus","06099002602","Low-Income Community","2011-2015"]
["California","Stanislaus","06099003002","Low-Income Community","2011-2015"]
["California","Stanislaus","06099003201","Low-Income Community","2011-2015"]
["California","Stanislaus","06099003400","Low-Income Community","2011-2015"]
["California","Stanislaus","06099003802","Low-Income Community","2011-2015"]
["California","Stanislaus","06099003803","Low-Income Community","2011-2015"]
["California","Sutter","06101050102","Low-Income Community","2011-2015"]
["California","Sutter","06101050201","Low-Income Community","2011-2015"]
["California","Sutter","06101050202","Low-Income Community","2011-2015"]
["California","Sutter","06101050302","Low-Income Community","2011-2015"]
["California","Tehama","06103001100","Low-Income Community","2011-2015"]
["California","Trinity","06105000101","Low-Income Community","2011-2015"]
["California","Trinity","06105000300","Low-Income Community","2011-2015"]
["California","Tulare","06107000201","Low-Income Community","2011-2015"]
["California","Tulare","06107000302","Low-Income Community","2011-2015"]
["California","Tulare","06107000502","Low-Income Community","2011-2015"]
["California","Tulare","06107000900","Low-Income Community","2011-2015"]
["California","Tulare","06107001003","Low-Income Community","2012-2016"]
["California","Tulare","06107001100","Low-Income Community","2011-2015"]
["California","Tulare","06107001400","Low-Income Community","2011-2015"]
["California","Tulare","06107002202","Low-Income Community","2011-2015"]
["California","Tulare","06107002800","Low-Income Community","2011-2015"]
["California","Tulare","06107002901","Low-Income Community","2011-2015"]
["California","Tulare","06107003200","Low-Income Community","2011-2015"]
["California","Tulare","06107003400","Low-Income Community","2011-2015"]
["California","Tulare","06107003802","Low-Income Community","2011-2015"]
["California","Tulare","06107004101","Low-Income Community","2011-2015"]
["California","Tulare","06107004102","Low-Income Community","2011-2015"]
["California","Tulare","06107004200","Low-Income Community","2011-2015"]
["California","Tulare","06107004300","Low-Income Community","2011-2015"]
["California","Tuolumne","06109001200","Low-Income Community","2011-2015"]
["California","Tuolumne","06109004200","Low-Income Community","2011-2015"]
["California","Ventura","06111000304","Low-Income Community","2011-2015"]
["California","Ventura","06111000600","Low-Income Community","2011-2015"]
["California","Ventura","06111001302","Low-Income Community","2011-2015"]
["California","Ventura","06111003201","Low-Income Community","2011-2015"]
["California","Ventura","06111004305","Low-Income Community","2011-2015"]
["California","Ventura","06111004715","Low-Income Community","2011-2015"]
["California","Ventura","06111004902","Low-Income Community","2011-2015"]
["California","Ventura","06111009100","Low-Income Community","2011-2015"]
["California","Yolo","06113010101","Low-Income Community","2011-2015"]
["California","Yolo","06113010201","Low-Income Community","2011-2015"]
["California","Yolo","06113010203","Low-Income Community","2011-2015"]
["California","Yolo","06113010204","Low-Income Community","2011-2015"]
["California","Yolo","06113010602","Low-Income Community","2011-2015"]
["California","Yolo","06113010800","Low-Income Community","2011-2015"]
["California","Yolo","06113011102","Low-Income Community","2011-2015"]
["California","Yuba","06115040301","Low-Income Community","2011-2015"]
["California","Yuba","06115040302","Low-Income Community","2011-2015"]
["California","Yuba","06115040400","Low-Income Community","2011-2015"]
["Colorado","Adams","08001008100","Low-Income Community","2011-2015"]
["Colorado","Adams","08001008353","Low-Income Community","2011-2015"]
["Colorado","Adams","08001008606","Low-Income Community","2011-2015"]
["Colorado","Adams","08001008901","Low-Income Community","2011-2015"]
["Colorado","Adams","08001009202","Low-Income Community","2011-2015"]
["Colorado","Adams","08001009321","Low-Income Community","2011-2015"]
["Colorado","Adams","08001009604","Low-Income Community","2011-2015"]
["Colorado","Adams","08001009606","Low-Income Community","2011-2015"]
["Colorado","Adams","08001015000","Low-Income Community","2011-2015"]
["Colorado","Alamosa","08003960000","Low-Income Community","2011-2015"]
["Colorado","Alamosa","08003960200","Low-Income Community","2011-2015"]
["Colorado","Alamosa","08003960300","Low-Income Community","2011-2015"]
["Colorado","Arapahoe","08005005551","Low-Income Community","2011-2015"]
["Colorado","Arapahoe","08005005552","Low-Income Community","2011-2015"]
["Colorado","Arapahoe","08005005700","Low-Income Community","2011-2015"]
["Colorado","Arapahoe","08005005951","Low-Income Community","2011-2015"]
["Colorado","Arapahoe","08005006000","Low-Income Community","2011-2015"]
["Colorado","Arapahoe","08005006200","Low-Income Community","2011-2015"]
["Colorado","Arapahoe","08005007301","Low-Income Community","2011-2015"]
["Colorado","Arapahoe","08005007302","Low-Income Community","2011-2015"]
["Colorado","Arapahoe","08005081100","Low-Income Community","2011-2015"]
["Colorado","Archuleta","08007974400","Low-Income Community","2011-2015"]
["Colorado","Baca","08009964700","Low-Income Community","2011-2015"]
["Colorado","Bent","08011966700","Low-Income Community","2011-2015"]
["Colorado","Boulder","08013012203","Low-Income Community","2011-2015"]
["Colorado","Boulder","08013013302","Low-Income Community","2011-2015"]
["Colorado","Boulder","08013013401","Low-Income Community","2011-2015"]
["Colorado","Boulder","08013060800","Low-Income Community","2011-2015"]
["Colorado","Chaffee","08015000401","Non-LIC Contiguous","2011-2015"]
["Colorado","Chaffee","08015000402","Low-Income Community","2011-2015"]
["Colorado","Cheyenne","08017960600","Low-Income Community","2011-2015"]
["Colorado","Clear Creek","08019014800","Low-Income Community","2011-2015"]
["Colorado","Costilla","08023972600","Low-Income Community","2011-2015"]
["Colorado","Crowley","08025969600","Low-Income Community","2011-2015"]
["Colorado","Delta","08029964600","Low-Income Community","2011-2015"]
["Colorado","Delta","08029964800","Low-Income Community","2012-2016"]
["Colorado","Delta","08029965100","Low-Income Community","2011-2015"]
["Colorado","Denver","08031000702","Low-Income Community","2011-2015"]
["Colorado","Denver","08031000800","Low-Income Community","2011-2015"]
["Colorado","Denver","08031003500","Low-Income Community","2011-2015"]
["Colorado","Denver","08031003602","Low-Income Community","2011-2015"]
["Colorado","Denver","08031004101","Low-Income Community","2011-2015"]
["Colorado","Denver","08031004102","Low-Income Community","2011-2015"]
["Colorado","Denver","08031004403","Low-Income Community","2011-2015"]
["Colorado","Denver","08031004404","Low-Income Community","2011-2015"]
["Colorado","Denver","08031004505","Low-Income Community","2011-2015"]
["Colorado","Denver","08031008312","Low-Income Community","2011-2015"]
["Colorado","Dolores","08033000100","Low-Income Community","2011-2015"]
["Colorado","Eagle","08037000503","Low-Income Community","2011-2015"]
["Colorado","El Paso","08041000302","Low-Income Community","2011-2015"]
["Colorado","El Paso","08041002000","Low-Income Community","2011-2015"]
["Colorado","El Paso","08041002200","Low-Income Community","2011-2015"]
["Colorado","El Paso","08041002300","Low-Income Community","2011-2015"]
["Colorado","El Paso","08041004008","Low-Income Community","2011-2015"]
["Colorado","El Paso","08041004501","Low-Income Community","2011-2015"]
["Colorado","El Paso","08041005000","Low-Income Community","2011-2015"]
["Colorado","El Paso","08041006302","Low-Income Community","2011-2015"]
["Colorado","Fremont","08043978200","Low-Income Community","2011-2015"]
["Colorado","Fremont","08043978300","Low-Income Community","2011-2015"]
["Colorado","Fremont","08043978800","Low-Income Community","2011-2015"]
["Colorado","Garfield","08045951600","Low-Income Community","2011-2015"]
["Colorado","Garfield","08045951702","Low-Income Community","2012-2016"]
["Colorado","Garfield","08045951901","Low-Income Community","2011-2015"]
["Colorado","Gunnison","08051963700","Low-Income Community","2011-2015"]
["Colorado","Huerfano","08055960600","Low-Income Community","2011-2015"]
["Colorado","Jefferson","08059009831","Low-Income Community","2011-2015"]
["Colorado","Jefferson","08059010100","Low-Income Community","2011-2015"]
["Colorado","Jefferson","08059010402","Low-Income Community","2011-2015"]
["Colorado","Jefferson","08059010902","Low-Income Community","2011-2015"]
["Colorado","Jefferson","08059011550","Low-Income Community","2011-2015"]
["Colorado","Kit Carson","08063962100","Low-Income Community","2011-2015"]
["Colorado","Lake","08065961900","Non-LIC Contiguous","2011-2015"]
["Colorado","La Plata","08067940400","Non-LIC Contiguous","2011-2015"]
["Colorado","La Plata","08067971100","Low-Income Community","2011-2015"]
["Colorado","Larimer","08069001305","Low-Income Community","2011-2015"]
["Colorado","Larimer","08069001306","Low-Income Community","2011-2015"]
["Colorado","Larimer","08069002007","Low-Income Community","2011-2015"]
["Colorado","Larimer","08069002802","Low-Income Community","2011-2015"]
["Colorado","Las Animas","08071000200","Non-LIC Contiguous","2011-2015"]
["Colorado","Las Animas","08071000500","Low-Income Community","2011-2015"]
["Colorado","Las Animas","08071000800","Non-LIC Contiguous","2011-2015"]
["Colorado","Lincoln","08073961700","Low-Income Community","2011-2015"]
["Colorado","Logan","08075966100","Low-Income Community","2011-2015"]
["Colorado","Logan","08075966300","Low-Income Community","2012-2016"]
["Colorado","Logan","08075966400","Low-Income Community","2011-2015"]
["Colorado","Mesa","08077000200","Low-Income Community","2011-2015"]
["Colorado","Mesa","08077000400","Low-Income Community","2011-2015"]
["Colorado","Mesa","08077000500","Low-Income Community","2011-2015"]
["Colorado","Mesa","08077000700","Low-Income Community","2011-2015"]
["Colorado","Mesa","08077000800","Low-Income Community","2011-2015"]
["Colorado","Mesa","08077000900","Low-Income Community","2011-2015"]
["Colorado","Mesa","08077001800","Non-LIC Contiguous","2011-2015"]
["Colorado","Moffat","08081000400","Low-Income Community","2011-2015"]
["Colorado","Montezuma","08083941100","Low-Income Community","2011-2015"]
["Colorado","Montrose","08085966100","Low-Income Community","2011-2015"]
["Colorado","Montrose","08085966202","Low-Income Community","2011-2015"]
["Colorado","Montrose","08085966300","Low-Income Community","2011-2015"]
["Colorado","Montrose","08085966503","Low-Income Community","2011-2015"]
["Colorado","Morgan","08087000500","Low-Income Community","2011-2015"]
["Colorado","Morgan","08087000700","Low-Income Community","2011-2015"]
["Colorado","Otero","08089968300","Low-Income Community","2011-2015"]
["Colorado","Otero","08089968600","Low-Income Community","2011-2015"]
["Colorado","Phillips","08095967600","Low-Income Community","2011-2015"]
["Colorado","Prowers","08099000200","Low-Income Community","2011-2015"]
["Colorado","Prowers","08099000300","Low-Income Community","2011-2015"]
["Colorado","Prowers","08099000700","Low-Income Community","2011-2015"]
["Colorado","Pueblo","08101001400","Low-Income Community","2011-2015"]
["Colorado","Pueblo","08101001900","Low-Income Community","2011-2015"]
["Colorado","Pueblo","08101002000","Low-Income Community","2011-2015"]
["Colorado","Pueblo","08101002300","Low-Income Community","2011-2015"]
["Colorado","Pueblo","08101002600","Low-Income Community","2011-2015"]
["Colorado","Pueblo","08101002901","Low-Income Community","2011-2015"]
["Colorado","Pueblo","08101003103","Low-Income Community","2011-2015"]
["Colorado","Pueblo","08101003106","Low-Income Community","2011-2015"]
["Colorado","Pueblo","08101003500","Low-Income Community","2011-2015"]
["Colorado","Rio Blanco","08103951100","Low-Income Community","2011-2015"]
["Colorado","Rio Grande","08105976700","Low-Income Community","2011-2015"]
["Colorado","Saguache","08109977700","Low-Income Community","2011-2015"]
["Colorado","San Juan","08111972600","Low-Income Community","2011-2015"]
["Colorado","San Miguel","08113968200","Non-LIC Contiguous","2011-2015"]
["Colorado","Washington","08121924200","Low-Income Community","2011-2015"]
["Colorado","Weld","08123000100","Low-Income Community","2011-2015"]
["Colorado","Weld","08123001004","Low-Income Community","2011-2015"]
["Colorado","Weld","08123001902","Low-Income Community","2011-2015"]
["Colorado","Weld","08123002004","Low-Income Community","2011-2015"]
["Colorado","Yuma","08125963100","Low-Income Community","2011-2015"]
["Connecticut","Fairfield","09001020100","Low-Income Community","2011-2015"]
["Connecticut","Fairfield","09001021400","Low-Income Community","2011-2015"]
["Connecticut","Fairfield","09001021802","Low-Income Community","2011-2015"]
["Connecticut","Fairfield","09001022200","Low-Income Community","2011-2015"]
["Connecticut","Fairfield","09001022300","Low-Income Community","2011-2015"]
["Connecticut","Fairfield","09001043400","Low-Income Community","2011-2015"]
["Connecticut","Fairfield","09001043700","Low-Income Community","2011-2015"]
["Connecticut","Fairfield","09001044100","Low-Income Community","2011-2015"]
["Connecticut","Fairfield","09001070300","Low-Income Community","2011-2015"]
["Connecticut","Fairfield","09001070500","Low-Income Community","2011-2015"]
["Connecticut","Fairfield","09001070600","Low-Income Community","2011-2015"]
["Connecticut","Fairfield","09001073800","Low-Income Community","2011-2015"]
["Connecticut","Fairfield","09001074000","Low-Income Community","2011-2015"]
["Connecticut","Fairfield","09001074300","Low-Income Community","2011-2015"]
["Connecticut","Fairfield","09001074400","Low-Income Community","2011-2015"]
["Connecticut","Fairfield","09001080400","Low-Income Community","2011-2015"]
["Connecticut","Fairfield","09001210100","Low-Income Community","2011-2015"]
["Connecticut","Hartford","09003406100","Low-Income Community","2011-2015"]
["Connecticut","Hartford","09003415300","Low-Income Community","2011-2015"]
["Connecticut","Hartford","09003415900","Low-Income Community","2011-2015"]
["Connecticut","Hartford","09003417100","Low-Income Community","2011-2015"]
["Connecticut","Hartford","09003473800","Low-Income Community","2011-2015"]
["Connecticut","Hartford","09003496100","Low-Income Community","2011-2015"]
["Connecticut","Hartford","09003500300","Low-Income Community","2011-2015"]
["Connecticut","Hartford","09003500400","Low-Income Community","2011-2015"]
["Connecticut","Hartford","09003502500","Low-Income Community","2011-2015"]
["Connecticut","Hartford","09003502700","Low-Income Community","2011-2015"]
["Connecticut","Hartford","09003502800","Low-Income Community","2011-2015"]
["Connecticut","Hartford","09003503700","Low-Income Community","2011-2015"]
["Connecticut","Hartford","09003503800","Low-Income Community","2011-2015"]
["Connecticut","Hartford","09003504900","Low-Income Community","2011-2015"]
["Connecticut","Hartford","09003510200","Low-Income Community","2011-2015"]
["Connecticut","Hartford","09003510400","Low-Income Community","2011-2015"]
["Connecticut","Hartford","09003510500","Low-Income Community","2011-2015"]
["Connecticut","Hartford","09003510600","Low-Income Community","2011-2015"]
["Connecticut","Hartford","09003510800","Low-Income Community","2011-2015"]
["Connecticut","Hartford","09003514500","Low-Income Community","2011-2015"]
["Connecticut","Hartford","09003514700","Low-Income Community","2011-2015"]
["Connecticut","Hartford","09003524400","Low-Income Community","2011-2015"]
["Connecticut","Hartford","09003524600","Low-Income Community","2011-2015"]
["Connecticut","Litchfield","09005310300","Low-Income Community","2011-2015"]
["Connecticut","Middlesex","09007541100","Low-Income Community","2011-2015"]
["Connecticut","Middlesex","09007541600","Low-Income Community","2011-2015"]
["Connecticut","New Haven","09009125200","Low-Income Community","2011-2015"]
["Connecticut","New Haven","09009140200","Low-Income Community","2011-2015"]
["Connecticut","New Haven","09009140300","Low-Income Community","2011-2015"]
["Connecticut","New Haven","09009141500","Low-Income Community","2011-2015"]
["Connecticut","New Haven","09009141600","Low-Income Community","2011-2015"]
["Connecticut","New Haven","09009142200","Low-Income Community","2011-2015"]
["Connecticut","New Haven","09009142300","Low-Income Community","2011-2015"]
["Connecticut","New Haven","09009142400","Low-Income Community","2011-2015"]
["Connecticut","New Haven","09009154100","Low-Income Community","2011-2015"]
["Connecticut","New Haven","09009154500","Low-Income Community","2011-2015"]
["Connecticut","New Haven","09009165500","Low-Income Community","2011-2015"]
["Connecticut","New Haven","09009170100","Low-Income Community","2011-2015"]
["Connecticut","New Haven","09009170200","Low-Income Community","2011-2015"]
["Connecticut","New Haven","09009170900","Low-Income Community","2011-2015"]
["Connecticut","New Haven","09009345100","Non-LIC Contiguous","2011-2015"]
["Connecticut","New Haven","09009350100","Low-Income Community","2011-2015"]
["Connecticut","New Haven","09009350500","Low-Income Community","2011-2015"]
["Connecticut","New Haven","09009351500","Low-Income Community","2011-2015"]
["Connecticut","New Haven","09009351700","Low-Income Community","2011-2015"]
["Connecticut","New London","09011690500","Low-Income Community","2011-2015"]
["Connecticut","New London","09011690700","Low-Income Community","2011-2015"]
["Connecticut","New London","09011696700","Low-Income Community","2011-2015"]
["Connecticut","New London","09011696800","Low-Income Community","2011-2015"]
["Connecticut","New London","09011697000","Low-Income Community","2011-2015"]
["Connecticut","New London","09011870200","Low-Income Community","2011-2015"]
["Connecticut","New London","09011870300","Low-Income Community","2011-2015"]
["Connecticut","Tolland","09013881300","Low-Income Community","2011-2015"]
["Connecticut","Windham","09015800600","Low-Income Community","2011-2015"]
["Connecticut","Windham","09015903100","Low-Income Community","2011-2015"]
["Delaware","Kent","10001040201","Low-Income Community","2011-2015"]
["Delaware","Kent","10001041300","Low-Income Community","2011-2015"]
["Delaware","Kent","10001041400","Low-Income Community","2011-2015"]
["Delaware","Kent","10001042500","Low-Income Community","2011-2015"]
["Delaware","Kent","10001043300","Low-Income Community","2011-2015"]
["Delaware","New Castle","10003000601","Low-Income Community","2011-2015"]
["Delaware","New Castle","10003000602","Low-Income Community","2011-2015"]
["Delaware","New Castle","10003001902","Low-Income Community","2011-2015"]
["Delaware","New Castle","10003002100","Low-Income Community","2011-2015"]
["Delaware","New Castle","10003002700","Low-Income Community","2011-2015"]
["Delaware","New Castle","10003002800","Low-Income Community","2011-2015"]
["Delaware","New Castle","10003002900","Low-Income Community","2011-2015"]
["Delaware","New Castle","10003003002","Low-Income Community","2011-2015"]
["Delaware","New Castle","10003010101","Low-Income Community","2011-2015"]
["Delaware","New Castle","10003010104","Low-Income Community","2011-2015"]
["Delaware","New Castle","10003010702","Low-Income Community","2011-2015"]
["Delaware","New Castle","10003012900","Low-Income Community","2011-2015"]
["Delaware","New Castle","10003014402","Low-Income Community","2011-2015"]
["Delaware","New Castle","10003015502","Low-Income Community","2011-2015"]
["Delaware","New Castle","10003015802","Low-Income Community","2011-2015"]
["Delaware","Sussex","10005050401","Non-LIC Contiguous","2011-2015"]
["Delaware","Sussex","10005050405","Low-Income Community","2011-2015"]
["Delaware","Sussex","10005050406","Low-Income Community","2011-2015"]
["Delaware","Sussex","10005050503","Low-Income Community","2011-2015"]
["Delaware","Sussex","10005051802","Low-Income Community","2011-2015"]
["District of Columbia","District of Columbia","11001002101","Low-Income Community","2011-2015"]
["District of Columbia","District of Columbia","11001003400","Low-Income Community","2011-2015"]
["District of Columbia","District of Columbia","11001006400","Low-Income Community","2011-2015"]
["District of Columbia","District of Columbia","11001006804","Low-Income Community","2011-2015"]
["District of Columbia","District of Columbia","11001007304","Low-Income Community","2011-2015"]
["District of Columbia","District of Columbia","11001007401","Low-Income Community","2011-2015"]
["District of Columbia","District of Columbia","11001007407","Low-Income Community","2011-2015"]
["District of Columbia","District of Columbia","11001007503","Low-Income Community","2011-2015"]
["District of Columbia","District of Columbia","11001007601","Low-Income Community","2011-2015"]
["District of Columbia","District of Columbia","11001007603","Low-Income Community","2011-2015"]
["District of Columbia","District of Columbia","11001007604","Low-Income Community","2011-2015"]
["District of Columbia","District of Columbia","11001007709","Low-Income Community","2011-2015"]
["District of Columbia","District of Columbia","11001007803","Low-Income Community","2011-2015"]
["District of Columbia","District of Columbia","11001007804","Low-Income Community","2011-2015"]
["District of Columbia","District of Columbia","11001007806","Low-Income Community","2011-2015"]
["District of Columbia","District of Columbia","11001007808","Low-Income Community","2011-2015"]
["District of Columbia","District of Columbia","11001008904","Low-Income Community","2011-2015"]
["District of Columbia","District of Columbia","11001009102","Low-Income Community","2011-2015"]
["District of Columbia","District of Columbia","11001009204","Low-Income Community","2011-2015"]
["District of Columbia","District of Columbia","11001009601","Low-Income Community","2011-2015"]
["District of Columbia","District of Columbia","11001009602","Low-Income Community","2011-2015"]
["District of Columbia","District of Columbia","11001009603","Low-Income Community","2011-2015"]
["District of Columbia","District of Columbia","11001010300","Low-Income Community","2011-2015"]
["District of Columbia","District of Columbia","11001010400","Low-Income Community","2011-2015"]
["District of Columbia","District of Columbia","11001010900","Low-Income Community","2011-2015"]
["Florida","Alachua","12001000200","Low-Income Community","2011-2015"]
["Florida","Alachua","12001000302","Low-Income Community","2011-2015"]
["Florida","Alachua","12001000400","Low-Income Community","2011-2015"]
["Florida","Alachua","12001000500","Low-Income Community","2011-2015"]
["Florida","Alachua","12001000600","Low-Income Community","2011-2015"]
["Florida","Alachua","12001000700","Low-Income Community","2011-2015"]
["Florida","Alachua","12001001400","Low-Income Community","2011-2015"]
["Florida","Alachua","12001002000","Low-Income Community","2011-2015"]
["Florida","Baker","12003040201","Low-Income Community","2011-2015"]
["Florida","Bay","12005001600","Low-Income Community","2011-2015"]
["Florida","Bay","12005001800","Low-Income Community","2011-2015"]
["Florida","Bay","12005002000","Low-Income Community","2011-2015"]
["Florida","Bradford","12007000400","Low-Income Community","2011-2015"]
["Florida","Brevard","12009060700","Low-Income Community","2011-2015"]
["Florida","Brevard","12009062106","Low-Income Community","2011-2015"]
["Florida","Brevard","12009062302","Low-Income Community","2011-2015"]
["Florida","Brevard","12009062400","Low-Income Community","2011-2015"]
["Florida","Brevard","12009062600","Low-Income Community","2011-2015"]
["Florida","Brevard","12009064700","Low-Income Community","2011-2015"]
["Florida","Brevard","12009064902","Low-Income Community","2011-2015"]
["Florida","Brevard","12009065124","Low-Income Community","2011-2015"]
["Florida","Brevard","12009065234","Low-Income Community","2011-2015"]
["Florida","Broward","12011010304","Low-Income Community","2011-2015"]
["Florida","Broward","12011020412","Low-Income Community","2011-2015"]
["Florida","Broward","12011030402","Low-Income Community","2011-2015"]
["Florida","Broward","12011030600","Low-Income Community","2011-2015"]
["Florida","Broward","12011040801","Low-Income Community","2011-2015"]
["Florida","Broward","12011040901","Low-Income Community","2011-2015"]
["Florida","Broward","12011041000","Low-Income Community","2011-2015"]
["Florida","Broward","12011041100","Low-Income Community","2011-2015"]
["Florida","Broward","12011041200","Low-Income Community","2011-2015"]
["Florida","Broward","12011041300","Low-Income Community","2011-2015"]
["Florida","Broward","12011041400","Low-Income Community","2011-2015"]
["Florida","Broward","12011041500","Low-Income Community","2011-2015"]
["Florida","Broward","12011041600","Low-Income Community","2011-2015"]
["Florida","Broward","12011041700","Low-Income Community","2011-2015"]
["Florida","Broward","12011050207","Low-Income Community","2011-2015"]
["Florida","Broward","12011050301","Low-Income Community","2011-2015"]
["Florida","Broward","12011050308","Low-Income Community","2011-2015"]
["Florida","Broward","12011050310","Low-Income Community","2011-2015"]
["Florida","Broward","12011050311","Low-Income Community","2011-2015"]
["Florida","Broward","12011050312","Low-Income Community","2011-2015"]
["Florida","Broward","12011050702","Low-Income Community","2011-2015"]
["Florida","Broward","12011060303","Low-Income Community","2011-2015"]
["Florida","Broward","12011080500","Low-Income Community","2011-2015"]
["Florida","Broward","12011091902","Low-Income Community","2011-2015"]
["Florida","Broward","12011100201","Low-Income Community","2011-2015"]
["Florida","Broward","12011100300","Low-Income Community","2011-2015"]
["Florida","Broward","12011100502","Low-Income Community","2011-2015"]
["Florida","Broward","12011100700","Low-Income Community","2011-2015"]
["Florida","Broward","12011100801","Low-Income Community","2011-2015"]
["Florida","Broward","12011110501","Low-Income Community","2011-2015"]
["Florida","Calhoun","12013010300","Low-Income Community","2011-2015"]
["Florida","Charlotte","12015010100","Low-Income Community","2011-2015"]
["Florida","Charlotte","12015020700","Low-Income Community","2011-2015"]
["Florida","Charlotte","12015030401","Low-Income Community","2011-2015"]
["Florida","Citrus","12017450202","Low-Income Community","2011-2015"]
["Florida","Citrus","12017450800","Low-Income Community","2011-2015"]
["Florida","Citrus","12017451502","Low-Income Community","2011-2015"]
["Florida","Clay","12019030102","Low-Income Community","2011-2015"]
["Florida","Clay","12019030104","Low-Income Community","2011-2015"]
["Florida","Collier","12021010411","Low-Income Community","2011-2015"]
["Florida","Collier","12021010802","Low-Income Community","2011-2015"]
["Florida","Collier","12021011205","Low-Income Community","2011-2015"]
["Florida","Collier","12021011301","Low-Income Community","2011-2015"]
["Florida","Collier","12021011400","Low-Income Community","2011-2015"]
["Florida","Columbia","12023110300","Low-Income Community","2011-2015"]
["Florida","DeSoto","12027010200","Low-Income Community","2011-2015"]
["Florida","DeSoto","12027010301","Low-Income Community","2011-2015"]
["Florida","Dixie","12029970101","Low-Income Community","2011-2015"]
["Florida","Duval","12031000600","Low-Income Community","2011-2015"]
["Florida","Duval","12031001000","Low-Income Community","2011-2015"]
["Florida","Duval","12031001300","Low-Income Community","2011-2015"]
["Florida","Duval","12031001400","Low-Income Community","2011-2015"]
["Florida","Duval","12031001600","Low-Income Community","2011-2015"]
["Florida","Duval","12031002600","Low-Income Community","2011-2015"]
["Florida","Duval","12031002901","Low-Income Community","2011-2015"]
["Florida","Duval","12031010700","Low-Income Community","2011-2015"]
["Florida","Duval","12031011000","Low-Income Community","2011-2015"]
["Florida","Duval","12031011300","Low-Income Community","2011-2015"]
["Florida","Duval","12031011500","Low-Income Community","2011-2015"]
["Florida","Duval","12031011600","Low-Income Community","2011-2015"]
["Florida","Duval","12031011800","Low-Income Community","2011-2015"]
["Florida","Duval","12031012200","Low-Income Community","2011-2015"]
["Florida","Duval","12031012400","Low-Income Community","2011-2015"]
["Florida","Duval","12031012601","Low-Income Community","2011-2015"]
["Florida","Duval","12031012602","Low-Income Community","2011-2015"]
["Florida","Duval","12031013800","Low-Income Community","2011-2015"]
["Florida","Duval","12031013901","Low-Income Community","2011-2015"]
["Florida","Duval","12031015502","Low-Income Community","2011-2015"]
["Florida","Duval","12031017400","Low-Income Community","2011-2015"]
["Florida","Escambia","12033000400","Low-Income Community","2011-2015"]
["Florida","Escambia","12033001300","Low-Income Community","2011-2015"]
["Florida","Escambia","12033001600","Low-Income Community","2011-2015"]
["Florida","Escambia","12033001700","Low-Income Community","2011-2015"]
["Florida","Escambia","12033001900","Low-Income Community","2011-2015"]
["Florida","Escambia","12033002803","Low-Income Community","2011-2015"]
["Florida","Escambia","12033004000","Low-Income Community","2011-2015"]
["Florida","Flagler","12035060213","Low-Income Community","2011-2015"]
["Florida","Franklin","12037970200","Low-Income Community","2011-2015"]
["Florida","Gadsden","12039020102","Low-Income Community","2011-2015"]
["Florida","Gilchrist","12041950100","Low-Income Community","2011-2015"]
["Florida","Gilchrist","12041950201","Low-Income Community","2011-2015"]
["Florida","Glades","12043000200","Low-Income Community","2011-2015"]
["Florida","Glades","12043000300","Low-Income Community","2011-2015"]
["Florida","Gulf","12045960200","Low-Income Community","2011-2015"]
["Florida","Hamilton","12047960100","Low-Income Community","2011-2015"]
["Florida","Hamilton","12047960300","Low-Income Community","2011-2015"]
["Florida","Hardee","12049970102","Low-Income Community","2011-2015"]
["Florida","Hendry","12051000200","Low-Income Community","2011-2015"]
["Florida","Hernando","12053040400","Low-Income Community","2011-2015"]
["Florida","Hernando","12053040502","Low-Income Community","2011-2015"]
["Florida","Hernando","12053041104","Low-Income Community","2011-2015"]
["Florida","Hernando","12053041204","Low-Income Community","2011-2015"]
["Florida","Hernando","12053041302","Low-Income Community","2011-2015"]
["Florida","Highlands","12055960103","Low-Income Community","2011-2015"]
["Florida","Highlands","12055960300","Low-Income Community","2011-2015"]
["Florida","Highlands","12055961200","Low-Income Community","2011-2015"]
["Florida","Highlands","12055961700","Low-Income Community","2011-2015"]
["Florida","Hillsborough","12057000102","Low-Income Community","2011-2015"]
["Florida","Hillsborough","12057000201","Low-Income Community","2011-2015"]
["Florida","Hillsborough","12057000202","Low-Income Community","2011-2015"]
["Florida","Hillsborough","12057000300","Low-Income Community","2011-2015"]
["Florida","Hillsborough","12057000700","Low-Income Community","2011-2015"]
["Florida","Hillsborough","12057001002","Low-Income Community","2011-2015"]
["Florida","Hillsborough","12057001800","Low-Income Community","2011-2015"]
["Florida","Hillsborough","12057002600","Low-Income Community","2011-2015"]
["Florida","Hillsborough","12057002900","Low-Income Community","2011-2015"]
["Florida","Hillsborough","12057003000","Low-Income Community","2011-2015"]
["Florida","Hillsborough","12057003100","Low-Income Community","2011-2015"]
["Florida","Hillsborough","12057003200","Low-Income Community","2011-2015"]
["Florida","Hillsborough","12057003300","Low-Income Community","2011-2015"]
["Florida","Hillsborough","12057003400","Low-Income Community","2011-2015"]
["Florida","Hillsborough","12057003500","Low-Income Community","2011-2015"]
["Florida","Hillsborough","12057003600","Low-Income Community","2011-2015"]
["Florida","Hillsborough","12057003900","Low-Income Community","2011-2015"]
["Florida","Hillsborough","12057004000","Low-Income Community","2011-2015"]
["Florida","Hillsborough","12057004200","Low-Income Community","2011-2015"]
["Florida","Hillsborough","12057004300","Low-Income Community","2011-2015"]
["Florida","Hillsborough","12057004500","Low-Income Community","2011-2015"]
["Florida","Hillsborough","12057005101","Low-Income Community","2011-2015"]
["Florida","Hillsborough","12057010203","Low-Income Community","2011-2015"]
["Florida","Hillsborough","12057010805","Low-Income Community","2011-2015"]
["Florida","Hillsborough","12057010815","Low-Income Community","2011-2015"]
["Florida","Hillsborough","12057010816","Low-Income Community","2011-2015"]
["Florida","Hillsborough","12057010818","Low-Income Community","2011-2015"]
["Florida","Hillsborough","12057012002","Low-Income Community","2011-2015"]
["Florida","Hillsborough","12057013503","Low-Income Community","2011-2015"]
["Florida","Hillsborough","12057013504","Low-Income Community","2011-2015"]
["Florida","Hillsborough","12057013505","Low-Income Community","2011-2015"]
["Florida","Hillsborough","12057013604","Low-Income Community","2011-2015"]
["Florida","Holmes","12059960200","Low-Income Community","2011-2015"]
["Florida","Indian River","12061050904","Low-Income Community","2011-2015"]
["Florida","Jackson","12063210200","Low-Income Community","2011-2015"]
["Florida","Jackson","12063210500","Low-Income Community","2011-2015"]
["Florida","Jefferson","12065250101","Low-Income Community","2011-2015"]
["Florida","Lafayette","12067960100","Low-Income Community","2011-2015"]
["Florida","Lake","12069030102","Low-Income Community","2011-2015"]
["Florida","Lake","12069030107","Low-Income Community","2011-2015"]
["Florida","Lake","12069030206","Low-Income Community","2011-2015"]
["Florida","Lake","12069030502","Low-Income Community","2011-2015"]
["Florida","Lake","12069030504","Low-Income Community","2011-2015"]
["Florida","Lake","12069031205","Low-Income Community","2011-2015"]
["Florida","Lee","12071000502","Low-Income Community","2011-2015"]
["Florida","Lee","12071000503","Low-Income Community","2011-2015"]
["Florida","Lee","12071000600","Low-Income Community","2011-2015"]
["Florida","Lee","12071001910","Low-Income Community","2011-2015"]
["Florida","Lee","12071010201","Low-Income Community","2011-2015"]
["Florida","Lee","12071010302","Low-Income Community","2011-2015"]
["Florida","Lee","12071010307","Low-Income Community","2011-2015"]
["Florida","Lee","12071020201","Low-Income Community","2011-2015"]
["Florida","Lee","12071020300","Low-Income Community","2011-2015"]
["Florida","Lee","12071020502","Low-Income Community","2011-2015"]
["Florida","Lee","12071040122","Low-Income Community","2011-2015"]
["Florida","Lee","12071040308","Low-Income Community","2011-2015"]
["Florida","Lee","12071040313","Low-Income Community","2011-2015"]
["Florida","Lee","12071040314","Low-Income Community","2011-2015"]
["Florida","Lee","12071050103","Low-Income Community","2011-2015"]
["Florida","Leon","12073000400","Low-Income Community","2011-2015"]
["Florida","Leon","12073000500","Low-Income Community","2011-2015"]
["Florida","Leon","12073000600","Low-Income Community","2011-2015"]
["Florida","Leon","12073001002","Low-Income Community","2011-2015"]
["Florida","Leon","12073001101","Low-Income Community","2011-2015"]
["Florida","Leon","12073001401","Low-Income Community","2011-2015"]
["Florida","Leon","12073002003","Low-Income Community","2011-2015"]
["Florida","Leon","12073002005","Low-Income Community","2011-2015"]
["Florida","Levy","12075970101","Low-Income Community","2011-2015"]
["Florida","Levy","12075970102","Low-Income Community","2011-2015"]
["Florida","Liberty","12077950200","Low-Income Community","2011-2015"]
["Florida","Madison","12079110302","Low-Income Community","2011-2015"]
["Florida","Manatee","12081000103","Low-Income Community","2011-2015"]
["Florida","Manatee","12081000105","Low-Income Community","2011-2015"]
["Florida","Manatee","12081000106","Low-Income Community","2011-2015"]
["Florida","Manatee","12081000306","Low-Income Community","2011-2015"]
["Florida","Manatee","12081000601","Low-Income Community","2011-2015"]
["Florida","Manatee","12081000703","Low-Income Community","2011-2015"]
["Florida","Marion","12083000401","Low-Income Community","2011-2015"]
["Florida","Marion","12083000601","Low-Income Community","2011-2015"]
["Florida","Marion","12083001204","Low-Income Community","2011-2015"]
["Florida","Marion","12083001401","Low-Income Community","2011-2015"]
["Florida","Marion","12083001500","Low-Income Community","2011-2015"]
["Florida","Marion","12083001800","Low-Income Community","2011-2015"]
["Florida","Marion","12083001900","Low-Income Community","2011-2015"]
["Florida","Marion","12083002002","Low-Income Community","2011-2015"]
["Florida","Marion","12083002602","Low-Income Community","2011-2015"]
["Florida","Martin","12085000501","Low-Income Community","2011-2015"]
["Florida","Martin","12085001801","Low-Income Community","2011-2015"]
["Florida","Miami-Dade","12086000109","Low-Income Community","2011-2015"]
["Florida","Miami-Dade","12086000134","Low-Income Community","2011-2015"]
["Florida","Miami-Dade","12086000206","Low-Income Community","2011-2015"]
["Florida","Miami-Dade","12086000209","Low-Income Community","2011-2015"]
["Florida","Miami-Dade","12086000404","Low-Income Community","2011-2015"]
["Florida","Miami-Dade","12086000405","Low-Income Community","2011-2015"]
["Florida","Miami-Dade","12086000408","Low-Income Community","2011-2015"]
["Florida","Miami-Dade","12086000409","Low-Income Community","2011-2015"]
["Florida","Miami-Dade","12086000501","Low-Income Community","2011-2015"]
["Florida","Miami-Dade","12086000807","Low-Income Community","2011-2015"]
["Florida","Miami-Dade","12086000903","Low-Income Community","2011-2015"]
["Florida","Miami-Dade","12086001002","Low-Income Community","2011-2015"]
["Florida","Miami-Dade","12086001004","Low-Income Community","2011-2015"]
["Florida","Miami-Dade","12086001005","Low-Income Community","2011-2015"]
["Florida","Miami-Dade","12086001006","Low-Income Community","2011-2015"]
["Florida","Miami-Dade","12086001401","Low-Income Community","2011-2015"]
["Florida","Miami-Dade","12086001402","Low-Income Community","2011-2015"]
["Florida","Miami-Dade","12086001501","Low-Income Community","2011-2015"]
["Florida","Miami-Dade","12086001502","Low-Income Community","2011-2015"]
["Florida","Miami-Dade","12086001605","Low-Income Community","2011-2015"]
["Florida","Miami-Dade","12086001606","Low-Income Community","2011-2015"]
["Florida","Miami-Dade","12086001701","Low-Income Community","2011-2015"]
["Florida","Miami-Dade","12086001702","Low-Income Community","2011-2015"]
["Florida","Miami-Dade","12086001801","Low-Income Community","2011-2015"]
["Florida","Miami-Dade","12086001802","Low-Income Community","2011-2015"]
["Florida","Miami-Dade","12086001803","Low-Income Community","2011-2015"]
["Florida","Miami-Dade","12086001901","Low-Income Community","2011-2015"]
["Florida","Miami-Dade","12086001903","Low-Income Community","2011-2015"]
["Florida","Miami-Dade","12086001904","Low-Income Community","2011-2015"]
["Florida","Miami-Dade","12086002001","Low-Income Community","2011-2015"]
["Florida","Miami-Dade","12086002003","Low-Income Community","2011-2015"]
["Florida","Miami-Dade","12086002004","Low-Income Community","2011-2015"]
["Florida","Miami-Dade","12086002201","Low-Income Community","2011-2015"]
["Florida","Miami-Dade","12086002300","Low-Income Community","2011-2015"]
["Florida","Miami-Dade","12086002402","Low-Income Community","2011-2015"]
["Florida","Miami-Dade","12086002404","Low-Income Community","2011-2015"]
["Florida","Miami-Dade","12086002501","Low-Income Community","2011-2015"]
["Florida","Miami-Dade","12086002502","Low-Income Community","2011-2015"]
["Florida","Miami-Dade","12086002702","Low-Income Community","2011-2015"]
["Florida","Miami-Dade","12086003100","Low-Income Community","2011-2015"]
["Florida","Miami-Dade","12086003400","Low-Income Community","2011-2015"]
["Florida","Miami-Dade","12086003601","Low-Income Community","2011-2015"]
["Florida","Miami-Dade","12086005502","Low-Income Community","2011-2015"]
["Florida","Miami-Dade","12086005701","Low-Income Community","2011-2015"]
["Florida","Miami-Dade","12086007200","Low-Income Community","2011-2015"]
["Florida","Miami-Dade","12086007603","Low-Income Community","2011-2015"]
["Florida","Miami-Dade","12086008208","Low-Income Community","2011-2015"]
["Florida","Miami-Dade","12086008304","Low-Income Community","2011-2015"]
["Florida","Miami-Dade","12086008309","Low-Income Community","2011-2015"]
["Florida","Miami-Dade","12086009100","Low-Income Community","2011-2015"]
["Florida","Miami-Dade","12086009307","Low-Income Community","2011-2015"]
["Florida","Miami-Dade","12086009308","Low-Income Community","2011-2015"]
["Florida","Miami-Dade","12086009400","Low-Income Community","2011-2015"]
["Florida","Miami-Dade","12086009807","Low-Income Community","2011-2015"]
["Florida","Miami-Dade","12086009904","Low-Income Community","2011-2015"]
["Florida","Miami-Dade","12086010001","Low-Income Community","2011-2015"]
["Florida","Miami-Dade","12086010011","Low-Income Community","2011-2015"]
["Florida","Miami-Dade","12086010015","Low-Income Community","2011-2015"]
["Florida","Miami-Dade","12086010016","Low-Income Community","2011-2015"]
["Florida","Miami-Dade","12086010609","Low-Income Community","2011-2015"]
["Florida","Miami-Dade","12086011001","Low-Income Community","2011-2015"]
["Florida","Miami-Dade","12086011005","Low-Income Community","2011-2015"]
["Florida","Miami-Dade","12086011101","Low-Income Community","2011-2015"]
["Florida","Miami-Dade","12086011300","Low-Income Community","2011-2015"]
["Florida","Miami-Dade","12086011403","Low-Income Community","2011-2015"]
["Florida","Miami-Dade","12086013400","Low-Income Community","2011-2015"]
["Florida","Miami-Dade","12086980800","Low-Income Community","2011-2015"]
["Florida","Monroe","12087971100","Low-Income Community","2011-2015"]
["Florida","Nassau","12089050302","Low-Income Community","2011-2015"]
["Florida","Nassau","12089050303","Low-Income Community","2011-2015"]
["Florida","Okaloosa","12091021900","Low-Income Community","2011-2015"]
["Florida","Okeechobee","12093910300","Low-Income Community","2011-2015"]
["Florida","Okeechobee","12093910401","Low-Income Community","2011-2015"]
["Florida","Orange","12095010400","Low-Income Community","2011-2015"]
["Florida","Orange","12095010500","Low-Income Community","2011-2015"]
["Florida","Orange","12095011701","Low-Income Community","2011-2015"]
["Florida","Orange","12095011702","Low-Income Community","2011-2015"]
["Florida","Orange","12095012000","Low-Income Community","2011-2015"]
["Florida","Orange","12095012100","Low-Income Community","2011-2015"]
["Florida","Orange","12095012202","Low-Income Community","2011-2015"]
["Florida","Orange","12095012304","Low-Income Community","2011-2015"]
["Florida","Orange","12095012305","Low-Income Community","2011-2015"]
["Florida","Orange","12095012307","Low-Income Community","2011-2015"]
["Florida","Orange","12095012402","Low-Income Community","2011-2015"]
["Florida","Orange","12095013402","Low-Income Community","2011-2015"]
["Florida","Orange","12095013406","Low-Income Community","2011-2015"]
["Florida","Orange","12095014605","Low-Income Community","2011-2015"]
["Florida","Orange","12095014608","Low-Income Community","2011-2015"]
["Florida","Orange","12095014904","Low-Income Community","2011-2015"]
["Florida","Orange","12095015202","Low-Income Community","2011-2015"]
["Florida","Orange","12095016724","Low-Income Community","2011-2015"]
["Florida","Orange","12095017600","Low-Income Community","2011-2015"]
["Florida","Orange","12095018000","Low-Income Community","2011-2015"]
["Florida","Orange","12095018300","Low-Income Community","2011-2015"]
["Florida","Orange","12095018400","Low-Income Community","2011-2015"]
["Florida","Orange","12095018500","Low-Income Community","2011-2015"]
["Florida","Orange","12095018700","Low-Income Community","2011-2015"]
["Florida","Osceola","12097041100","Low-Income Community","2011-2015"]
["Florida","Osceola","12097042300","Low-Income Community","2011-2015"]
["Florida","Osceola","12097042701","Low-Income Community","2011-2015"]
["Florida","Osceola","12097042900","Low-Income Community","2011-2015"]
["Florida","Osceola","12097043500","Low-Income Community","2011-2015"]
["Florida","Palm Beach","12099001302","Low-Income Community","2011-2015"]
["Florida","Palm Beach","12099001402","Low-Income Community","2011-2015"]
["Florida","Palm Beach","12099001403","Low-Income Community","2011-2015"]
["Florida","Palm Beach","12099001404","Low-Income Community","2011-2015"]
["Florida","Palm Beach","12099001600","Low-Income Community","2011-2015"]
["Florida","Palm Beach","12099001700","Low-Income Community","2011-2015"]
["Florida","Palm Beach","12099001801","Low-Income Community","2011-2015"]
["Florida","Palm Beach","12099001911","Low-Income Community","2011-2015"]
["Florida","Palm Beach","12099002200","Low-Income Community","2011-2015"]
["Florida","Palm Beach","12099003102","Low-Income Community","2011-2015"]
["Florida","Palm Beach","12099004009","Low-Income Community","2011-2015"]
["Florida","Palm Beach","12099004201","Low-Income Community","2011-2015"]
["Florida","Palm Beach","12099005102","Low-Income Community","2011-2015"]
["Florida","Palm Beach","12099005701","Low-Income Community","2011-2015"]
["Florida","Palm Beach","12099006100","Low-Income Community","2011-2015"]
["Florida","Palm Beach","12099006700","Low-Income Community","2011-2015"]
["Florida","Palm Beach","12099006801","Low-Income Community","2011-2015"]
["Florida","Palm Beach","12099006802","Low-Income Community","2011-2015"]
["Florida","Palm Beach","12099007746","Low-Income Community","2011-2015"]
["Florida","Palm Beach","12099007833","Low-Income Community","2011-2015"]
["Florida","Palm Beach","12099008001","Low-Income Community","2011-2015"]
["Florida","Palm Beach","12099008002","Low-Income Community","2011-2015"]
["Florida","Palm Beach","12099008201","Low-Income Community","2011-2015"]
["Florida","Palm Beach","12099008202","Low-Income Community","2011-2015"]
["Florida","Palm Beach","12099008301","Low-Income Community","2011-2015"]
["Florida","Palm Beach","12099008302","Low-Income Community","2011-2015"]
["Florida","Pasco","12101030102","Low-Income Community","2011-2015"]
["Florida","Pasco","12101030407","Low-Income Community","2011-2015"]
["Florida","Pasco","12101030410","Low-Income Community","2011-2015"]
["Florida","Pasco","12101030903","Low-Income Community","2011-2015"]
["Florida","Pasco","12101031013","Low-Income Community","2011-2015"]
["Florida","Pasco","12101031102","Low-Income Community","2011-2015"]
["Florida","Pasco","12101031206","Low-Income Community","2011-2015"]
["Florida","Pasco","12101031405","Low-Income Community","2011-2015"]
["Florida","Pasco","12101031406","Low-Income Community","2011-2015"]
["Florida","Pasco","12101031408","Low-Income Community","2011-2015"]
["Florida","Pasco","12101031807","Low-Income Community","2011-2015"]
["Florida","Pasco","12101031809","Low-Income Community","2011-2015"]
["Florida","Pasco","12101032803","Low-Income Community","2011-2015"]
["Florida","Pasco","12101032904","Low-Income Community","2011-2015"]
["Florida","Pasco","12101033007","Low-Income Community","2011-2015"]
["Florida","Pasco","12101033008","Low-Income Community","2011-2015"]
["Florida","Pasco","12101033011","Low-Income Community","2011-2015"]
["Florida","Pinellas","12103020500","Low-Income Community","2011-2015"]
["Florida","Pinellas","12103020600","Low-Income Community","2011-2015"]
["Florida","Pinellas","12103020800","Low-Income Community","2011-2015"]
["Florida","Pinellas","12103021200","Low-Income Community","2011-2015"]
["Florida","Pinellas","12103021600","Low-Income Community","2011-2015"]
["Florida","Pinellas","12103021900","Low-Income Community","2011-2015"]
["Florida","Pinellas","12103024510","Low-Income Community","2011-2015"]
["Florida","Pinellas","12103024602","Low-Income Community","2011-2015"]
["Florida","Pinellas","12103025115","Low-Income Community","2011-2015"]
["Florida","Pinellas","12103025305","Low-Income Community","2011-2015"]
["Florida","Pinellas","12103025417","Low-Income Community","2011-2015"]
["Florida","Pinellas","12103025602","Low-Income Community","2011-2015"]
["Florida","Pinellas","12103025603","Low-Income Community","2011-2015"]
["Florida","Pinellas","12103025900","Low-Income Community","2011-2015"]
["Florida","Pinellas","12103027402","Low-Income Community","2011-2015"]
["Florida","Pinellas","12103028700","Low-Income Community","2011-2015"]
["Florida","Polk","12105010900","Low-Income Community","2011-2015"]
["Florida","Polk","12105011000","Low-Income Community","2011-2015"]
["Florida","Polk","12105011100","Low-Income Community","2011-2015"]
["Florida","Polk","12105011202","Low-Income Community","2011-2015"]
["Florida","Polk","12105011204","Low-Income Community","2011-2015"]
["Florida","Polk","12105011501","Low-Income Community","2011-2015"]
["Florida","Polk","12105011721","Low-Income Community","2011-2015"]
["Florida","Polk","12105012305","Low-Income Community","2011-2015"]
["Florida","Polk","12105012804","Low-Income Community","2011-2015"]
["Florida","Polk","12105013002","Low-Income Community","2011-2015"]
["Florida","Polk","12105013300","Low-Income Community","2011-2015"]
["Florida","Polk","12105013500","Low-Income Community","2011-2015"]
["Florida","Polk","12105013701","Low-Income Community","2011-2015"]
["Florida","Polk","12105014301","Low-Income Community","2011-2015"]
["Florida","Polk","12105014501","Low-Income Community","2011-2015"]
["Florida","Polk","12105015702","Low-Income Community","2011-2015"]
["Florida","Polk","12105016002","Low-Income Community","2011-2015"]
["Florida","Polk","12105016100","Low-Income Community","2011-2015"]
["Florida","Polk","12105016400","Low-Income Community","2011-2015"]
["Florida","Putnam","12107950800","Low-Income Community","2011-2015"]
["Florida","Putnam","12107950900","Low-Income Community","2011-2015"]
["Florida","Putnam","12107951401","Low-Income Community","2011-2015"]
["Florida","St. Johns","12109020400","Low-Income Community","2011-2015"]
["Florida","St. Johns","12109021003","Low-Income Community","2011-2015"]
["Florida","St. Lucie","12111380200","Low-Income Community","2011-2015"]
["Florida","St. Lucie","12111380300","Low-Income Community","2011-2015"]
["Florida","St. Lucie","12111380901","Low-Income Community","2011-2015"]
["Florida","St. Lucie","12111382009","Low-Income Community","2011-2015"]
["Florida","Santa Rosa","12113010600","Low-Income Community","2011-2015"]
["Florida","Sarasota","12115000102","Low-Income Community","2011-2015"]
["Florida","Sarasota","12115000200","Low-Income Community","2011-2015"]
["Florida","Sarasota","12115000300","Low-Income Community","2011-2015"]
["Florida","Sarasota","12115000406","Low-Income Community","2011-2015"]
["Florida","Sarasota","12115002721","Low-Income Community","2011-2015"]
["Florida","Seminole","12117020102","Low-Income Community","2011-2015"]
["Florida","Seminole","12117020401","Low-Income Community","2011-2015"]
["Florida","Seminole","12117020901","Low-Income Community","2011-2015"]
["Florida","Seminole","12117022001","Low-Income Community","2011-2015"]
["Florida","Sumter","12119910602","Low-Income Community","2011-2015"]
["Florida","Sumter","12119911000","Low-Income Community","2011-2015"]
["Florida","Suwannee","12121970301","Low-Income Community","2011-2015"]
["Florida","Suwannee","12121970500","Low-Income Community","2011-2015"]
["Florida","Taylor","12123950300","Low-Income Community","2011-2015"]
["Florida","Union","12125960200","Low-Income Community","2011-2015"]
["Florida","Volusia","12127081000","Low-Income Community","2011-2015"]
["Florida","Volusia","12127081700","Low-Income Community","2011-2015"]
["Florida","Volusia","12127081800","Low-Income Community","2011-2015"]
["Florida","Volusia","12127082000","Low-Income Community","2011-2015"]
["Florida","Volusia","12127082100","Low-Income Community","2011-2015"]
["Florida","Volusia","12127082301","Low-Income Community","2011-2015"]
["Florida","Volusia","12127082401","Low-Income Community","2011-2015"]
["Florida","Volusia","12127082415","Low-Income Community","2011-2015"]
["Florida","Volusia","12127082511","Low-Income Community","2011-2015"]
["Florida","Volusia","12127083008","Low-Income Community","2011-2015"]
["Florida","Volusia","12127090500","Low-Income Community","2011-2015"]
["Florida","Volusia","12127090600","Low-Income Community","2011-2015"]
["Florida","Wakulla","12129010202","Low-Income Community","2011-2015"]
["Florida","Walton","12131950301","Low-Income Community","2011-2015"]
["Florida","Washington","12133970104","Low-Income Community","2011-2015"]
["Georgia","Atkinson","13003960100","Low-Income Community","2011-2015"]
["Georgia","Baldwin","13009970200","Low-Income Community","2011-2015"]
["Georgia","Baldwin","13009970400","Low-Income Community","2011-2015"]
["Georgia","Baldwin","13009970500","Low-Income Community","2011-2015"]
["Georgia","Baldwin","13009970600","Low-Income Community","2011-2015"]
["Georgia","Baldwin","13009970701","Low-Income Community","2011-2015"]
["Georgia","Baldwin","13009970702","Low-Income Community","2011-2015"]
["Georgia","Barrow","13013180205","Low-Income Community","2011-2015"]
["Georgia","Ben Hill","13017960100","Low-Income Community","2011-2015"]
["Georgia","Ben Hill","13017960300","Low-Income Community","2011-2015"]
["Georgia","Ben Hill","13017960400","Low-Income Community","2011-2015"]
["Georgia","Ben Hill","13017960500","Low-Income Community","2011-2015"]
["Georgia","Berrien","13019970400","Low-Income Community","2011-2015"]
["Georgia","Bibb","13021010100","Low-Income Community","2011-2015"]
["Georgia","Bibb","13021010400","Low-Income Community","2011-2015"]
["Georgia","Bibb","13021010500","Low-Income Community","2011-2015"]
["Georgia","Bibb","13021011000","Low-Income Community","2011-2015"]
["Georgia","Bibb","13021011100","Low-Income Community","2011-2015"]
["Georgia","Bibb","13021011500","Low-Income Community","2011-2015"]
["Georgia","Bibb","13021012300","Low-Income Community","2011-2015"]
["Georgia","Bibb","13021012400","Low-Income Community","2011-2015"]
["Georgia","Bibb","13021012500","Low-Income Community","2011-2015"]
["Georgia","Bibb","13021012600","Low-Income Community","2011-2015"]
["Georgia","Bibb","13021012700","Low-Income Community","2011-2015"]
["Georgia","Bibb","13021012800","Low-Income Community","2011-2015"]
["Georgia","Bibb","13021012900","Low-Income Community","2011-2015"]
["Georgia","Bibb","13021013800","Low-Income Community","2011-2015"]
["Georgia","Bibb","13021013900","Low-Income Community","2011-2015"]
["Georgia","Bleckley","13023790200","Low-Income Community","2011-2015"]
["Georgia","Brooks","13027960300","Low-Income Community","2011-2015"]
["Georgia","Brooks","13027960400","Low-Income Community","2011-2015"]
["Georgia","Bulloch","13031110200","Low-Income Community","2011-2015"]
["Georgia","Bulloch","13031110401","Low-Income Community","2011-2015"]
["Georgia","Bulloch","13031110403","Low-Income Community","2011-2015"]
["Georgia","Bulloch","13031110404","Low-Income Community","2011-2015"]
["Georgia","Bulloch","13031110500","Low-Income Community","2011-2015"]
["Georgia","Bulloch","13031110602","Low-Income Community","2011-2015"]
["Georgia","Burke","13033950100","Low-Income Community","2011-2015"]
["Georgia","Burke","13033950200","Low-Income Community","2011-2015"]
["Georgia","Burke","13033950400","Low-Income Community","2011-2015"]
["Georgia","Calhoun","13037950100","Low-Income Community","2011-2015"]
["Georgia","Calhoun","13037950200","Low-Income Community","2011-2015"]
["Georgia","Candler","13043950100","Low-Income Community","2011-2015"]
["Georgia","Candler","13043950300","Low-Income Community","2011-2015"]
["Georgia","Carroll","13045910501","Low-Income Community","2011-2015"]
["Georgia","Carroll","13045910502","Low-Income Community","2011-2015"]
["Georgia","Chatham","13051000100","Low-Income Community","2011-2015"]
["Georgia","Chatham","13051000601","Low-Income Community","2011-2015"]
["Georgia","Chatham","13051001100","Low-Income Community","2011-2015"]
["Georgia","Chatham","13051001200","Low-Income Community","2011-2015"]
["Georgia","Chatham","13051002100","Low-Income Community","2011-2015"]
["Georgia","Chatham","13051002700","Low-Income Community","2011-2015"]
["Georgia","Chatham","13051003301","Low-Income Community","2011-2015"]
["Georgia","Chatham","13051010101","Low-Income Community","2011-2015"]
["Georgia","Chatham","13051010901","Low-Income Community","2011-2015"]
["Georgia","Clay","13061960300","Low-Income Community","2011-2015"]
["Georgia","Clayton","13063040303","Low-Income Community","2011-2015"]
["Georgia","Clayton","13063040306","Low-Income Community","2011-2015"]
["Georgia","Clayton","13063040415","Low-Income Community","2011-2015"]
["Georgia","Clinch","13065970100","Low-Income Community","2011-2015"]
["Georgia","Cobb","13067030411","Low-Income Community","2011-2015"]
["Georgia","Cobb","13067030412","Low-Income Community","2011-2015"]
["Georgia","Cobb","13067030800","Low-Income Community","2011-2015"]
["Georgia","Cobb","13067031001","Low-Income Community","2011-2015"]
["Georgia","Cobb","13067031113","Low-Income Community","2011-2015"]
["Georgia","Coffee","13069010500","Low-Income Community","2011-2015"]
["Georgia","Coffee","13069010700","Low-Income Community","2011-2015"]
["Georgia","Coffee","13069010802","Low-Income Community","2011-2015"]
["Georgia","Colquitt","13071970300","Low-Income Community","2011-2015"]
["Georgia","Colquitt","13071970400","Low-Income Community","2011-2015"]
["Georgia","Colquitt","13071970702","Low-Income Community","2011-2015"]
["Georgia","Colquitt","13071970800","Low-Income Community","2011-2015"]
["Georgia","Cook","13075960200","Low-Income Community","2011-2015"]
["Georgia","Coweta","13077170305","Low-Income Community","2011-2015"]
["Georgia","Coweta","13077170601","Low-Income Community","2011-2015"]
["Georgia","Crisp","13081010100","Low-Income Community","2011-2015"]
["Georgia","Crisp","13081010201","Low-Income Community","2011-2015"]
["Georgia","Crisp","13081010202","Low-Income Community","2011-2015"]
["Georgia","Decatur","13087970400","Low-Income Community","2011-2015"]
["Georgia","DeKalb","13089020600","Low-Income Community","2011-2015"]
["Georgia","DeKalb","13089021204","Low-Income Community","2011-2015"]
["Georgia","DeKalb","13089021409","Low-Income Community","2011-2015"]
["Georgia","DeKalb","13089021908","Low-Income Community","2011-2015"]
["Georgia","DeKalb","13089021911","Low-Income Community","2011-2015"]
["Georgia","DeKalb","13089022007","Low-Income Community","2011-2015"]
["Georgia","DeKalb","13089022008","Low-Income Community","2011-2015"]
["Georgia","DeKalb","13089022010","Low-Income Community","2011-2015"]
["Georgia","DeKalb","13089023108","Low-Income Community","2011-2015"]
["Georgia","DeKalb","13089023112","Low-Income Community","2011-2015"]
["Georgia","DeKalb","13089023504","Low-Income Community","2011-2015"]
["Georgia","DeKalb","13089023700","Low-Income Community","2011-2015"]
["Georgia","Dodge","13091960200","Low-Income Community","2011-2015"]
["Georgia","Dooly","13093970100","Low-Income Community","2011-2015"]
["Georgia","Dooly","13093970300","Low-Income Community","2011-2015"]
["Georgia","Dougherty","13095000200","Low-Income Community","2011-2015"]
["Georgia","Dougherty","13095000800","Low-Income Community","2011-2015"]
["Georgia","Dougherty","13095001000","Low-Income Community","2011-2015"]
["Georgia","Dougherty","13095001100","Low-Income Community","2011-2015"]
["Georgia","Dougherty","13095001403","Low-Income Community","2011-2015"]
["Georgia","Dougherty","13095001500","Low-Income Community","2011-2015"]
["Georgia","Dougherty","13095010302","Low-Income Community","2011-2015"]
["Georgia","Dougherty","13095010601","Low-Income Community","2011-2015"]
["Georgia","Dougherty","13095010700","Low-Income Community","2011-2015"]
["Georgia","Dougherty","13095011400","Low-Income Community","2011-2015"]
["Georgia","Douglas","13097080201","Low-Income Community","2011-2015"]
["Georgia","Douglas","13097080202","Low-Income Community","2011-2015"]
["Georgia","Early","13099090400","Low-Income Community","2011-2015"]
["Georgia","Early","13099090500","Low-Income Community","2011-2015"]
["Georgia","Echols","13101880100","Low-Income Community","2011-2015"]
["Georgia","Elbert","13105000400","Low-Income Community","2011-2015"]
["Georgia","Emanuel","13107970100","Low-Income Community","2011-2015"]
["Georgia","Emanuel","13107970300","Low-Income Community","2011-2015"]
["Georgia","Emanuel","13107970400","Low-Income Community","2011-2015"]
["Georgia","Emanuel","13107970600","Low-Income Community","2011-2015"]
["Georgia","Evans","13109970300","Low-Income Community","2011-2015"]
["Georgia","Floyd","13115001100","Low-Income Community","2011-2015"]
["Georgia","Floyd","13115001600","Low-Income Community","2011-2015"]
["Georgia","Fulton","13121002500","Low-Income Community","2011-2015"]
["Georgia","Fulton","13121002600","Low-Income Community","2011-2015"]
["Georgia","Fulton","13121004200","Low-Income Community","2011-2015"]
["Georgia","Fulton","13121004300","Low-Income Community","2011-2015"]
["Georgia","Fulton","13121005502","Low-Income Community","2011-2015"]
["Georgia","Fulton","13121006300","Low-Income Community","2011-2015"]
["Georgia","Fulton","13121006400","Low-Income Community","2011-2015"]
["Georgia","Fulton","13121006601","Low-Income Community","2011-2015"]
["Georgia","Fulton","13121007200","Low-Income Community","2011-2015"]
["Georgia","Fulton","13121007400","Low-Income Community","2011-2015"]
["Georgia","Fulton","13121007500","Low-Income Community","2011-2015"]
["Georgia","Fulton","13121007602","Low-Income Community","2011-2015"]
["Georgia","Fulton","13121007603","Low-Income Community","2011-2015"]
["Georgia","Fulton","13121007704","Low-Income Community","2011-2015"]
["Georgia","Fulton","13121007705","Low-Income Community","2011-2015"]
["Georgia","Fulton","13121007807","Low-Income Community","2011-2015"]
["Georgia","Fulton","13121008000","Low-Income Community","2011-2015"]
["Georgia","Fulton","13121008102","Low-Income Community","2011-2015"]
["Georgia","Fulton","13121008201","Low-Income Community","2011-2015"]
["Georgia","Fulton","13121008400","Low-Income Community","2011-2015"]
["Georgia","Fulton","13121008500","Low-Income Community","2011-2015"]
["Georgia","Fulton","13121008601","Low-Income Community","2011-2015"]
["Georgia","Fulton","13121010603","Low-Income Community","2011-2015"]
["Georgia","Fulton","13121011000","Low-Income Community","2011-2015"]
["Georgia","Fulton","13121011800","Low-Income Community","2011-2015"]
["Georgia","Fulton","13121011900","Low-Income Community","2011-2015"]
["Georgia","Fulton","13121012000","Low-Income Community","2011-2015"]
["Georgia","Gilmer","13123080300","Low-Income Community","2011-2015"]
["Georgia","Glynn","13127000504","Low-Income Community","2011-2015"]
["Georgia","Glynn","13127000700","Low-Income Community","2011-2015"]
["Georgia","Glynn","13127000800","Low-Income Community","2011-2015"]
["Georgia","Grady","13131950300","Low-Income Community","2011-2015"]
["Georgia","Grady","13131950500","Low-Income Community","2011-2015"]
["Georgia","Greene","13133950200","Low-Income Community","2011-2015"]
["Georgia","Greene","13133950303","Low-Income Community","2011-2015"]
["Georgia","Gwinnett","13135050306","Low-Income Community","2011-2015"]
["Georgia","Gwinnett","13135050319","Low-Income Community","2011-2015"]
["Georgia","Gwinnett","13135050320","Low-Income Community","2011-2015"]
["Georgia","Hall","13139000800","Low-Income Community","2011-2015"]
["Georgia","Hall","13139001003","Low-Income Community","2011-2015"]
["Georgia","Hall","13139001101","Low-Income Community","2011-2015"]
["Georgia","Hancock","13141480400","Low-Income Community","2011-2015"]
["Georgia","Jefferson","13163960300","Low-Income Community","2011-2015"]
["Georgia","Jefferson","13163960400","Low-Income Community","2011-2015"]
["Georgia","Jenkins","13165960100","Low-Income Community","2011-2015"]
["Georgia","Laurens","13175950300","Low-Income Community","2011-2015"]
["Georgia","Laurens","13175950400","Low-Income Community","2011-2015"]
["Georgia","Laurens","13175950800","Low-Income Community","2011-2015"]
["Georgia","Laurens","13175950900","Low-Income Community","2011-2015"]
["Georgia","Lincoln","13181970100","Low-Income Community","2011-2015"]
["Georgia","Lowndes","13185010500","Low-Income Community","2011-2015"]
["Georgia","Lowndes","13185010800","Low-Income Community","2011-2015"]
["Georgia","Lowndes","13185010900","Low-Income Community","2011-2015"]
["Georgia","Lowndes","13185011000","Low-Income Community","2011-2015"]
["Georgia","Lowndes","13185011301","Low-Income Community","2011-2015"]
["Georgia","Lowndes","13185011302","Low-Income Community","2011-2015"]
["Georgia","McDuffie","13189950200","Low-Income Community","2011-2015"]
["Georgia","McDuffie","13189950400","Low-Income Community","2011-2015"]
["Georgia","Macon","13193000300","Low-Income Community","2011-2015"]
["Georgia","Macon","13193000400","Low-Income Community","2011-2015"]
["Georgia","Miller","13201950100","Low-Income Community","2011-2015"]
["Georgia","Miller","13201950200","Low-Income Community","2011-2015"]
["Georgia","Mitchell","13205090100","Low-Income Community","2011-2015"]
["Georgia","Mitchell","13205090200","Low-Income Community","2011-2015"]
["Georgia","Mitchell","13205090300","Low-Income Community","2011-2015"]
["Georgia","Muscogee","13215000300","Low-Income Community","2011-2015"]
["Georgia","Muscogee","13215001400","Low-Income Community","2011-2015"]
["Georgia","Muscogee","13215001600","Low-Income Community","2011-2015"]
["Georgia","Muscogee","13215001800","Low-Income Community","2011-2015"]
["Georgia","Muscogee","13215002200","Low-Income Community","2011-2015"]
["Georgia","Muscogee","13215002500","Low-Income Community","2011-2015"]
["Georgia","Muscogee","13215002700","Low-Income Community","2011-2015"]
["Georgia","Muscogee","13215002800","Low-Income Community","2011-2015"]
["Georgia","Muscogee","13215002902","Low-Income Community","2011-2015"]
["Georgia","Muscogee","13215003000","Low-Income Community","2011-2015"]
["Georgia","Muscogee","13215003200","Low-Income Community","2011-2015"]
["Georgia","Muscogee","13215003302","Low-Income Community","2011-2015"]
["Georgia","Muscogee","13215003400","Low-Income Community","2011-2015"]
["Georgia","Muscogee","13215011100","Low-Income Community","2011-2015"]
["Georgia","Muscogee","13215011200","Low-Income Community","2011-2015"]
["Georgia","Muscogee","13215011400","Low-Income Community","2011-2015"]
["Georgia","Newton","13217100700","Low-Income Community","2011-2015"]
["Georgia","Peach","13225040200","Low-Income Community","2011-2015"]
["Georgia","Peach","13225040302","Low-Income Community","2011-2015"]
["Georgia","Peach","13225040400","Low-Income Community","2011-2015"]
["Georgia","Pierce","13229960300","Low-Income Community","2011-2015"]
["Georgia","Polk","13233010400","Low-Income Community","2011-2015"]
["Georgia","Randolph","13243790200","Low-Income Community","2011-2015"]
["Georgia","Richmond","13245000200","Low-Income Community","2011-2015"]
["Georgia","Richmond","13245000300","Low-Income Community","2011-2015"]
["Georgia","Richmond","13245000600","Low-Income Community","2011-2015"]
["Georgia","Richmond","13245000700","Low-Income Community","2011-2015"]
["Georgia","Richmond","13245000900","Low-Income Community","2011-2015"]
["Georgia","Richmond","13245001000","Low-Income Community","2011-2015"]
["Georgia","Richmond","13245001400","Low-Income Community","2011-2015"]
["Georgia","Richmond","13245001500","Low-Income Community","2011-2015"]
["Georgia","Richmond","13245010400","Low-Income Community","2011-2015"]
["Georgia","Richmond","13245010504","Low-Income Community","2011-2015"]
["Georgia","Richmond","13245010600","Low-Income Community","2011-2015"]
["Georgia","Richmond","13245010710","Low-Income Community","2011-2015"]
["Georgia","Richmond","13245011000","Low-Income Community","2011-2015"]
["Georgia","Screven","13251970400","Low-Income Community","2011-2015"]
["Georgia","Spalding","13255160300","Low-Income Community","2011-2015"]
["Georgia","Spalding","13255160400","Low-Income Community","2011-2015"]
["Georgia","Spalding","13255160700","Low-Income Community","2011-2015"]
["Georgia","Spalding","13255160800","Low-Income Community","2011-2015"]
["Georgia","Spalding","13255160900","Low-Income Community","2011-2015"]
["Georgia","Stewart","13259950100","Low-Income Community","2011-2015"]
["Georgia","Stewart","13259950400","Low-Income Community","2011-2015"]
["Georgia","Sumter","13261950200","Low-Income Community","2011-2015"]
["Georgia","Sumter","13261950300","Low-Income Community","2011-2015"]
["Georgia","Sumter","13261950600","Low-Income Community","2011-2015"]
["Georgia","Sumter","13261950700","Low-Income Community","2011-2015"]
["Georgia","Taliaferro","13265010200","Low-Income Community","2011-2015"]
["Georgia","Tattnall","13267950201","Low-Income Community","2011-2015"]
["Georgia","Tattnall","13267950202","Low-Income Community","2011-2015"]
["Georgia","Taylor","13269950300","Low-Income Community","2011-2015"]
["Georgia","Telfair","13271950100","Low-Income Community","2011-2015"]
["Georgia","Terrell","13273120300","Low-Income Community","2011-2015"]
["Georgia","Terrell","13273120400","Low-Income Community","2011-2015"]
["Georgia","Thomas","13275960100","Low-Income Community","2011-2015"]
["Georgia","Thomas","13275960700","Low-Income Community","2011-2015"]
["Georgia","Tift","13277960600","Low-Income Community","2011-2015"]
["Georgia","Tift","13277960700","Low-Income Community","2011-2015"]
["Georgia","Tift","13277960800","Low-Income Community","2011-2015"]
["Georgia","Toombs","13279970100","Low-Income Community","2011-2015"]
["Georgia","Troup","13285960501","Low-Income Community","2011-2015"]
["Georgia","Troup","13285960600","Low-Income Community","2011-2015"]
["Georgia","Troup","13285960800","Low-Income Community","2011-2015"]
["Georgia","Troup","13285960901","Low-Income Community","2011-2015"]
["Georgia","Upson","13293010201","Low-Income Community","2011-2015"]
["Georgia","Upson","13293010500","Low-Income Community","2011-2015"]
["Georgia","Walker","13295020200","Low-Income Community","2011-2015"]
["Georgia","Walton","13297110400","Low-Income Community","2011-2015"]
["Georgia","Ware","13299950400","Low-Income Community","2011-2015"]
["Georgia","Ware","13299950500","Low-Income Community","2011-2015"]
["Georgia","Ware","13299950700","Low-Income Community","2011-2015"]
["Georgia","Ware","13299950800","Low-Income Community","2011-2015"]
["Georgia","Ware","13299950900","Low-Income Community","2011-2015"]
["Georgia","Warren","13301970400","Low-Income Community","2011-2015"]
["Georgia","Washington","13303950400","Low-Income Community","2011-2015"]
["Georgia","Washington","13303950700","Low-Income Community","2011-2015"]
["Georgia","Wayne","13305970500","Low-Income Community","2011-2015"]
["Guam","Guam","66010950300","Non-LIC Contiguous","2011-2015"]
["Guam","Guam","66010950401","Low-Income Community","2011-2015"]
["Guam","Guam","66010950402","Low-Income Community","2011-2015"]
["Guam","Guam","66010950501","Low-Income Community","2011-2015"]
["Guam","Guam","66010950502","Low-Income Community","2011-2015"]
["Guam","Guam","66010950900","Non-LIC Contiguous","2011-2015"]
["Guam","Guam","66010951000","Low-Income Community","2011-2015"]
["Guam","Guam","66010951600","Low-Income Community","2011-2015"]
["Guam","Guam","66010951800","Low-Income Community","2011-2015"]
["Guam","Guam","66010951901","Low-Income Community","2011-2015"]
["Guam","Guam","66010951902","Low-Income Community","2011-2015"]
["Guam","Guam","66010952400","Low-Income Community","2011-2015"]
["Guam","Guam","66010952800","Low-Income Community","2011-2015"]
["Guam","Guam","66010952900","Low-Income Community","2011-2015"]
["Guam","Guam","66010953000","Low-Income Community","2011-2015"]
["Guam","Guam","66010953300","Low-Income Community","2011-2015"]
["Guam","Guam","66010953400","Low-Income Community","2011-2015"]
["Guam","Guam","66010953900","Low-Income Community","2011-2015"]
["Guam","Guam","66010954400","Low-Income Community","2011-2015"]
["Guam","Guam","66010954800","Low-Income Community","2011-2015"]
["Guam","Guam","66010955300","Low-Income Community","2011-2015"]
["Guam","Guam","66010955400","Low-Income Community","2011-2015"]
["Guam","Guam","66010955600","Low-Income Community","2011-2015"]
["Guam","Guam","66010955700","Low-Income Community","2011-2015"]
["Guam","Guam","66010956000","Low-Income Community","2011-2015"]
["Hawaii","Hawaii","15001020300","Low-Income Community","2011-2015"]
["Hawaii","Hawaii","15001020400","Low-Income Community","2011-2015"]
["Hawaii","Hawaii","15001020500","Low-Income Community","2011-2015"]
["Hawaii","Hawaii","15001020600","Low-Income Community","2011-2015"]
["Hawaii","Hawaii","15001021504","Low-Income Community","2011-2015"]
["Hawaii","Hawaii","15001021601","Non-LIC Contiguous","2011-2015"]
["Hawaii","Honolulu","15003005200","Low-Income Community","2011-2015"]
["Hawaii","Honolulu","15003005300","Low-Income Community","2011-2015"]
["Hawaii","Honolulu","15003005500","Low-Income Community","2011-2015"]
["Hawaii","Honolulu","15003005700","Low-Income Community","2011-2015"]
["Hawaii","Honolulu","15003005800","Low-Income Community","2011-2015"]
["Hawaii","Honolulu","15003005900","Low-Income Community","2011-2015"]
["Hawaii","Honolulu","15003007504","Low-Income Community","2011-2015"]
["Hawaii","Honolulu","15003008001","Low-Income Community","2011-2015"]
["Hawaii","Honolulu","15003008003","Low-Income Community","2011-2015"]
["Hawaii","Honolulu","15003008502","Low-Income Community","2011-2015"]
["Hawaii","Honolulu","15003008702","Low-Income Community","2011-2015"]
["Hawaii","Honolulu","15003008703","Low-Income Community","2011-2015"]
["Hawaii","Honolulu","15003008914","Low-Income Community","2011-2015"]
["Hawaii","Kauai","15007040104","Low-Income Community","2011-2015"]
["Hawaii","Kauai","15007040604","Low-Income Community","2011-2015"]
["Hawaii","Maui","15009030404","Low-Income Community","2011-2015"]
["Hawaii","Maui","15009030901","Low-Income Community","2011-2015"]
["Hawaii","Maui","15009031700","Low-Income Community","2011-2015"]
["Hawaii","Maui","15009031900","Non-LIC Contiguous","2011-2015"]
["Idaho","Ada","16001002000","Low-Income Community","2011-2015"]
["Idaho","Ada","16001010321","Low-Income Community","2011-2015"]
["Idaho","Adams","16003950100","Non-LIC Contiguous","2011-2015"]
["Idaho","Bannock","16005001601","Low-Income Community","2011-2015"]
["Idaho","Benewah","16009950100","Low-Income Community","2011-2015"]
["Idaho","Bonner","16017950300","Low-Income Community","2011-2015"]
["Idaho","Boundary","16021970200","Low-Income Community","2011-2015"]
["Idaho","Canyon","16027020200","Low-Income Community","2011-2015"]
["Idaho","Canyon","16027022100","Low-Income Community","2011-2015"]
["Idaho","Canyon","16027022200","Low-Income Community","2011-2015"]
["Idaho","Clearwater","16035940000","Non-LIC Contiguous","2011-2015"]
["Idaho","Clearwater","16035970100","Low-Income Community","2011-2015"]
["Idaho","Elmore","16039960300","Low-Income Community","2011-2015"]
["Idaho","Gooding","16047960100","Low-Income Community","2011-2015"]
["Idaho","Idaho","16049940000","Low-Income Community","2011-2015"]
["Idaho","Idaho","16049960400","Low-Income Community","2011-2015"]
["Idaho","Jerome","16053970400","Low-Income Community","2011-2015"]
["Idaho","Kootenai","16055000602","Low-Income Community","2011-2015"]
["Idaho","Latah","16057005100","Low-Income Community","2011-2015"]
["Idaho","Latah","16057005400","Low-Income Community","2011-2015"]
["Idaho","Lewis","16061940001","Low-Income Community","2011-2015"]
["Idaho","Minidoka","16067970500","Low-Income Community","2011-2015"]
["Idaho","Nez Perce","16069960300","Low-Income Community","2011-2015"]
["Idaho","Payette","16075960200","Low-Income Community","2011-2015"]
["Idaho","Shoshone","16079960300","Low-Income Community","2011-2015"]
["Idaho","Twin Falls","16083000400","Low-Income Community","2011-2015"]
["Idaho","Twin Falls","16083001100","Low-Income Community","2011-2015"]
["Idaho","Valley","16085970300","Low-Income Community","2011-2015"]
["Illinois","Adams","17001000800","Low-Income Community","2011-2015"]
["Illinois","Alexander","17003957900","Low-Income Community","2011-2015"]
["Illinois","Bond","17005951300","Low-Income Community","2011-2015"]
["Illinois","Boone","17007010100","Low-Income Community","2011-2015"]
["Illinois","Bureau","17011965600","Low-Income Community","2011-2015"]
["Illinois","Carroll","17015960300","Low-Income Community","2011-2015"]
["Illinois","Cass","17017960500","Low-Income Community","2011-2015"]
["Illinois","Champaign","17019000301","Low-Income Community","2011-2015"]
["Illinois","Champaign","17019000401","Low-Income Community","2011-2015"]
["Illinois","Champaign","17019000402","Low-Income Community","2011-2015"]
["Illinois","Champaign","17019000901","Low-Income Community","2011-2015"]
["Illinois","Champaign","17019005300","Low-Income Community","2011-2015"]
["Illinois","Champaign","17019005900","Low-Income Community","2011-2015"]
["Illinois","Christian","17021958900","Low-Income Community","2011-2015"]
["Illinois","Clark","17023060200","Low-Income Community","2011-2015"]
["Illinois","Clay","17025972100","Low-Income Community","2011-2015"]
["Illinois","Clinton","17027900401","Low-Income Community","2011-2015"]
["Illinois","Coles","17029000500","Low-Income Community","2011-2015"]
["Illinois","Cook","17031230600","Low-Income Community","2011-2015"]
["Illinois","Cook","17031231200","Low-Income Community","2011-2015"]
["Illinois","Cook","17031231500","Low-Income Community","2011-2015"]
["Illinois","Cook","17031251300","Low-Income Community","2011-2015"]
["Illinois","Cook","17031251500","Low-Income Community","2011-2015"]
["Illinois","Cook","17031251800","Low-Income Community","2011-2015"]
["Illinois","Cook","17031251900","Low-Income Community","2011-2015"]
["Illinois","Cook","17031260200","Low-Income Community","2011-2015"]
["Illinois","Cook","17031260600","Low-Income Community","2011-2015"]
["Illinois","Cook","17031270500","Low-Income Community","2011-2015"]
["Illinois","Cook","17031271200","Low-Income Community","2011-2015"]
["Illinois","Cook","17031271300","Low-Income Community","2011-2015"]
["Illinois","Cook","17031271800","Low-Income Community","2011-2015"]
["Illinois","Cook","17031280400","Low-Income Community","2011-2015"]
["Illinois","Cook","17031280900","Low-Income Community","2011-2015"]
["Illinois","Cook","17031290900","Low-Income Community","2011-2015"]
["Illinois","Cook","17031291200","Low-Income Community","2011-2015"]
["Illinois","Cook","17031292200","Low-Income Community","2011-2015"]
["Illinois","Cook","17031292500","Low-Income Community","2011-2015"]
["Illinois","Cook","17031301200","Low-Income Community","2011-2015"]
["Illinois","Cook","17031340600","Low-Income Community","2011-2015"]
["Illinois","Cook","17031350100","Low-Income Community","2011-2015"]
["Illinois","Cook","17031351100","Low-Income Community","2011-2015"]
["Illinois","Cook","17031351400","Low-Income Community","2011-2015"]
["Illinois","Cook","17031351500","Low-Income Community","2011-2015"]
["Illinois","Cook","17031380100","Low-Income Community","2011-2015"]
["Illinois","Cook","17031380500","Low-Income Community","2011-2015"]
["Illinois","Cook","17031381400","Low-Income Community","2011-2015"]
["Illinois","Cook","17031390300","Low-Income Community","2011-2015"]
["Illinois","Cook","17031400300","Low-Income Community","2011-2015"]
["Illinois","Cook","17031400400","Low-Income Community","2011-2015"]
["Illinois","Cook","17031400500","Low-Income Community","2011-2015"]
["Illinois","Cook","17031400800","Low-Income Community","2011-2015"]
["Illinois","Cook","17031420500","Low-Income Community","2011-2015"]
["Illinois","Cook","17031420600","Low-Income Community","2011-2015"]
["Illinois","Cook","17031420700","Low-Income Community","2011-2015"]
["Illinois","Cook","17031420800","Low-Income Community","2011-2015"]
["Illinois","Cook","17031430101","Low-Income Community","2011-2015"]
["Illinois","Cook","17031430200","Low-Income Community","2011-2015"]
["Illinois","Cook","17031430300","Low-Income Community","2011-2015"]
["Illinois","Cook","17031430400","Low-Income Community","2011-2015"]
["Illinois","Cook","17031430600","Low-Income Community","2011-2015"]
["Illinois","Cook","17031430900","Low-Income Community","2011-2015"]
["Illinois","Cook","17031431301","Low-Income Community","2011-2015"]
["Illinois","Cook","17031431302","Low-Income Community","2011-2015"]
["Illinois","Cook","17031440201","Low-Income Community","2011-2015"]
["Illinois","Cook","17031460100","Low-Income Community","2011-2015"]
["Illinois","Cook","17031460200","Low-Income Community","2011-2015"]
["Illinois","Cook","17031460301","Low-Income Community","2011-2015"]
["Illinois","Cook","17031460302","Low-Income Community","2011-2015"]
["Illinois","Cook","17031460400","Low-Income Community","2011-2015"]
["Illinois","Cook","17031460500","Low-Income Community","2011-2015"]
["Illinois","Cook","17031470100","Low-Income Community","2011-2015"]
["Illinois","Cook","17031490901","Low-Income Community","2011-2015"]
["Illinois","Cook","17031491300","Low-Income Community","2011-2015"]
["Illinois","Cook","17031491400","Low-Income Community","2011-2015"]
["Illinois","Cook","17031500100","Low-Income Community","2011-2015"]
["Illinois","Cook","17031500200","Low-Income Community","2011-2015"]
["Illinois","Cook","17031500300","Low-Income Community","2011-2015"]
["Illinois","Cook","17031520200","Low-Income Community","2011-2015"]
["Illinois","Cook","17031530200","Low-Income Community","2011-2015"]
["Illinois","Cook","17031530502","Low-Income Community","2011-2015"]
["Illinois","Cook","17031540101","Low-Income Community","2011-2015"]
["Illinois","Cook","17031611000","Low-Income Community","2011-2015"]
["Illinois","Cook","17031611100","Low-Income Community","2011-2015"]
["Illinois","Cook","17031611200","Low-Income Community","2011-2015"]
["Illinois","Cook","17031611600","Low-Income Community","2011-2015"]
["Illinois","Cook","17031611700","Low-Income Community","2011-2015"]
["Illinois","Cook","17031611800","Low-Income Community","2011-2015"]
["Illinois","Cook","17031611900","Low-Income Community","2011-2015"]
["Illinois","Cook","17031660301","Low-Income Community","2011-2015"]
["Illinois","Cook","17031660600","Low-Income Community","2011-2015"]
["Illinois","Cook","17031660700","Low-Income Community","2011-2015"]
["Illinois","Cook","17031660800","Low-Income Community","2011-2015"]
["Illinois","Cook","17031660900","Low-Income Community","2011-2015"]
["Illinois","Cook","17031670100","Low-Income Community","2011-2015"]
["Illinois","Cook","17031670200","Low-Income Community","2011-2015"]
["Illinois","Cook","17031670400","Low-Income Community","2011-2015"]
["Illinois","Cook","17031670500","Low-Income Community","2011-2015"]
["Illinois","Cook","17031670600","Low-Income Community","2011-2015"]
["Illinois","Cook","17031670700","Low-Income Community","2011-2015"]
["Illinois","Cook","17031670800","Low-Income Community","2011-2015"]
["Illinois","Cook","17031671100","Low-Income Community","2011-2015"]
["Illinois","Cook","17031671200","Low-Income Community","2011-2015"]
["Illinois","Cook","17031671400","Low-Income Community","2011-2015"]
["Illinois","Cook","17031671500","Low-Income Community","2011-2015"]
["Illinois","Cook","17031671600","Low-Income Community","2011-2015"]
["Illinois","Cook","17031671800","Low-Income Community","2011-2015"]
["Illinois","Cook","17031680500","Low-Income Community","2011-2015"]
["Illinois","Cook","17031680600","Low-Income Community","2011-2015"]
["Illinois","Cook","17031680900","Low-Income Community","2011-2015"]
["Illinois","Cook","17031681000","Low-Income Community","2011-2015"]
["Illinois","Cook","17031681200","Low-Income Community","2011-2015"]
["Illinois","Cook","17031681300","Low-Income Community","2011-2015"]
["Illinois","Cook","17031690300","Low-Income Community","2011-2015"]
["Illinois","Cook","17031691000","Low-Income Community","2011-2015"]
["Illinois","Cook","17031691100","Low-Income Community","2011-2015"]
["Illinois","Cook","17031691300","Low-Income Community","2011-2015"]
["Illinois","Cook","17031691400","Low-Income Community","2011-2015"]
["Illinois","Cook","17031691500","Low-Income Community","2011-2015"]
["Illinois","Cook","17031710100","Low-Income Community","2011-2015"]
["Illinois","Cook","17031710200","Low-Income Community","2011-2015"]
["Illinois","Cook","17031710300","Low-Income Community","2011-2015"]
["Illinois","Cook","17031710500","Low-Income Community","2011-2015"]
["Illinois","Cook","17031711000","Low-Income Community","2011-2015"]
["Illinois","Cook","17031711400","Low-Income Community","2011-2015"]
["Illinois","Cook","17031750600","Low-Income Community","2011-2015"]
["Illinois","Cook","17031803606","Low-Income Community","2011-2015"]
["Illinois","Cook","17031811600","Low-Income Community","2011-2015"]
["Illinois","Cook","17031813400","Low-Income Community","2011-2015"]
["Illinois","Cook","17031813900","Low-Income Community","2011-2015"]
["Illinois","Cook","17031814200","Low-Income Community","2011-2015"]
["Illinois","Cook","17031814400","Low-Income Community","2011-2015"]
["Illinois","Cook","17031814900","Low-Income Community","2011-2015"]
["Illinois","Cook","17031817200","Low-Income Community","2011-2015"]
["Illinois","Cook","17031817300","Low-Income Community","2011-2015"]
["Illinois","Cook","17031817500","Low-Income Community","2011-2015"]
["Illinois","Cook","17031817700","Low-Income Community","2011-2015"]
["Illinois","Cook","17031820400","Low-Income Community","2011-2015"]
["Illinois","Cook","17031820605","Low-Income Community","2011-2015"]
["Illinois","Cook","17031821200","Low-Income Community","2011-2015"]
["Illinois","Cook","17031821401","Low-Income Community","2011-2015"]
["Illinois","Cook","17031821500","Low-Income Community","2011-2015"]
["Illinois","Cook","17031822400","Low-Income Community","2011-2015"]
["Illinois","Cook","17031823703","Low-Income Community","2011-2015"]
["Illinois","Cook","17031823705","Low-Income Community","2011-2015"]
["Illinois","Cook","17031824800","Low-Income Community","2011-2015"]
["Illinois","Cook","17031825501","Low-Income Community","2011-2015"]
["Illinois","Cook","17031825600","Low-Income Community","2011-2015"]
["Illinois","Cook","17031825801","Low-Income Community","2011-2015"]
["Illinois","Cook","17031825900","Low-Income Community","2011-2015"]
["Illinois","Cook","17031826000","Low-Income Community","2011-2015"]
["Illinois","Cook","17031826100","Low-Income Community","2011-2015"]
["Illinois","Cook","17031826202","Low-Income Community","2011-2015"]
["Illinois","Cook","17031826303","Low-Income Community","2011-2015"]
["Illinois","Cook","17031826402","Low-Income Community","2011-2015"]
["Illinois","Cook","17031826500","Low-Income Community","2011-2015"]
["Illinois","Cook","17031826600","Low-Income Community","2011-2015"]
["Illinois","Cook","17031826700","Low-Income Community","2011-2015"]
["Illinois","Cook","17031826800","Low-Income Community","2011-2015"]
["Illinois","Cook","17031826901","Low-Income Community","2011-2015"]
["Illinois","Cook","17031827000","Low-Income Community","2011-2015"]
["Illinois","Cook","17031827100","Low-Income Community","2011-2015"]
["Illinois","Cook","17031827400","Low-Income Community","2011-2015"]
["Illinois","Cook","17031827500","Low-Income Community","2011-2015"]
["Illinois","Cook","17031827600","Low-Income Community","2011-2015"]
["Illinois","Cook","17031828504","Low-Income Community","2011-2015"]
["Illinois","Cook","17031829000","Low-Income Community","2011-2015"]
["Illinois","Cook","17031829302","Low-Income Community","2011-2015"]
["Illinois","Cook","17031829401","Low-Income Community","2011-2015"]
["Illinois","Cook","17031829700","Low-Income Community","2011-2015"]
["Illinois","Cook","17031830007","Low-Income Community","2011-2015"]
["Illinois","Cook","17031830300","Low-Income Community","2011-2015"]
["Illinois","Cook","17031834000","Low-Income Community","2011-2015"]
["Illinois","Cook","17031834200","Low-Income Community","2011-2015"]
["Illinois","Cook","17031834300","Low-Income Community","2011-2015"]
["Illinois","Cook","17031834400","Low-Income Community","2011-2015"]
["Illinois","Cook","17031834500","Low-Income Community","2011-2015"]
["Illinois","Cook","17031834600","Low-Income Community","2011-2015"]
["Illinois","Cook","17031834700","Low-Income Community","2011-2015"]
["Illinois","Cook","17031834800","Low-Income Community","2011-2015"]
["Illinois","Cook","17031834900","Low-Income Community","2011-2015"]
["Illinois","Cook","17031835000","Low-Income Community","2011-2015"]
["Illinois","Cook","17031835500","Low-Income Community","2011-2015"]
["Illinois","Cook","17031835900","Low-Income Community","2011-2015"]
["Illinois","Cook","17031836000","Low-Income Community","2011-2015"]
["Illinois","Cook","17031836100","Low-Income Community","2011-2015"]
["Illinois","Cook","17031836900","Low-Income Community","2011-2015"]
["Illinois","Cook","17031837000","Low-Income Community","2011-2015"]
["Illinois","Cook","17031838600","Low-Income Community","2011-2015"]
["Illinois","Cook","17031838700","Low-Income Community","2011-2015"]
["Illinois","Cook","17031838800","Low-Income Community","2011-2015"]
["Illinois","Cook","17031841000","Low-Income Community","2012-2016"]
["Illinois","Cook","17031841400","Low-Income Community","2011-2015"]
["Illinois","Cook","17031841500","Low-Income Community","2011-2015"]
["Illinois","Cook","17031841800","Low-Income Community","2011-2015"]
["Illinois","Cook","17031842100","Low-Income Community","2011-2015"]
["Illinois","Cook","17031842900","Low-Income Community","2011-2015"]
["Illinois","Cook","17031843000","Low-Income Community","2011-2015"]
["Illinois","Cook","17031843300","Low-Income Community","2011-2015"]
["Illinois","Cook","17031843600","Low-Income Community","2011-2015"]
["Illinois","Crawford","17033880400","Low-Income Community","2011-2015"]
["Illinois","Cumberland","17035972400","Low-Income Community","2011-2015"]
["Illinois","DeKalb","17037001001","Low-Income Community","2011-2015"]
["Illinois","DeKalb","17037001002","Low-Income Community","2011-2015"]
["Illinois","DeKalb","17037002200","Low-Income Community","2011-2015"]
["Illinois","De Witt","17039971800","Low-Income Community","2011-2015"]
["Illinois","Douglas","17041952000","Low-Income Community","2011-2015"]
["Illinois","DuPage","17043840104","Low-Income Community","2011-2015"]
["Illinois","Edgar","17045070300","Low-Income Community","2011-2015"]
["Illinois","Edwards","17047957100","Low-Income Community","2011-2015"]
["Illinois","Effingham","17049950800","Low-Income Community","2011-2015"]
["Illinois","Fayette","17051950900","Low-Income Community","2011-2015"]
["Illinois","Franklin","17055040600","Low-Income Community","2011-2015"]
["Illinois","Fulton","17057953500","Low-Income Community","2011-2015"]
["Illinois","Gallatin","17059972800","Low-Income Community","2011-2015"]
["Illinois","Greene","17061973900","Low-Income Community","2011-2015"]
["Illinois","Hamilton","17065973200","Low-Income Community","2011-2015"]
["Illinois","Hancock","17067954100","Low-Income Community","2011-2015"]
["Illinois","Hardin","17069970900","Low-Income Community","2011-2015"]
["Illinois","Henderson","17071973500","Low-Income Community","2011-2015"]
["Illinois","Henry","17073030800","Low-Income Community","2011-2015"]
["Illinois","Iroquois","17075950400","Low-Income Community","2011-2015"]
["Illinois","Jackson","17077011200","Low-Income Community","2011-2015"]
["Illinois","Jackson","17077011400","Low-Income Community","2011-2015"]
["Illinois","Jackson","17077011700","Low-Income Community","2011-2015"]
["Illinois","Jasper","17079977400","Low-Income Community","2011-2015"]
["Illinois","Jefferson","17081051000","Low-Income Community","2011-2015"]
["Illinois","Jersey","17083010402","Low-Income Community","2011-2015"]
["Illinois","Jo Daviess","17085020500","Low-Income Community","2011-2015"]
["Illinois","Johnson","17087977800","Low-Income Community","2011-2015"]
["Illinois","Kane","17089850202","Low-Income Community","2011-2015"]
["Illinois","Kane","17089850301","Low-Income Community","2011-2015"]
["Illinois","Kane","17089851400","Low-Income Community","2011-2015"]
["Illinois","Kane","17089851600","Low-Income Community","2011-2015"]
["Illinois","Kane","17089851904","Low-Income Community","2011-2015"]
["Illinois","Kane","17089853200","Low-Income Community","2011-2015"]
["Illinois","Kane","17089853400","Low-Income Community","2011-2015"]
["Illinois","Kane","17089853600","Low-Income Community","2011-2015"]
["Illinois","Kane","17089854301","Low-Income Community","2011-2015"]
["Illinois","Kane","17089854400","Low-Income Community","2011-2015"]
["Illinois","Kankakee","17091011500","Low-Income Community","2011-2015"]
["Illinois","Kankakee","17091011600","Low-Income Community","2011-2015"]
["Illinois","Kankakee","17091011700","Low-Income Community","2011-2015"]
["Illinois","Kankakee","17091012300","Low-Income Community","2011-2015"]
["Illinois","Knox","17095001100","Low-Income Community","2011-2015"]
["Illinois","Lake","17097860302","Low-Income Community","2011-2015"]
["Illinois","Lake","17097862300","Low-Income Community","2011-2015"]
["Illinois","Lake","17097862605","Low-Income Community","2011-2015"]
["Illinois","Lake","17097862700","Low-Income Community","2011-2015"]
["Illinois","Lake","17097862901","Low-Income Community","2011-2015"]
["Illinois","LaSalle","17099964300","Low-Income Community","2011-2015"]
["Illinois","Lawrence","17101880800","Low-Income Community","2011-2015"]
["Illinois","Lee","17103000600","Low-Income Community","2011-2015"]
["Illinois","Livingston","17105960500","Low-Income Community","2011-2015"]
["Illinois","Logan","17107953100","Low-Income Community","2011-2015"]
["Illinois","McDonough","17109010500","Low-Income Community","2011-2015"]
["Illinois","McHenry","17111870301","Low-Income Community","2011-2015"]
["Illinois","McLean","17113000200","Low-Income Community","2011-2015"]
["Illinois","Macon","17115000200","Low-Income Community","2011-2015"]
["Illinois","Macon","17115000300","Low-Income Community","2011-2015"]
["Illinois","Macon","17115000500","Low-Income Community","2011-2015"]
["Illinois","Macon","17115000900","Low-Income Community","2011-2015"]
["Illinois","Macon","17115003100","Low-Income Community","2011-2015"]
["Illinois","Macoupin","17117956900","Low-Income Community","2011-2015"]
["Illinois","Madison","17119400200","Low-Income Community","2011-2015"]
["Illinois","Madison","17119400600","Low-Income Community","2011-2015"]
["Illinois","Madison","17119400700","Low-Income Community","2011-2015"]
["Illinois","Madison","17119402200","Low-Income Community","2011-2015"]
["Illinois","Madison","17119404000","Low-Income Community","2011-2015"]
["Illinois","Marion","17121952700","Low-Income Community","2011-2015"]
["Illinois","Marshall","17123961500","Low-Income Community","2011-2015"]
["Illinois","Mason","17125956500","Low-Income Community","2011-2015"]
["Illinois","Massac","17127970200","Low-Income Community","2011-2015"]
["Illinois","Montgomery","17135958000","Low-Income Community","2011-2015"]
["Illinois","Morgan","17137952000","Low-Income Community","2011-2015"]
["Illinois","Moultrie","17139977200","Low-Income Community","2011-2015"]
["Illinois","Ogle","17141961100","Low-Income Community","2011-2015"]
["Illinois","Peoria","17143000300","Low-Income Community","2011-2015"]
["Illinois","Peoria","17143000900","Low-Income Community","2011-2015"]
["Illinois","Peoria","17143001200","Low-Income Community","2011-2015"]
["Illinois","Peoria","17143002100","Low-Income Community","2011-2015"]
["Illinois","Peoria","17143005000","Low-Income Community","2011-2015"]
["Illinois","Perry","17145030400","Low-Income Community","2011-2015"]
["Illinois","Pike","17149952700","Low-Income Community","2011-2015"]
["Illinois","Pope","17151971300","Low-Income Community","2011-2015"]
["Illinois","Pulaski","17153971100","Low-Income Community","2011-2015"]
["Illinois","Randolph","17157950600","Low-Income Community","2011-2015"]
["Illinois","Richland","17159978000","Low-Income Community","2011-2015"]
["Illinois","Rock Island","17161023500","Low-Income Community","2011-2015"]
["Illinois","Rock Island","17161023600","Low-Income Community","2011-2015"]
["Illinois","St. Clair","17163500500","Low-Income Community","2011-2015"]
["Illinois","St. Clair","17163500900","Low-Income Community","2011-2015"]
["Illinois","St. Clair","17163501300","Low-Income Community","2011-2015"]
["Illinois","St. Clair","17163501603","Low-Income Community","2011-2015"]
["Illinois","St. Clair","17163502700","Low-Income Community","2011-2015"]
["Illinois","St. Clair","17163504500","Low-Income Community","2011-2015"]
["Illinois","St. Clair","17163504600","Low-Income Community","2011-2015"]
["Illinois","Saline","17165955900","Low-Income Community","2011-2015"]
["Illinois","Sangamon","17167000800","Low-Income Community","2011-2015"]
["Illinois","Sangamon","17167000900","Low-Income Community","2011-2015"]
["Illinois","Sangamon","17167001600","Low-Income Community","2011-2015"]
["Illinois","Sangamon","17167001700","Low-Income Community","2011-2015"]
["Illinois","Sangamon","17167002400","Low-Income Community","2011-2015"]
["Illinois","Schuyler","17169970100","Low-Income Community","2011-2015"]
["Illinois","Shelby","17173959300","Low-Income Community","2011-2015"]
["Illinois","Stephenson","17177000800","Low-Income Community","2011-2015"]
["Illinois","Stephenson","17177001300","Low-Income Community","2011-2015"]
["Illinois","Tazewell","17179021101","Low-Income Community","2011-2015"]
["Illinois","Union","17181950400","Low-Income Community","2011-2015"]
["Illinois","Vermilion","17183000200","Low-Income Community","2011-2015"]
["Illinois","Vermilion","17183000400","Low-Income Community","2011-2015"]
["Illinois","Vermilion","17183011200","Low-Income Community","2011-2015"]
["Illinois","Warren","17187870500","Low-Income Community","2011-2015"]
["Illinois","Washington","17189950300","Low-Income Community","2011-2015"]
["Illinois","Wayne","17191955000","Low-Income Community","2011-2015"]
["Illinois","White","17193958000","Low-Income Community","2011-2015"]
["Illinois","Whiteside","17195001500","Low-Income Community","2011-2015"]
["Illinois","Will","17197881200","Low-Income Community","2011-2015"]
["Illinois","Will","17197881900","Low-Income Community","2011-2015"]
["Illinois","Will","17197882000","Low-Income Community","2011-2015"]
["Illinois","Will","17197882400","Low-Income Community","2011-2015"]
["Illinois","Will","17197882500","Low-Income Community","2011-2015"]
["Illinois","Williamson","17199020400","Low-Income Community","2011-2015"]
["Illinois","Winnebago","17201001000","Low-Income Community","2011-2015"]
["Illinois","Winnebago","17201002100","Low-Income Community","2011-2015"]
["Illinois","Winnebago","17201002500","Low-Income Community","2011-2015"]
["Illinois","Winnebago","17201002600","Low-Income Community","2011-2015"]
["Illinois","Winnebago","17201003200","Low-Income Community","2011-2015"]
["Indiana","Adams","18001030700","Low-Income Community","2011-2015"]
["Indiana","Allen","18003000500","Low-Income Community","2011-2015"]
["Indiana","Allen","18003000600","Low-Income Community","2011-2015"]
["Indiana","Allen","18003000701","Low-Income Community","2011-2015"]
["Indiana","Allen","18003001100","Low-Income Community","2011-2015"]
["Indiana","Allen","18003001200","Low-Income Community","2011-2015"]
["Indiana","Allen","18003001300","Low-Income Community","2011-2015"]
["Indiana","Allen","18003002000","Low-Income Community","2011-2015"]
["Indiana","Allen","18003002100","Low-Income Community","2011-2015"]
["Indiana","Allen","18003004000","Low-Income Community","2011-2015"]
["Indiana","Allen","18003980001","Low-Income Community","2011-2015"]
["Indiana","Bartholomew","18005010800","Low-Income Community","2011-2015"]
["Indiana","Blackford","18009975100","Low-Income Community","2011-2015"]
["Indiana","Boone","18011810400","Low-Income Community","2011-2015"]
["Indiana","Carroll","18015959600","Low-Income Community","2011-2015"]
["Indiana","Clark","18019050100","Low-Income Community","2011-2015"]
["Indiana","Clark","18019050401","Low-Income Community","2011-2015"]
["Indiana","Clark","18019050903","Low-Income Community","2011-2015"]
["Indiana","Crawford","18025952100","Low-Income Community","2011-2015"]
["Indiana","Daviess","18027954700","Low-Income Community","2011-2015"]
["Indiana","DeKalb","18033020500","Low-Income Community","2011-2015"]
["Indiana","DeKalb","18033020602","Non-LIC Contiguous","2011-2015"]
["Indiana","Delaware","18035000600","Low-Income Community","2011-2015"]
["Indiana","Delaware","18035000700","Low-Income Community","2011-2015"]
["Indiana","Delaware","18035001300","Low-Income Community","2011-2015"]
["Indiana","Delaware","18035002800","Low-Income Community","2011-2015"]
["Indiana","Dubois","18037953800","Low-Income Community","2011-2015"]
["Indiana","Elkhart","18039000100","Low-Income Community","2011-2015"]
["Indiana","Elkhart","18039000302","Low-Income Community","2011-2015"]
["Indiana","Elkhart","18039001601","Low-Income Community","2011-2015"]
["Indiana","Elkhart","18039002300","Low-Income Community","2011-2015"]
["Indiana","Elkhart","18039002900","Non-LIC Contiguous","2011-2015"]
["Indiana","Fayette","18041954100","Low-Income Community","2011-2015"]
["Indiana","Floyd","18043070400","Low-Income Community","2011-2015"]
["Indiana","Floyd","18043070500","Low-Income Community","2011-2015"]
["Indiana","Franklin","18047969700","Low-Income Community","2011-2015"]
["Indiana","Gibson","18051050502","Low-Income Community","2011-2015"]
["Indiana","Grant","18053000100","Low-Income Community","2011-2015"]
["Indiana","Hendricks","18063210607","Low-Income Community","2011-2015"]
["Indiana","Henry","18065976100","Low-Income Community","2011-2015"]
["Indiana","Howard","18067000200","Low-Income Community","2011-2015"]
["Indiana","Huntington","18069961600","Low-Income Community","2011-2015"]
["Indiana","Jackson","18071967901","Low-Income Community","2011-2015"]
["Indiana","Jennings","18079960302","Low-Income Community","2011-2015"]
["Indiana","Johnson","18081610802","Low-Income Community","2011-2015"]
["Indiana","Knox","18083955300","Low-Income Community","2011-2015"]
["Indiana","Knox","18083955400","Low-Income Community","2011-2015"]
["Indiana","Lake","18089010201","Low-Income Community","2011-2015"]
["Indiana","Lake","18089010203","Low-Income Community","2011-2015"]
["Indiana","Lake","18089010205","Low-Income Community","2011-2015"]
["Indiana","Lake","18089010304","Low-Income Community","2011-2015"]
["Indiana","Lake","18089010500","Low-Income Community","2011-2015"]
["Indiana","Lake","18089011000","Low-Income Community","2011-2015"]
["Indiana","Lake","18089011500","Low-Income Community","2011-2015"]
["Indiana","Lake","18089012300","Low-Income Community","2011-2015"]
["Indiana","Lake","18089020200","Low-Income Community","2011-2015"]
["Indiana","Lake","18089020400","Low-Income Community","2011-2015"]
["Indiana","Lake","18089020600","Low-Income Community","2011-2015"]
["Indiana","Lake","18089030300","Low-Income Community","2011-2015"]
["Indiana","Lake","18089030400","Low-Income Community","2011-2015"]
["Indiana","Lake","18089030600","Low-Income Community","2011-2015"]
["Indiana","Lake","18089030700","Low-Income Community","2011-2015"]
["Indiana","LaPorte","18091040300","Low-Income Community","2011-2015"]
["Indiana","LaPorte","18091040800","Low-Income Community","2011-2015"]
["Indiana","LaPorte","18091042100","Low-Income Community","2011-2015"]
["Indiana","LaPorte","18091043000","Low-Income Community","2011-2015"]
["Indiana","Lawrence","18093950900","Low-Income Community","2011-2015"]
["Indiana","Madison","18095000500","Low-Income Community","2011-2015"]
["Indiana","Madison","18095001000","Low-Income Community","2011-2015"]
["Indiana","Madison","18095001700","Low-Income Community","2011-2015"]
["Indiana","Madison","18095011900","Low-Income Community","2011-2015"]
["Indiana","Marion","18097310306","Low-Income Community","2011-2015"]
["Indiana","Marion","18097322000","Low-Income Community","2011-2015"]
["Indiana","Marion","18097322600","Low-Income Community","2011-2015"]
["Indiana","Marion","18097330805","Low-Income Community","2011-2015"]
["Indiana","Marion","18097340102","Low-Income Community","2011-2015"]
["Indiana","Marion","18097340108","Low-Income Community","2011-2015"]
["Indiana","Marion","18097340400","Low-Income Community","2011-2015"]
["Indiana","Marion","18097341600","Low-Income Community","2011-2015"]
["Indiana","Marion","18097342101","Low-Income Community","2011-2015"]
["Indiana","Marion","18097342400","Low-Income Community","2011-2015"]
["Indiana","Marion","18097351200","Low-Income Community","2011-2015"]
["Indiana","Marion","18097351700","Low-Income Community","2011-2015"]
["Indiana","Marion","18097352600","Low-Income Community","2011-2015"]
["Indiana","Marion","18097352700","Low-Income Community","2011-2015"]
["Indiana","Marion","18097352800","Low-Income Community","2011-2015"]
["Indiana","Marion","18097353300","Low-Income Community","2011-2015"]
["Indiana","Marion","18097353500","Low-Income Community","2011-2015"]
["Indiana","Marion","18097353600","Low-Income Community","2011-2015"]
["Indiana","Marion","18097354200","Low-Income Community","2011-2015"]
["Indiana","Marion","18097354400","Low-Income Community","2011-2015"]
["Indiana","Marion","18097354500","Low-Income Community","2011-2015"]
["Indiana","Marion","18097354900","Low-Income Community","2011-2015"]
["Indiana","Marion","18097355000","Low-Income Community","2011-2015"]
["Indiana","Marion","18097355600","Low-Income Community","2011-2015"]
["Indiana","Marion","18097355700","Low-Income Community","2011-2015"]
["Indiana","Marion","18097356200","Non-LIC Contiguous","2011-2015"]
["Indiana","Marion","18097356400","Low-Income Community","2011-2015"]
["Indiana","Marion","18097361200","Low-Income Community","2011-2015"]
["Indiana","Marion","18097361300","Low-Income Community","2011-2015"]
["Indiana","Marion","18097380200","Low-Income Community","2011-2015"]
["Indiana","Marion","18097380300","Low-Income Community","2011-2015"]
["Indiana","Marion","18097390600","Low-Income Community","2011-2015"]
["Indiana","Marion","18097390700","Low-Income Community","2011-2015"]
["Indiana","Marion","18097390800","Low-Income Community","2011-2015"]
["Indiana","Marion","18097390900","Low-Income Community","2011-2015"]
["Indiana","Marion","18097391000","Low-Income Community","2011-2015"]
["Indiana","Marshall","18099020500","Low-Income Community","2011-2015"]
["Indiana","Miami","18103952200","Low-Income Community","2011-2015"]
["Indiana","Miami","18103952900","Low-Income Community","2011-2015"]
["Indiana","Monroe","18105000100","Low-Income Community","2011-2015"]
["Indiana","Monroe","18105000401","Low-Income Community","2011-2015"]
["Indiana","Monroe","18105000501","Low-Income Community","2011-2015"]
["Indiana","Monroe","18105001101","Low-Income Community","2011-2015"]
["Indiana","Montgomery","18107957000","Low-Income Community","2011-2015"]
["Indiana","Morgan","18109510701","Low-Income Community","2011-2015"]
["Indiana","Newton","18111100700","Low-Income Community","2011-2015"]
["Indiana","Orange","18117951500","Low-Income Community","2011-2015"]
["Indiana","Perry","18123952600","Low-Income Community","2011-2015"]
["Indiana","Pike","18125954000","Low-Income Community","2011-2015"]
["Indiana","Porter","18127050900","Low-Income Community","2011-2015"]
["Indiana","Putnam","18133956500","Low-Income Community","2011-2015"]
["Indiana","Randolph","18135951600","Low-Income Community","2011-2015"]
["Indiana","Rush","18139974400","Low-Income Community","2011-2015"]
["Indiana","St. Joseph","18141000900","Low-Income Community","2011-2015"]
["Indiana","St. Joseph","18141001000","Low-Income Community","2011-2015"]
["Indiana","St. Joseph","18141001700","Low-Income Community","2011-2015"]
["Indiana","St. Joseph","18141002700","Low-Income Community","2011-2015"]
["Indiana","St. Joseph","18141002900","Low-Income Community","2011-2015"]
["Indiana","St. Joseph","18141010200","Low-Income Community","2011-2015"]
["Indiana","St. Joseph","18141011100","Low-Income Community","2011-2015"]
["Indiana","Scott","18143967000","Low-Income Community","2011-2015"]
["Indiana","Shelby","18145710400","Low-Income Community","2011-2015"]
["Indiana","Shelby","18145710601","Low-Income Community","2011-2015"]
["Indiana","Starke","18149953700","Low-Income Community","2011-2015"]
["Indiana","Steuben","18151971300","Low-Income Community","2011-2015"]
["Indiana","Switzerland","18155965700","Low-Income Community","2011-2015"]
["Indiana","Tippecanoe","18157000400","Low-Income Community","2011-2015"]
["Indiana","Tippecanoe","18157000700","Low-Income Community","2011-2015"]
["Indiana","Tippecanoe","18157010203","Low-Income Community","2011-2015"]
["Indiana","Tippecanoe","18157010500","Low-Income Community","2011-2015"]
["Indiana","Tippecanoe","18157011100","Low-Income Community","2011-2015"]
["Indiana","Vanderburgh","18163001200","Low-Income Community","2011-2015"]
["Indiana","Vanderburgh","18163001500","Low-Income Community","2011-2015"]
["Indiana","Vanderburgh","18163001800","Low-Income Community","2011-2015"]
["Indiana","Vanderburgh","18163001900","Low-Income Community","2011-2015"]
["Indiana","Vanderburgh","18163002000","Low-Income Community","2011-2015"]
["Indiana","Vermillion","18165020500","Low-Income Community","2011-2015"]
["Indiana","Vigo","18167000300","Low-Income Community","2011-2015"]
["Indiana","Vigo","18167010600","Low-Income Community","2011-2015"]
["Indiana","Vigo","18167011100","Low-Income Community","2011-2015"]
["Indiana","Wabash","18169102600","Low-Income Community","2011-2015"]
["Indiana","Washington","18175967500","Low-Income Community","2011-2015"]
["Indiana","Wayne","18177000200","Low-Income Community","2011-2015"]
["Indiana","Wayne","18177000900","Low-Income Community","2011-2015"]
["Indiana","Wells","18179040600","Low-Income Community","2011-2015"]
["Iowa","Appanoose","19007950100","Low-Income Community","2011-2015"]
["Iowa","Appanoose","19007950300","Low-Income Community","2011-2015"]
["Iowa","Benton","19011960300","Low-Income Community","2011-2015"]
["Iowa","Black Hawk","19013000100","Low-Income Community","2011-2015"]
["Iowa","Black Hawk","19013000700","Low-Income Community","2011-2015"]
["Iowa","Black Hawk","19013001000","Low-Income Community","2011-2015"]
["Iowa","Buena Vista","19021960400","Low-Income Community","2011-2015"]
["Iowa","Calhoun","19025950200","Low-Income Community","2011-2015"]
["Iowa","Cass","19029190200","Low-Income Community","2011-2015"]
["Iowa","Cass","19029190500","Low-Income Community","2011-2015"]
["Iowa","Cerro Gordo","19033950300","Low-Income Community","2011-2015"]
["Iowa","Cherokee","19035080100","Low-Income Community","2011-2015"]
["Iowa","Clinton","19045000100","Low-Income Community","2011-2015"]
["Iowa","Clinton","19045000300","Low-Income Community","2011-2015"]
["Iowa","Crawford","19047070400","Low-Income Community","2011-2015"]
["Iowa","Dallas","19049050400","Low-Income Community","2011-2015"]
["Iowa","Davis","19051080200","Low-Income Community","2011-2015"]
["Iowa","Decatur","19053960200","Low-Income Community","2011-2015"]
["Iowa","Decatur","19053960300","Low-Income Community","2011-2015"]
["Iowa","Des Moines","19057000200","Low-Income Community","2011-2015"]
["Iowa","Des Moines","19057000300","Low-Income Community","2011-2015"]
["Iowa","Des Moines","19057000400","Low-Income Community","2011-2015"]
["Iowa","Dubuque","19061000100","Low-Income Community","2011-2015"]
["Iowa","Dubuque","19061000500","Low-Income Community","2011-2015"]
["Iowa","Emmet","19063070300","Low-Income Community","2011-2015"]
["Iowa","Floyd","19067480400","Low-Income Community","2011-2015"]
["Iowa","Hamilton","19079960300","Low-Income Community","2011-2015"]
["Iowa","Ida","19093090300","Low-Income Community","2011-2015"]
["Iowa","Jackson","19097950600","Low-Income Community","2011-2015"]
["Iowa","Johnson","19103000200","Low-Income Community","2011-2015"]
["Iowa","Johnson","19103000302","Low-Income Community","2011-2015"]
["Iowa","Johnson","19103001400","Non-LIC Contiguous","2011-2015"]
["Iowa","Johnson","19103001700","Low-Income Community","2011-2015"]
["Iowa","Lee","19111490200","Low-Income Community","2011-2015"]
["Iowa","Lee","19111490800","Low-Income Community","2011-2015"]
["Iowa","Lee","19111490900","Low-Income Community","2011-2015"]
["Iowa","Linn","19113001900","Low-Income Community","2011-2015"]
["Iowa","Linn","19113002200","Low-Income Community","2011-2015"]
["Iowa","Linn","19113002700","Low-Income Community","2011-2015"]
["Iowa","Lucas","19117950300","Low-Income Community","2011-2015"]
["Iowa","Madison","19121060200","Low-Income Community","2011-2015"]
["Iowa","Marshall","19127950900","Low-Income Community","2011-2015"]
["Iowa","Muscatine","19139050700","Low-Income Community","2011-2015"]
["Iowa","Muscatine","19139051000","Low-Income Community","2011-2015"]
["Iowa","Page","19145490200","Low-Income Community","2011-2015"]
["Iowa","Plymouth","19149970200","Low-Income Community","2011-2015"]
["Iowa","Pocahontas","19151780100","Low-Income Community","2011-2015"]
["Iowa","Polk","19153001100","Low-Income Community","2011-2015"]
["Iowa","Polk","19153002600","Low-Income Community","2011-2015"]
["Iowa","Polk","19153011001","Low-Income Community","2011-2015"]
["Iowa","Pottawattamie","19155030900","Low-Income Community","2011-2015"]
["Iowa","Pottawattamie","19155031300","Low-Income Community","2011-2015"]
["Iowa","Poweshiek","19157370400","Low-Income Community","2011-2015"]
["Iowa","Scott","19163010600","Low-Income Community","2011-2015"]
["Iowa","Scott","19163010900","Low-Income Community","2011-2015"]
["Iowa","Shelby","19165960400","Low-Income Community","2011-2015"]
["Iowa","Union","19175190200","Low-Income Community","2011-2015"]
["Iowa","Webster","19187000700","Low-Income Community","2011-2015"]
["Iowa","Woodbury","19193000100","Low-Income Community","2011-2015"]
["Iowa","Woodbury","19193001500","Low-Income Community","2011-2015"]
["Iowa","Woodbury","19193003600","Low-Income Community","2011-2015"]
["Iowa","Worth","19195690100","Low-Income Community","2011-2015"]
["Kansas","Allen","20001952900","Low-Income Community","2011-2015"]
["Kansas","Anderson","20003953600","Low-Income Community","2011-2015"]
["Kansas","Atchison","20005081900","Low-Income Community","2011-2015"]
["Kansas","Barton","20009971400","Low-Income Community","2011-2015"]
["Kansas","Barton","20009971700","Low-Income Community","2011-2015"]
["Kansas","Butler","20015020400","Low-Income Community","2011-2015"]
["Kansas","Cloud","20029977200","Low-Income Community","2011-2015"]
["Kansas","Cowley","20035493700","Low-Income Community","2011-2015"]
["Kansas","Cowley","20035493800","Low-Income Community","2011-2015"]
["Kansas","Crawford","20037956600","Low-Income Community","2011-2015"]
["Kansas","Crawford","20037956900","Non-LIC Contiguous","2011-2015"]
["Kansas","Crawford","20037957500","Low-Income Community","2011-2015"]
["Kansas","Crawford","20037957600","Low-Income Community","2011-2015"]
["Kansas","Douglas","20045000200","Low-Income Community","2011-2015"]
["Kansas","Douglas","20045000400","Low-Income Community","2011-2015"]
["Kansas","Finney","20055960501","Low-Income Community","2011-2015"]
["Kansas","Finney","20055960600","Low-Income Community","2011-2015"]
["Kansas","Ford","20057961800","Low-Income Community","2011-2015"]
["Kansas","Ford","20057962101","Low-Income Community","2011-2015"]
["Kansas","Franklin","20059954200","Low-Income Community","2011-2015"]
["Kansas","Franklin","20059954400","Low-Income Community","2011-2015"]
["Kansas","Gove","20063955100","Low-Income Community","2011-2015"]
["Kansas","Gove","20063955200","Low-Income Community","2011-2015"]
["Kansas","Graham","20065952100","Low-Income Community","2011-2015"]
["Kansas","Greeley","20071958100","Low-Income Community","2011-2015"]
["Kansas","Jewell","20089576100","Low-Income Community","2011-2015"]
["Kansas","Jewell","20089576200","Low-Income Community","2011-2015"]
["Kansas","Johnson","20091052102","Low-Income Community","2011-2015"]
["Kansas","Johnson","20091052417","Low-Income Community","2011-2015"]
["Kansas","Johnson","20091053555","Low-Income Community","2011-2015"]
["Kansas","Johnson","20091053557","Low-Income Community","2011-2015"]
["Kansas","Johnson","20091053601","Low-Income Community","2011-2015"]
["Kansas","Labette","20099950400","Low-Income Community","2011-2015"]
["Kansas","Lane","20101956600","Non-LIC Contiguous","2011-2015"]
["Kansas","Leavenworth","20103070100","Low-Income Community","2011-2015"]
["Kansas","Lyon","20111000500","Low-Income Community","2011-2015"]
["Kansas","Miami","20121100700","Low-Income Community","2011-2015"]
["Kansas","Montgomery","20125950200","Low-Income Community","2011-2015"]
["Kansas","Montgomery","20125951200","Low-Income Community","2011-2015"]
["Kansas","Montgomery","20125951300","Low-Income Community","2011-2015"]
["Kansas","Norton","20137951700","Non-LIC Contiguous","2011-2015"]
["Kansas","Osage","20139010400","Low-Income Community","2011-2015"]
["Kansas","Reno","20155000600","Low-Income Community","2011-2015"]
["Kansas","Reno","20155000700","Low-Income Community","2011-2015"]
["Kansas","Reno","20155001000","Low-Income Community","2011-2015"]
["Kansas","Reno","20155001300","Low-Income Community","2011-2015"]
["Kansas","Republic","20157978300","Low-Income Community","2011-2015"]
["Kansas","Riley","20161000500","Low-Income Community","2011-2015"]
["Kansas","Riley","20161000801","Low-Income Community","2011-2015"]
["Kansas","Riley","20161001100","Low-Income Community","2011-2015"]
["Kansas","Rooks","20163974600","Low-Income Community","2011-2015"]
["Kansas","Rooks","20163974700","Non-LIC Contiguous","2011-2015"]
["Kansas","Saline","20169000100","Low-Income Community","2011-2015"]
["Kansas","Saline","20169000600","Low-Income Community","2011-2015"]
["Kansas","Sedgwick","20173000400","Low-Income Community","2011-2015"]
["Kansas","Sedgwick","20173000900","Low-Income Community","2011-2015"]
["Kansas","Sedgwick","20173001100","Low-Income Community","2011-2015"]
["Kansas","Sedgwick","20173002600","Low-Income Community","2011-2015"]
["Kansas","Sedgwick","20173003200","Low-Income Community","2011-2015"]
["Kansas","Sedgwick","20173003700","Low-Income Community","2011-2015"]
["Kansas","Sedgwick","20173003800","Low-Income Community","2011-2015"]
["Kansas","Sedgwick","20173004300","Low-Income Community","2011-2015"]
["Kansas","Sedgwick","20173006300","Low-Income Community","2011-2015"]
["Kansas","Shawnee","20177000700","Low-Income Community","2011-2015"]
["Kansas","Shawnee","20177000800","Low-Income Community","2011-2015"]
["Kansas","Shawnee","20177004000","Low-Income Community","2011-2015"]
["Kansas","Sherman","20181453700","Low-Income Community","2011-2015"]
["Kansas","Stafford","20185470600","Low-Income Community","2011-2015"]
["Kansas","Wyandotte","20209041800","Low-Income Community","2011-2015"]
["Kansas","Wyandotte","20209042200","Low-Income Community","2011-2015"]
["Kansas","Wyandotte","20209043905","Low-Income Community","2011-2015"]
["Kansas","Wyandotte","20209044101","Low-Income Community","2011-2015"]
["Kansas","Wyandotte","20209045100","Low-Income Community","2011-2015"]
["Kansas","Wyandotte","20209045200","Low-Income Community","2011-2015"]
["Kentucky","Adair","21001970500","Low-Income Community","2011-2015"]
["Kentucky","Ballard","21007950200","Low-Income Community","2011-2015"]
["Kentucky","Ballard","21007950300","Non-LIC Contiguous","2011-2015"]
["Kentucky","Barren","21009950200","Low-Income Community","2011-2015"]
["Kentucky","Bath","21011970200","Low-Income Community","2011-2015"]
["Kentucky","Bell","21013960600","Low-Income Community","2011-2015"]
["Kentucky","Boone","21015070311","Low-Income Community","2011-2015"]
["Kentucky","Boyd","21019030200","Low-Income Community","2011-2015"]
["Kentucky","Boyd","21019031001","Low-Income Community","2011-2015"]
["Kentucky","Boyle","21021930300","Low-Income Community","2011-2015"]
["Kentucky","Bracken","21023950100","Low-Income Community","2011-2015"]
["Kentucky","Breathitt","21025920100","Low-Income Community","2011-2015"]
["Kentucky","Breathitt","21025920300","Low-Income Community","2011-2015"]
["Kentucky","Breathitt","21025920500","Low-Income Community","2011-2015"]
["Kentucky","Breathitt","21025920600","Low-Income Community","2011-2015"]
["Kentucky","Bullitt","21029020701","Low-Income Community","2011-2015"]
["Kentucky","Bullitt","21029020800","Non-LIC Contiguous","2011-2015"]
["Kentucky","Butler","21031930300","Low-Income Community","2011-2015"]
["Kentucky","Calloway","21035010400","Low-Income Community","2011-2015"]
["Kentucky","Campbell","21037050500","Low-Income Community","2011-2015"]
["Kentucky","Carlisle","21039960200","Low-Income Community","2011-2015"]
["Kentucky","Carroll","21041950200","Low-Income Community","2011-2015"]
["Kentucky","Carter","21043960100","Low-Income Community","2011-2015"]
["Kentucky","Casey","21045950300","Low-Income Community","2011-2015"]
["Kentucky","Christian","21047200300","Low-Income Community","2011-2015"]
["Kentucky","Clark","21049020106","Low-Income Community","2011-2015"]
["Kentucky","Clay","21051950300","Low-Income Community","2011-2015"]
["Kentucky","Clay","21051950400","Low-Income Community","2011-2015"]
["Kentucky","Clinton","21053970202","Low-Income Community","2011-2015"]
["Kentucky","Cumberland","21057950100","Low-Income Community","2011-2015"]
["Kentucky","Daviess","21059000200","Low-Income Community","2011-2015"]
["Kentucky","Daviess","21059000300","Low-Income Community","2011-2015"]
["Kentucky","Edmonson","21061980100","Low-Income Community","2011-2015"]
["Kentucky","Estill","21065920200","Low-Income Community","2011-2015"]
["Kentucky","Estill","21065920300","Low-Income Community","2011-2015"]
["Kentucky","Fayette","21067000101","Low-Income Community","2011-2015"]
["Kentucky","Fayette","21067000102","Low-Income Community","2011-2015"]
["Kentucky","Fayette","21067000200","Low-Income Community","2011-2015"]
["Kentucky","Fayette","21067000300","Low-Income Community","2011-2015"]
["Kentucky","Fayette","21067000900","Low-Income Community","2011-2015"]
["Kentucky","Fayette","21067001100","Low-Income Community","2011-2015"]
["Kentucky","Fayette","21067001300","Low-Income Community","2011-2015"]
["Kentucky","Fleming","21069920100","Low-Income Community","2011-2015"]
["Kentucky","Floyd","21071920100","Low-Income Community","2011-2015"]
["Kentucky","Franklin","21073071200","Low-Income Community","2011-2015"]
["Kentucky","Fulton","21075960100","Low-Income Community","2011-2015"]
["Kentucky","Gallatin","21077960101","Low-Income Community","2011-2015"]
["Kentucky","Grant","21081920300","Low-Income Community","2011-2015"]
["Kentucky","Graves","21083020100","Low-Income Community","2011-2015"]
["Kentucky","Green","21087930200","Low-Income Community","2011-2015"]
["Kentucky","Greenup","21089040501","Non-LIC Contiguous","2011-2015"]
["Kentucky","Greenup","21089040502","Low-Income Community","2011-2015"]
["Kentucky","Harlan","21095970100","Low-Income Community","2011-2015"]
["Kentucky","Hart","21099970400","Low-Income Community","2011-2015"]
["Kentucky","Henderson","21101020602","Low-Income Community","2011-2015"]
["Kentucky","Hopkins","21107971100","Low-Income Community","2011-2015"]
["Kentucky","Jackson","21109960100","Low-Income Community","2011-2015"]
["Kentucky","Jefferson","21111000200","Low-Income Community","2011-2015"]
["Kentucky","Jefferson","21111000600","Low-Income Community","2011-2015"]
["Kentucky","Jefferson","21111001500","Low-Income Community","2011-2015"]
["Kentucky","Jefferson","21111001800","Low-Income Community","2011-2015"]
["Kentucky","Jefferson","21111002300","Low-Income Community","2011-2015"]
["Kentucky","Jefferson","21111002400","Low-Income Community","2011-2015"]
["Kentucky","Jefferson","21111002700","Low-Income Community","2011-2015"]
["Kentucky","Jefferson","21111002800","Low-Income Community","2011-2015"]
["Kentucky","Jefferson","21111003000","Low-Income Community","2011-2015"]
["Kentucky","Jefferson","21111003500","Low-Income Community","2011-2015"]
["Kentucky","Jefferson","21111003700","Low-Income Community","2011-2015"]
["Kentucky","Jefferson","21111004900","Low-Income Community","2011-2015"]
["Kentucky","Jefferson","21111005000","Low-Income Community","2011-2015"]
["Kentucky","Jefferson","21111005100","Low-Income Community","2011-2015"]
["Kentucky","Jefferson","21111005300","Low-Income Community","2011-2015"]
["Kentucky","Jefferson","21111005900","Low-Income Community","2011-2015"]
["Kentucky","Jefferson","21111006200","Low-Income Community","2011-2015"]
["Kentucky","Jefferson","21111006500","Low-Income Community","2011-2015"]
["Kentucky","Jefferson","21111007100","Low-Income Community","2011-2015"]
["Kentucky","Jessamine","21113060504","Low-Income Community","2011-2015"]
["Kentucky","Johnson","21115960400","Low-Income Community","2011-2015"]
["Kentucky","Kenton","21117060700","Low-Income Community","2011-2015"]
["Kentucky","Kenton","21117060900","Low-Income Community","2011-2015"]
["Kentucky","Kenton","21117063800","Low-Income Community","2011-2015"]
["Kentucky","Kenton","21117067000","Low-Income Community","2011-2015"]
["Kentucky","Kenton","21117067100","Low-Income Community","2011-2015"]
["Kentucky","Knott","21119960100","Low-Income Community","2011-2015"]
["Kentucky","Knox","21121930500","Low-Income Community","2011-2015"]
["Kentucky","Larue","21123960102","Low-Income Community","2011-2015"]
["Kentucky","Leslie","21131920100","Low-Income Community","2011-2015"]
["Kentucky","Letcher","21133950100","Low-Income Community","2011-2015"]
["Kentucky","Lewis","21135930300","Low-Income Community","2011-2015"]
["Kentucky","Lincoln","21137920101","Low-Income Community","2011-2015"]
["Kentucky","Lincoln","21137920103","Low-Income Community","2011-2015"]
["Kentucky","Logan","21141960500","Low-Income Community","2011-2015"]
["Kentucky","McCracken","21145030300","Low-Income Community","2011-2015"]
["Kentucky","McCracken","21145030400","Low-Income Community","2011-2015"]
["Kentucky","McCreary","21147960300","Low-Income Community","2011-2015"]
["Kentucky","Madison","21151010701","Low-Income Community","2011-2015"]
["Kentucky","Madison","21151010800","Non-LIC Contiguous","2011-2015"]
["Kentucky","Madison","21151010903","Low-Income Community","2011-2015"]
["Kentucky","Magoffin","21153970100","Low-Income Community","2011-2015"]
["Kentucky","Magoffin","21153970200","Low-Income Community","2011-2015"]
["Kentucky","Magoffin","21153970400","Low-Income Community","2011-2015"]
["Kentucky","Martin","21159950100","Low-Income Community","2011-2015"]
["Kentucky","Martin","21159950200","Low-Income Community","2011-2015"]
["Kentucky","Mason","21161960100","Low-Income Community","2011-2015"]
["Kentucky","Menifee","21165960100","Low-Income Community","2011-2015"]
["Kentucky","Metcalfe","21169960300","Low-Income Community","2011-2015"]
["Kentucky","Montgomery","21173920200","Low-Income Community","2011-2015"]
["Kentucky","Montgomery","21173920302","Low-Income Community","2011-2015"]
["Kentucky","Montgomery","21173920400","Low-Income Community","2011-2015"]
["Kentucky","Montgomery","21173920500","Low-Income Community","2011-2015"]
["Kentucky","Morgan","21175950300","Low-Income Community","2011-2015"]
["Kentucky","Muhlenberg","21177960200","Low-Income Community","2011-2015"]
["Kentucky","Muhlenberg","21177960400","Non-LIC Contiguous","2011-2015"]
["Kentucky","Nicholas","21181960200","Low-Income Community","2011-2015"]
["Kentucky","Ohio","21183920300","Low-Income Community","2011-2015"]
["Kentucky","Ohio","21183920500","Low-Income Community","2011-2015"]
["Kentucky","Owen","21187970200","Low-Income Community","2011-2015"]
["Kentucky","Owsley","21189930100","Low-Income Community","2011-2015"]
["Kentucky","Perry","21193970500","Low-Income Community","2011-2015"]
["Kentucky","Perry","21193970600","Low-Income Community","2011-2015"]
["Kentucky","Perry","21193971000","Low-Income Community","2011-2015"]
["Kentucky","Pike","21195930100","Low-Income Community","2011-2015"]
["Kentucky","Pike","21195930300","Low-Income Community","2011-2015"]
["Kentucky","Pike","21195930400","Low-Income Community","2011-2015"]
["Kentucky","Pike","21195930500","Low-Income Community","2011-2015"]
["Kentucky","Pike","21195931100","Low-Income Community","2011-2015"]
["Kentucky","Pike","21195931800","Low-Income Community","2011-2015"]
["Kentucky","Pike","21195931900","Low-Income Community","2011-2015"]
["Kentucky","Powell","21197970200","Low-Income Community","2011-2015"]
["Kentucky","Pulaski","21199930100","Low-Income Community","2011-2015"]
["Kentucky","Pulaski","21199931102","Low-Income Community","2011-2015"]
["Kentucky","Robertson","21201970100","Low-Income Community","2011-2015"]
["Kentucky","Rowan","21205950200","Low-Income Community","2011-2015"]
["Kentucky","Russell","21207960102","Low-Income Community","2011-2015"]
["Kentucky","Simpson","21213970400","Low-Income Community","2011-2015"]
["Kentucky","Taylor","21217920500","Low-Income Community","2011-2015"]
["Kentucky","Todd","21219950300","Low-Income Community","2011-2015"]
["Kentucky","Union","21225950201","Low-Income Community","2011-2015"]
["Kentucky","Warren","21227010200","Low-Income Community","2011-2015"]
["Kentucky","Wayne","21231920400","Low-Income Community","2011-2015"]
["Kentucky","Webster","21233960400","Low-Income Community","2011-2015"]
["Kentucky","Whitley","21235920500","Low-Income Community","2011-2015"]
["Kentucky","Whitley","21235920600","Low-Income Community","2011-2015"]
["Kentucky","Wolfe","21237930200","Low-Income Community","2011-2015"]
["Louisiana","Acadia","22001960100","Low-Income Community","2011-2015"]
["Louisiana","Allen","22003950300","Low-Income Community","2011-2015"]
["Louisiana","Ascension","22005030900","Low-Income Community","2011-2015"]
["Louisiana","Ascension","22005031000","Low-Income Community","2011-2015"]
["Louisiana","Assumption","22007050100","Low-Income Community","2011-2015"]
["Louisiana","Avoyelles","22009030600","Low-Income Community","2011-2015"]
["Louisiana","Avoyelles","22009030900","Low-Income Community","2011-2015"]
["Louisiana","Beauregard","22011960300","Low-Income Community","2011-2015"]
["Louisiana","Bienville","22013970100","Low-Income Community","2011-2015"]
["Louisiana","Bienville","22013970200","Low-Income Community","2011-2015"]
["Louisiana","Bossier","22015010601","Low-Income Community","2011-2015"]
["Louisiana","Caddo","22017023400","Low-Income Community","2011-2015"]
["Louisiana","Caddo","22017023800","Low-Income Community","2011-2015"]
["Louisiana","Caddo","22017024303","Low-Income Community","2011-2015"]
["Louisiana","Caddo","22017024601","Low-Income Community","2011-2015"]
["Louisiana","Caddo","22017024900","Non-LIC Contiguous","2011-2015"]
["Louisiana","Caddo","22017025100","Low-Income Community","2011-2015"]
["Louisiana","Caddo","22017025300","Low-Income Community","2011-2015"]
["Louisiana","Calcasieu","22019000100","Low-Income Community","2011-2015"]
["Louisiana","Calcasieu","22019000200","Low-Income Community","2011-2015"]
["Louisiana","Calcasieu","22019000400","Low-Income Community","2011-2015"]
["Louisiana","Calcasieu","22019001500","Low-Income Community","2011-2015"]
["Louisiana","Calcasieu","22019001600","Low-Income Community","2011-2015"]
["Louisiana","Concordia","22029000300","Low-Income Community","2011-2015"]
["Louisiana","De Soto","22031950300","Low-Income Community","2011-2015"]
["Louisiana","East Baton Rouge","22033000100","Low-Income Community","2011-2015"]
["Louisiana","East Baton Rouge","22033000300","Low-Income Community","2011-2015"]
["Louisiana","East Baton Rouge","22033000400","Low-Income Community","2011-2015"]
["Louisiana","East Baton Rouge","22033000500","Low-Income Community","2011-2015"]
["Louisiana","East Baton Rouge","22033000602","Low-Income Community","2011-2015"]
["Louisiana","East Baton Rouge","22033000900","Low-Income Community","2011-2015"]
["Louisiana","East Baton Rouge","22033001000","Low-Income Community","2011-2015"]
["Louisiana","East Baton Rouge","22033001104","Low-Income Community","2011-2015"]
["Louisiana","East Baton Rouge","22033002200","Low-Income Community","2011-2015"]
["Louisiana","East Baton Rouge","22033002400","Low-Income Community","2011-2015"]
["Louisiana","East Baton Rouge","22033002500","Low-Income Community","2011-2015"]
["Louisiana","East Baton Rouge","22033003000","Low-Income Community","2011-2015"]
["Louisiana","East Baton Rouge","22033003101","Low-Income Community","2011-2015"]
["Louisiana","East Baton Rouge","22033003103","Low-Income Community","2011-2015"]
["Louisiana","East Baton Rouge","22033003300","Low-Income Community","2011-2015"]
["Louisiana","East Baton Rouge","22033003400","Low-Income Community","2011-2015"]
["Louisiana","East Baton Rouge","22033004011","Low-Income Community","2011-2015"]
["Louisiana","East Baton Rouge","22033004201","Low-Income Community","2011-2015"]
["Louisiana","East Baton Rouge","22033004203","Low-Income Community","2011-2015"]
["Louisiana","East Baton Rouge","22033005100","Low-Income Community","2011-2015"]
["Louisiana","East Baton Rouge","22033005200","Low-Income Community","2011-2015"]
["Louisiana","East Baton Rouge","22033005300","Low-Income Community","2011-2015"]
["Louisiana","East Carroll","22035000200","Low-Income Community","2011-2015"]
["Louisiana","East Feliciana","22037951502","Low-Income Community","2011-2015"]
["Louisiana","Evangeline","22039950500","Low-Income Community","2011-2015"]
["Louisiana","Evangeline","22039950600","Low-Income Community","2011-2015"]
["Louisiana","Iberia","22045030500","Low-Income Community","2011-2015"]
["Louisiana","Iberia","22045030900","Low-Income Community","2011-2015"]
["Louisiana","Iberia","22045031000","Low-Income Community","2011-2015"]
["Louisiana","Iberia","22045031100","Low-Income Community","2011-2015"]
["Louisiana","Iberville","22047953000","Low-Income Community","2011-2015"]
["Louisiana","Jackson","22049970300","Non-LIC Contiguous","2011-2015"]
["Louisiana","Jefferson","22051020201","Low-Income Community","2011-2015"]
["Louisiana","Jefferson","22051020202","Low-Income Community","2011-2015"]
["Louisiana","Jefferson","22051020600","Low-Income Community","2011-2015"]
["Louisiana","Jefferson","22051024600","Low-Income Community","2011-2015"]
["Louisiana","Jefferson","22051025900","Low-Income Community","2011-2015"]
["Louisiana","Jefferson","22051026900","Low-Income Community","2011-2015"]
["Louisiana","Jefferson","22051028200","Low-Income Community","2011-2015"]
["Louisiana","Jefferson Davis","22053000500","Low-Income Community","2011-2015"]
["Louisiana","Lafayette","22055000100","Low-Income Community","2011-2015"]
["Louisiana","Lafayette","22055000700","Low-Income Community","2011-2015"]
["Louisiana","Lafayette","22055000800","Low-Income Community","2011-2015"]
["Louisiana","Lafayette","22055000900","Low-Income Community","2011-2015"]
["Louisiana","Lafayette","22055001001","Low-Income Community","2011-2015"]
["Louisiana","Lafayette","22055001100","Low-Income Community","2011-2015"]
["Louisiana","Lafayette","22055002200","Low-Income Community","2011-2015"]
["Louisiana","Lafourche","22057020400","Low-Income Community","2011-2015"]
["Louisiana","Lafourche","22057020702","Low-Income Community","2011-2015"]
["Louisiana","Lafourche","22057020900","Low-Income Community","2011-2015"]
["Louisiana","Lincoln","22061960300","Low-Income Community","2011-2015"]
["Louisiana","Lincoln","22061960400","Low-Income Community","2011-2015"]
["Louisiana","Lincoln","22061960900","Low-Income Community","2011-2015"]
["Louisiana","Livingston","22063040401","Low-Income Community","2011-2015"]
["Louisiana","Livingston","22063040402","Non-LIC Contiguous","2011-2015"]
["Louisiana","Livingston","22063040700","Low-Income Community","2011-2015"]
["Louisiana","Morehouse","22067950400","Low-Income Community","2011-2015"]
["Louisiana","Morehouse","22067950500","Low-Income Community","2011-2015"]
["Louisiana","Morehouse","22067950600","Low-Income Community","2011-2015"]
["Louisiana","Natchitoches","22069000600","Low-Income Community","2011-2015"]
["Louisiana","Natchitoches","22069000700","Low-Income Community","2011-2015"]
["Louisiana","Orleans","22071000200","Low-Income Community","2011-2015"]
["Louisiana","Orleans","22071000605","Low-Income Community","2011-2015"]
["Louisiana","Orleans","22071000904","Low-Income Community","2011-2015"]
["Louisiana","Orleans","22071001730","Low-Income Community","2011-2015"]
["Louisiana","Orleans","22071001736","Low-Income Community","2011-2015"]
["Louisiana","Orleans","22071001751","Low-Income Community","2011-2015"]
["Louisiana","Orleans","22071002700","Low-Income Community","2011-2015"]
["Louisiana","Orleans","22071002900","Low-Income Community","2011-2015"]
["Louisiana","Orleans","22071003307","Low-Income Community","2011-2015"]
["Louisiana","Orleans","22071003400","Low-Income Community","2011-2015"]
["Louisiana","Orleans","22071004000","Low-Income Community","2011-2015"]
["Louisiana","Orleans","22071004401","Low-Income Community","2011-2015"]
["Louisiana","Orleans","22071004900","Low-Income Community","2011-2015"]
["Louisiana","Orleans","22071006000","Low-Income Community","2011-2015"]
["Louisiana","Orleans","22071006300","Low-Income Community","2011-2015"]
["Louisiana","Orleans","22071007101","Low-Income Community","2011-2015"]
["Louisiana","Orleans","22071007200","Low-Income Community","2011-2015"]
["Louisiana","Orleans","22071007700","Non-LIC Contiguous","2011-2015"]
["Louisiana","Orleans","22071008400","Low-Income Community","2011-2015"]
["Louisiana","Orleans","22071009400","Low-Income Community","2011-2015"]
["Louisiana","Orleans","22071011100","Low-Income Community","2011-2015"]
["Louisiana","Orleans","22071013400","Low-Income Community","2011-2015"]
["Louisiana","Orleans","22071013700","Low-Income Community","2011-2015"]
["Louisiana","Orleans","22071014000","Low-Income Community","2011-2015"]
["Louisiana","Orleans","22071014300","Low-Income Community","2011-2015"]
["Louisiana","Ouachita","22073000600","Low-Income Community","2011-2015"]
["Louisiana","Ouachita","22073001400","Low-Income Community","2011-2015"]
["Louisiana","Ouachita","22073010603","Low-Income Community","2011-2015"]
["Louisiana","Ouachita","22073010900","Low-Income Community","2011-2015"]
["Louisiana","Pointe Coupee","22077951900","Low-Income Community","2011-2015"]
["Louisiana","Pointe Coupee","22077952300","Low-Income Community","2011-2015"]
["Louisiana","Rapides","22079010500","Low-Income Community","2011-2015"]
["Louisiana","Rapides","22079011300","Low-Income Community","2011-2015"]
["Louisiana","Rapides","22079013900","Low-Income Community","2011-2015"]
["Louisiana","Richland","22083970500","Low-Income Community","2011-2015"]
["Louisiana","St. Bernard","22087030300","Low-Income Community","2011-2015"]
["Louisiana","St. Bernard","22087030400","Low-Income Community","2011-2015"]
["Louisiana","St. Bernard","22087030800","Low-Income Community","2011-2015"]
["Louisiana","St. Charles","22089062700","Low-Income Community","2011-2015"]
["Louisiana","St. Helena","22091951100","Low-Income Community","2011-2015"]
["Louisiana","St. James","22093040400","Low-Income Community","2011-2015"]
["Louisiana","St. James","22093040500","Low-Income Community","2011-2015"]
["Louisiana","St. John the Baptist","22095071100","Low-Income Community","2011-2015"]
["Louisiana","St. Landry","22097961100","Low-Income Community","2011-2015"]
["Louisiana","St. Landry","22097961300","Low-Income Community","2011-2015"]
["Louisiana","St. Landry","22097961400","Low-Income Community","2011-2015"]
["Louisiana","St. Landry","22097961600","Low-Income Community","2011-2015"]
["Louisiana","St. Martin","22099020501","Low-Income Community","2011-2015"]
["Louisiana","St. Mary","22101040300","Low-Income Community","2011-2015"]
["Louisiana","St. Mary","22101040400","Low-Income Community","2011-2015"]
["Louisiana","St. Mary","22101040500","Low-Income Community","2011-2015"]
["Louisiana","St. Mary","22101041200","Low-Income Community","2011-2015"]
["Louisiana","St. Tammany","22103040704","Low-Income Community","2011-2015"]
["Louisiana","Tangipahoa","22105953600","Low-Income Community","2011-2015"]
["Louisiana","Tangipahoa","22105953800","Low-Income Community","2011-2015"]
["Louisiana","Terrebonne","22109000101","Non-LIC Contiguous","2011-2015"]
["Louisiana","Terrebonne","22109000500","Low-Income Community","2011-2015"]
["Louisiana","Vermilion","22113950700","Low-Income Community","2011-2015"]
["Louisiana","Vernon","22115950400","Low-Income Community","2011-2015"]
["Louisiana","Washington","22117950500","Low-Income Community","2011-2015"]
["Louisiana","Washington","22117951000","Low-Income Community","2011-2015"]
["Louisiana","Webster","22119031200","Low-Income Community","2011-2015"]
["Louisiana","West Baton Rouge","22121020200","Low-Income Community","2011-2015"]
["Louisiana","Winn","22127960200","Low-Income Community","2011-2015"]
["Maine","Androscoggin","23001010500","Low-Income Community","2011-2015"]
["Maine","Androscoggin","23001020300","Low-Income Community","2011-2015"]
["Maine","Aroostook","23003950100","Low-Income Community","2011-2015"]
["Maine","Aroostook","23003950300","Non-LIC Contiguous","2011-2015"]
["Maine","Aroostook","23003951000","Low-Income Community","2011-2015"]
["Maine","Aroostook","23003951600","Low-Income Community","2011-2015"]
["Maine","Cumberland","23005000300","Low-Income Community","2011-2015"]
["Maine","Cumberland","23005002800","Low-Income Community","2011-2015"]
["Maine","Cumberland","23005003000","Low-Income Community","2011-2015"]
["Maine","Cumberland","23005011100","Low-Income Community","2011-2015"]
["Maine","Hancock","23009965503","Low-Income Community","2011-2015"]
["Maine","Kennebec","23011010300","Low-Income Community","2011-2015"]
["Maine","Kennebec","23011024102","Low-Income Community","2011-2015"]
["Maine","Oxford","23017965500","Low-Income Community","2011-2015"]
["Maine","Oxford","23017965600","Low-Income Community","2011-2015"]
["Maine","Oxford","23017966200","Low-Income Community","2011-2015"]
["Maine","Penobscot","23019000300","Low-Income Community","2011-2015"]
["Maine","Penobscot","23019004100","Low-Income Community","2011-2015"]
["Maine","Penobscot","23019007100","Low-Income Community","2011-2015"]
["Maine","Penobscot","23019027000","Low-Income Community","2011-2015"]
["Maine","Penobscot","23019028000","Low-Income Community","2011-2015"]
["Maine","Penobscot","23019030000","Low-Income Community","2011-2015"]
["Maine","Penobscot","23019031000","Low-Income Community","2011-2015"]
["Maine","Piscataquis","23021960301","Low-Income Community","2011-2015"]
["Maine","Sagadahoc","23023970600","Low-Income Community","2011-2015"]
["Maine","Somerset","23025965900","Low-Income Community","2011-2015"]
["Maine","Somerset","23025966500","Low-Income Community","2011-2015"]
["Maine","Waldo","23027043000","Low-Income Community","2011-2015"]
["Maine","Washington","23029955400","Non-LIC Contiguous","2011-2015"]
["Maine","Washington","23029955500","Low-Income Community","2011-2015"]
["Maine","Washington","23029955900","Low-Income Community","2011-2015"]
["Maine","York","23031005200","Low-Income Community","2011-2015"]
["Maryland","Allegany","24001000800","Low-Income Community","2011-2015"]
["Maryland","Allegany","24001001000","Low-Income Community","2011-2015"]
["Maryland","Allegany","24001001100","Low-Income Community","2011-2015"]
["Maryland","Allegany","24001001800","Low-Income Community","2011-2015"]
["Maryland","Anne Arundel","24003740603","Low-Income Community","2011-2015"]
["Maryland","Anne Arundel","24003750101","Low-Income Community","2011-2015"]
["Maryland","Anne Arundel","24003750102","Low-Income Community","2011-2015"]
["Maryland","Anne Arundel","24003750201","Low-Income Community","2011-2015"]
["Maryland","Baltimore","24005401507","Low-Income Community","2011-2015"]
["Maryland","Baltimore","24005402406","Low-Income Community","2011-2015"]
["Maryland","Baltimore","24005404102","Low-Income Community","2011-2015"]
["Maryland","Baltimore","24005404202","Low-Income Community","2011-2015"]
["Maryland","Baltimore","24005421102","Low-Income Community","2011-2015"]
["Maryland","Baltimore","24005421300","Low-Income Community","2011-2015"]
["Maryland","Baltimore","24005450501","Low-Income Community","2011-2015"]
["Maryland","Baltimore","24005450800","Low-Income Community","2011-2015"]
["Maryland","Baltimore","24005451600","Low-Income Community","2011-2015"]
["Maryland","Baltimore","24005492500","Low-Income Community","2011-2015"]
["Maryland","Calvert","24009860703","Low-Income Community","2011-2015"]
["Maryland","Calvert","24009861003","Non-LIC Contiguous","2011-2015"]
["Maryland","Calvert","24009861004","Low-Income Community","2011-2015"]
["Maryland","Caroline","24011955302","Low-Income Community","2011-2015"]
["Maryland","Caroline","24011955600","Low-Income Community","2011-2015"]
["Maryland","Carroll","24013507601","Low-Income Community","2011-2015"]
["Maryland","Cecil","24015030400","Low-Income Community","2011-2015"]
["Maryland","Cecil","24015030505","Low-Income Community","2011-2015"]
["Maryland","Cecil","24015030906","Low-Income Community","2011-2015"]
["Maryland","Charles","24017850202","Low-Income Community","2011-2015"]
["Maryland","Charles","24017850709","Non-LIC Contiguous","2011-2015"]
["Maryland","Charles","24017850802","Low-Income Community","2011-2015"]
["Maryland","Dorchester","24019970400","Low-Income Community","2011-2015"]
["Maryland","Dorchester","24019970600","Low-Income Community","2011-2015"]
["Maryland","Frederick","24021750300","Low-Income Community","2011-2015"]
["Maryland","Frederick","24021751003","Low-Income Community","2011-2015"]
["Maryland","Frederick","24021765100","Low-Income Community","2011-2015"]
["Maryland","Frederick","24021772200","Low-Income Community","2011-2015"]
["Maryland","Frederick","24021775400","Low-Income Community","2011-2015"]
["Maryland","Garrett","24023000200","Low-Income Community","2011-2015"]
["Maryland","Garrett","24023000600","Low-Income Community","2011-2015"]
["Maryland","Garrett","24023000700","Low-Income Community","2011-2015"]
["Maryland","Harford","24025301302","Low-Income Community","2011-2015"]
["Maryland","Harford","24025302902","Low-Income Community","2011-2015"]
["Maryland","Harford","24025306100","Low-Income Community","2011-2015"]
["Maryland","Harford","24025306200","Low-Income Community","2011-2015"]
["Maryland","Howard","24027601107","Low-Income Community","2011-2015"]
["Maryland","Kent","24029950300","Low-Income Community","2011-2015"]
["Maryland","Montgomery","24031700713","Low-Income Community","2011-2015"]
["Maryland","Montgomery","24031700723","Low-Income Community","2011-2015"]
["Maryland","Montgomery","24031700724","Low-Income Community","2011-2015"]
["Maryland","Montgomery","24031700813","Low-Income Community","2011-2015"]
["Maryland","Montgomery","24031700830","Low-Income Community","2011-2015"]
["Maryland","Montgomery","24031700904","Low-Income Community","2011-2015"]
["Maryland","Montgomery","24031701421","Low-Income Community","2011-2015"]
["Maryland","Montgomery","24031701509","Low-Income Community","2011-2015"]
["Maryland","Montgomery","24031701703","Low-Income Community","2011-2015"]
["Maryland","Montgomery","24031702000","Low-Income Community","2011-2015"]
["Maryland","Montgomery","24031702301","Low-Income Community","2011-2015"]
["Maryland","Montgomery","24031702500","Low-Income Community","2011-2015"]
["Maryland","Montgomery","24031702601","Low-Income Community","2011-2015"]
["Maryland","Montgomery","24031703800","Low-Income Community","2011-2015"]
["Maryland","Prince George's","24033801500","Low-Income Community","2011-2015"]
["Maryland","Prince George's","24033801600","Low-Income Community","2011-2015"]
["Maryland","Prince George's","24033801802","Low-Income Community","2011-2015"]
["Maryland","Prince George's","24033801807","Low-Income Community","2011-2015"]
["Maryland","Prince George's","24033802204","Non-LIC Contiguous","2011-2015"]
["Maryland","Prince George's","24033802405","Low-Income Community","2011-2015"]
["Maryland","Prince George's","24033802700","Low-Income Community","2011-2015"]
["Maryland","Prince George's","24033802803","Low-Income Community","2011-2015"]
["Maryland","Prince George's","24033802804","Low-Income Community","2011-2015"]
["Maryland","Prince George's","24033802901","Low-Income Community","2011-2015"]
["Maryland","Prince George's","24033803508","Low-Income Community","2011-2015"]
["Maryland","Prince George's","24033803514","Low-Income Community","2011-2015"]
["Maryland","Prince George's","24033803519","Non-LIC Contiguous","2011-2015"]
["Maryland","Prince George's","24033803525","Low-Income Community","2011-2015"]
["Maryland","Prince George's","24033803602","Low-Income Community","2011-2015"]
["Maryland","Prince George's","24033803605","Low-Income Community","2011-2015"]
["Maryland","Prince George's","24033803612","Low-Income Community","2011-2015"]
["Maryland","Prince George's","24033804102","Low-Income Community","2011-2015"]
["Maryland","Prince George's","24033804600","Low-Income Community","2011-2015"]
["Maryland","Prince George's","24033805601","Low-Income Community","2011-2015"]
["Maryland","Prince George's","24033805908","Low-Income Community","2011-2015"]
["Maryland","Prince George's","24033806000","Low-Income Community","2011-2015"]
["Maryland","Prince George's","24033806601","Low-Income Community","2011-2015"]
["Maryland","Prince George's","24033807000","Low-Income Community","2011-2015"]
["Maryland","Prince George's","24033807200","Low-Income Community","2011-2015"]
["Maryland","Queen Anne's","24035810300","Low-Income Community","2011-2015"]
["Maryland","St. Mary's","24037876001","Low-Income Community","2011-2015"]
["Maryland","Somerset","24039930101","Low-Income Community","2011-2015"]
["Maryland","Somerset","24039930500","Low-Income Community","2011-2015"]
["Maryland","Somerset","24039930600","Low-Income Community","2011-2015"]
["Maryland","Talbot","24041960300","Low-Income Community","2011-2015"]
["Maryland","Talbot","24041960400","Low-Income Community","2011-2015"]
["Maryland","Washington","24043000400","Low-Income Community","2011-2015"]
["Maryland","Washington","24043000500","Low-Income Community","2011-2015"]
["Maryland","Washington","24043000700","Low-Income Community","2011-2015"]
["Maryland","Washington","24043000800","Low-Income Community","2011-2015"]
["Maryland","Washington","24043010802","Low-Income Community","2011-2015"]
["Maryland","Wicomico","24045000100","Low-Income Community","2011-2015"]
["Maryland","Wicomico","24045000200","Low-Income Community","2011-2015"]
["Maryland","Wicomico","24045000500","Low-Income Community","2011-2015"]
["Maryland","Wicomico","24045010101","Low-Income Community","2011-2015"]
["Maryland","Wicomico","24045010102","Low-Income Community","2011-2015"]
["Maryland","Wicomico","24045010502","Low-Income Community","2011-2015"]
["Maryland","Wicomico","24045010603","Low-Income Community","2011-2015"]
["Maryland","Worcester","24047950000","Low-Income Community","2011-2015"]
["Maryland","Worcester","24047951000","Low-Income Community","2011-2015"]
["Maryland","Worcester","24047951300","Low-Income Community","2011-2015"]
["Maryland","Baltimore","24510030100","Low-Income Community","2011-2015"]
["Maryland","Baltimore","24510040100","Low-Income Community","2011-2015"]
["Maryland","Baltimore","24510070400","Low-Income Community","2011-2015"]
["Maryland","Baltimore","24510080200","Low-Income Community","2011-2015"]
["Maryland","Baltimore","24510080400","Low-Income Community","2011-2015"]
["Maryland","Baltimore","24510080700","Low-Income Community","2011-2015"]
["Maryland","Baltimore","24510080800","Low-Income Community","2011-2015"]
["Maryland","Baltimore","24510090800","Low-Income Community","2011-2015"]
["Maryland","Baltimore","24510100100","Low-Income Community","2011-2015"]
["Maryland","Baltimore","24510120500","Low-Income Community","2011-2015"]
["Maryland","Baltimore","24510130200","Low-Income Community","2011-2015"]
["Maryland","Baltimore","24510130300","Low-Income Community","2011-2015"]
["Maryland","Baltimore","24510140200","Low-Income Community","2011-2015"]
["Maryland","Baltimore","24510140300","Low-Income Community","2011-2015"]
["Maryland","Baltimore","24510150100","Low-Income Community","2011-2015"]
["Maryland","Baltimore","24510150400","Low-Income Community","2011-2015"]
["Maryland","Baltimore","24510150500","Low-Income Community","2011-2015"]
["Maryland","Baltimore","24510150600","Low-Income Community","2011-2015"]
["Maryland","Baltimore","24510160400","Low-Income Community","2011-2015"]
["Maryland","Baltimore","24510160500","Low-Income Community","2011-2015"]
["Maryland","Baltimore","24510170200","Low-Income Community","2011-2015"]
["Maryland","Baltimore","24510180100","Low-Income Community","2011-2015"]
["Maryland","Baltimore","24510180300","Low-Income Community","2011-2015"]
["Maryland","Baltimore","24510200100","Low-Income Community","2011-2015"]
["Maryland","Baltimore","24510200200","Low-Income Community","2011-2015"]
["Maryland","Baltimore","24510210100","Low-Income Community","2011-2015"]
["Maryland","Baltimore","24510230300","Low-Income Community","2011-2015"]
["Maryland","Baltimore","24510250203","Low-Income Community","2011-2015"]
["Maryland","Baltimore","24510250204","Low-Income Community","2011-2015"]
["Maryland","Baltimore","24510250205","Low-Income Community","2011-2015"]
["Maryland","Baltimore","24510250207","Low-Income Community","2011-2015"]
["Maryland","Baltimore","24510250301","Low-Income Community","2011-2015"]
["Maryland","Baltimore","24510250401","Low-Income Community","2011-2015"]
["Maryland","Baltimore","24510250500","Low-Income Community","2011-2015"]
["Maryland","Baltimore","24510260404","Low-Income Community","2011-2015"]
["Maryland","Baltimore","24510260501","Low-Income Community","2011-2015"]
["Maryland","Baltimore","24510260605","Low-Income Community","2011-2015"]
["Maryland","Baltimore","24510260700","Low-Income Community","2011-2015"]
["Maryland","Baltimore","24510270903","Low-Income Community","2011-2015"]
["Maryland","Baltimore","24510271600","Low-Income Community","2011-2015"]
["Maryland","Baltimore","24510271700","Low-Income Community","2011-2015"]
["Maryland","Baltimore","24510280500","Low-Income Community","2011-2015"]
["Massachusetts","Barnstable","25001010100","Low-Income Community","2011-2015"]
["Massachusetts","Barnstable","25001011600","Low-Income Community","2011-2015"]
["Massachusetts","Barnstable","25001012002","Low-Income Community","2011-2015"]
["Massachusetts","Barnstable","25001014100","Low-Income Community","2011-2015"]
["Massachusetts","Barnstable","25001014500","Low-Income Community","2011-2015"]
["Massachusetts","Barnstable","25001015300","Low-Income Community","2011-2015"]
["Massachusetts","Berkshire","25003900100","Low-Income Community","2011-2015"]
["Massachusetts","Berkshire","25003900200","Low-Income Community","2011-2015"]
["Massachusetts","Berkshire","25003921400","Low-Income Community","2011-2015"]
["Massachusetts","Berkshire","25003922100","Low-Income Community","2011-2015"]
["Massachusetts","Berkshire","25003922300","Low-Income Community","2012-2016"]
["Massachusetts","Berkshire","25003935300","Low-Income Community","2011-2015"]
["Massachusetts","Bristol","25005613800","Low-Income Community","2011-2015"]
["Massachusetts","Bristol","25005630101","Low-Income Community","2011-2015"]
["Massachusetts","Bristol","25005630102","Low-Income Community","2011-2015"]
["Massachusetts","Bristol","25005641101","Low-Income Community","2011-2015"]
["Massachusetts","Bristol","25005641200","Low-Income Community","2011-2015"]
["Massachusetts","Bristol","25005642000","Low-Income Community","2011-2015"]
["Massachusetts","Bristol","25005644200","Low-Income Community","2011-2015"]
["Massachusetts","Bristol","25005651200","Low-Income Community","2011-2015"]
["Massachusetts","Bristol","25005651300","Low-Income Community","2011-2015"]
["Massachusetts","Bristol","25005651800","Low-Income Community","2011-2015"]
["Massachusetts","Bristol","25005651900","Low-Income Community","2011-2015"]
["Massachusetts","Bristol","25005655300","Low-Income Community","2012-2016"]
["Massachusetts","Essex","25009204200","Low-Income Community","2011-2015"]
["Massachusetts","Essex","25009204701","Low-Income Community","2011-2015"]
["Massachusetts","Essex","25009206100","Low-Income Community","2011-2015"]
["Massachusetts","Essex","25009206800","Low-Income Community","2011-2015"]
["Massachusetts","Essex","25009207000","Low-Income Community","2011-2015"]
["Massachusetts","Essex","25009207200","Low-Income Community","2011-2015"]
["Massachusetts","Essex","25009208102","Low-Income Community","2011-2015"]
["Massachusetts","Essex","25009210700","Low-Income Community","2011-2015"]
["Massachusetts","Essex","25009210800","Low-Income Community","2011-2015"]
["Massachusetts","Essex","25009217400","Low-Income Community","2012-2016"]
["Massachusetts","Essex","25009221400","Low-Income Community","2011-2015"]
["Massachusetts","Essex","25009221500","Low-Income Community","2011-2015"]
["Massachusetts","Essex","25009250100","Low-Income Community","2011-2015"]
["Massachusetts","Essex","25009250300","Low-Income Community","2011-2015"]
["Massachusetts","Essex","25009250800","Low-Income Community","2011-2015"]
["Massachusetts","Essex","25009251600","Low-Income Community","2011-2015"]
["Massachusetts","Essex","25009252300","Low-Income Community","2011-2015"]
["Massachusetts","Essex","25009252400","Low-Income Community","2011-2015"]
["Massachusetts","Essex","25009260200","Low-Income Community","2011-2015"]
["Massachusetts","Essex","25009260800","Low-Income Community","2011-2015"]
["Massachusetts","Franklin","25011040100","Low-Income Community","2011-2015"]
["Massachusetts","Franklin","25011040400","Low-Income Community","2011-2015"]
["Massachusetts","Franklin","25011040501","Low-Income Community","2011-2015"]
["Massachusetts","Franklin","25011040502","Low-Income Community","2011-2015"]
["Massachusetts","Franklin","25011040701","Low-Income Community","2011-2015"]
["Massachusetts","Franklin","25011041300","Low-Income Community","2011-2015"]
["Massachusetts","Franklin","25011041400","Low-Income Community","2011-2015"]
["Massachusetts","Hampden","25013800600","Low-Income Community","2011-2015"]
["Massachusetts","Hampden","25013800900","Low-Income Community","2011-2015"]
["Massachusetts","Hampden","25013801101","Low-Income Community","2011-2015"]
["Massachusetts","Hampden","25013801200","Low-Income Community","2011-2015"]
["Massachusetts","Hampden","25013801700","Low-Income Community","2011-2015"]
["Massachusetts","Hampden","25013801800","Low-Income Community","2011-2015"]
["Massachusetts","Hampden","25013801902","Low-Income Community","2011-2015"]
["Massachusetts","Hampden","25013810300","Low-Income Community","2011-2015"]
["Massachusetts","Hampden","25013810403","Low-Income Community","2011-2015"]
["Massachusetts","Hampden","25013810800","Low-Income Community","2011-2015"]
["Massachusetts","Hampden","25013811400","Low-Income Community","2011-2015"]
["Massachusetts","Hampden","25013811700","Low-Income Community","2011-2015"]
["Massachusetts","Hampden","25013812300","Low-Income Community","2011-2015"]
["Massachusetts","Hampden","25013812702","Low-Income Community","2011-2015"]
["Massachusetts","Hampden","25013813207","Low-Income Community","2011-2015"]
["Massachusetts","Hampshire","25015820102","Low-Income Community","2011-2015"]
["Massachusetts","Hampshire","25015820300","Low-Income Community","2011-2015"]
["Massachusetts","Hampshire","25015821100","Low-Income Community","2011-2015"]
["Massachusetts","Hampshire","25015821602","Low-Income Community","2012-2016"]
["Massachusetts","Hampshire","25015821903","Low-Income Community","2011-2015"]
["Massachusetts","Hampshire","25015822402","Low-Income Community","2011-2015"]
["Massachusetts","Middlesex","25017310100","Low-Income Community","2011-2015"]
["Massachusetts","Middlesex","25017311600","Low-Income Community","2011-2015"]
["Massachusetts","Middlesex","25017311700","Low-Income Community","2011-2015"]
["Massachusetts","Middlesex","25017311800","Low-Income Community","2011-2015"]
["Massachusetts","Middlesex","25017311900","Low-Income Community","2011-2015"]
["Massachusetts","Middlesex","25017321200","Low-Income Community","2011-2015"]
["Massachusetts","Middlesex","25017321300","Low-Income Community","2011-2015"]
["Massachusetts","Middlesex","25017339700","Low-Income Community","2011-2015"]
["Massachusetts","Middlesex","25017341200","Low-Income Community","2011-2015"]
["Massachusetts","Middlesex","25017341300","Low-Income Community","2011-2015"]
["Massachusetts","Middlesex","25017342400","Low-Income Community","2011-2015"]
["Massachusetts","Middlesex","25017350103","Low-Income Community","2011-2015"]
["Massachusetts","Middlesex","25017351500","Low-Income Community","2011-2015"]
["Massachusetts","Middlesex","25017354900","Low-Income Community","2011-2015"]
["Massachusetts","Middlesex","25017383101","Low-Income Community","2011-2015"]
["Massachusetts","Middlesex","25017383102","Low-Income Community","2011-2015"]
["Massachusetts","Norfolk","25021417701","Low-Income Community","2011-2015"]
["Massachusetts","Norfolk","25021417901","Low-Income Community","2011-2015"]
["Massachusetts","Norfolk","25021420202","Non-LIC Contiguous","2011-2015"]
["Massachusetts","Norfolk","25021420301","Low-Income Community","2011-2015"]
["Massachusetts","Norfolk","25021422502","Low-Income Community","2011-2015"]
["Massachusetts","Plymouth","25023502200","Low-Income Community","2011-2015"]
["Massachusetts","Plymouth","25023510503","Low-Income Community","2011-2015"]
["Massachusetts","Plymouth","25023510700","Low-Income Community","2011-2015"]
["Massachusetts","Plymouth","25023510900","Low-Income Community","2011-2015"]
["Massachusetts","Plymouth","25023511000","Low-Income Community","2011-2015"]
["Massachusetts","Plymouth","25023545400","Low-Income Community","2011-2015"]
["Massachusetts","Plymouth","25023561200","Low-Income Community","2011-2015"]
["Massachusetts","Suffolk","25025040200","Low-Income Community","2011-2015"]
["Massachusetts","Suffolk","25025040300","Low-Income Community","2011-2015"]
["Massachusetts","Suffolk","25025040801","Low-Income Community","2011-2015"]
["Massachusetts","Suffolk","25025060700","Low-Income Community","2011-2015"]
["Massachusetts","Suffolk","25025061000","Low-Income Community","2011-2015"]
["Massachusetts","Suffolk","25025061101","Low-Income Community","2011-2015"]
["Massachusetts","Suffolk","25025080500","Low-Income Community","2011-2015"]
["Massachusetts","Suffolk","25025080601","Low-Income Community","2011-2015"]
["Massachusetts","Suffolk","25025081200","Low-Income Community","2011-2015"]
["Massachusetts","Suffolk","25025090901","Low-Income Community","2011-2015"]
["Massachusetts","Suffolk","25025160200","Low-Income Community","2011-2015"]
["Massachusetts","Suffolk","25025160400","Low-Income Community","2011-2015"]
["Massachusetts","Suffolk","25025170501","Low-Income Community","2011-2015"]
["Massachusetts","Suffolk","25025170702","Low-Income Community","2011-2015"]
["Massachusetts","Suffolk","25025180500","Low-Income Community","2011-2015"]
["Massachusetts","Suffolk","25025980101","Low-Income Community","2011-2015"]
["Massachusetts","Suffolk","25025980300","Low-Income Community","2011-2015"]
["Massachusetts","Suffolk","25025981100","Low-Income Community","2011-2015"]
["Massachusetts","Worcester","25027703100","Low-Income Community","2011-2015"]
["Massachusetts","Worcester","25027703200","Low-Income Community","2011-2015"]
["Massachusetts","Worcester","25027707200","Low-Income Community","2011-2015"]
["Massachusetts","Worcester","25027707300","Low-Income Community","2011-2015"]
["Massachusetts","Worcester","25027709400","Low-Income Community","2011-2015"]
["Massachusetts","Worcester","25027709600","Low-Income Community","2011-2015"]
["Massachusetts","Worcester","25027710600","Low-Income Community","2011-2015"]
["Massachusetts","Worcester","25027710700","Low-Income Community","2011-2015"]
["Massachusetts","Worcester","25027716200","Low-Income Community","2011-2015"]
["Massachusetts","Worcester","25027716300","Low-Income Community","2012-2016"]
["Massachusetts","Worcester","25027726200","Low-Income Community","2011-2015"]
["Massachusetts","Worcester","25027730500","Low-Income Community","2011-2015"]
["Massachusetts","Worcester","25027731300","Low-Income Community","2011-2015"]
["Massachusetts","Worcester","25027731400","Low-Income Community","2011-2015"]
["Massachusetts","Worcester","25027731700","Low-Income Community","2011-2015"]
["Massachusetts","Worcester","25027732500","Low-Income Community","2011-2015"]
["Massachusetts","Worcester","25027732801","Low-Income Community","2011-2015"]
["Massachusetts","Worcester","25027754200","Low-Income Community","2011-2015"]
["Massachusetts","Worcester","25027757100","Low-Income Community","2011-2015"]
["Massachusetts","Worcester","25027757300","Low-Income Community","2011-2015"]
["Michigan","Alcona","26001970400","Low-Income Community","2011-2015"]
["Michigan","Alger","26003000100","Low-Income Community","2011-2015"]
["Michigan","Allegan","26005032401","Low-Income Community","2011-2015"]
["Michigan","Alpena","26007000400","Low-Income Community","2011-2015"]
["Michigan","Antrim","26009960700","Low-Income Community","2011-2015"]
["Michigan","Arenac","26011970500","Low-Income Community","2011-2015"]
["Michigan","Baraga","26013000100","Low-Income Community","2011-2015"]
["Michigan","Barry","26015011300","Low-Income Community","2011-2015"]
["Michigan","Bay","26017286500","Low-Income Community","2011-2015"]
["Michigan","Bay","26017286600","Low-Income Community","2011-2015"]
["Michigan","Berrien","26021000400","Low-Income Community","2011-2015"]
["Michigan","Berrien","26021002100","Low-Income Community","2011-2015"]
["Michigan","Berrien","26021002500","Low-Income Community","2011-2015"]
["Michigan","Berrien","26021010300","Low-Income Community","2011-2015"]
["Michigan","Berrien","26021020500","Low-Income Community","2011-2015"]
["Michigan","Branch","26023951600","Low-Income Community","2011-2015"]
["Michigan","Calhoun","26025000200","Low-Income Community","2011-2015"]
["Michigan","Calhoun","26025003400","Low-Income Community","2011-2015"]
["Michigan","Calhoun","26025004000","Low-Income Community","2011-2015"]
["Michigan","Calhoun","26025004100","Low-Income Community","2011-2015"]
["Michigan","Cass","26027002100","Low-Income Community","2011-2015"]
["Michigan","Charlevoix","26029001100","Low-Income Community","2011-2015"]
["Michigan","Cheboygan","26031960200","Low-Income Community","2011-2015"]
["Michigan","Chippewa","26033970200","Low-Income Community","2011-2015"]
["Michigan","Chippewa","26033970500","Low-Income Community","2011-2015"]
["Michigan","Clare","26035000600","Low-Income Community","2011-2015"]
["Michigan","Clare","26035001300","Low-Income Community","2011-2015"]
["Michigan","Clinton","26037010801","Low-Income Community","2011-2015"]
["Michigan","Crawford","26039960200","Non-LIC Contiguous","2011-2015"]
["Michigan","Delta","26041970800","Low-Income Community","2011-2015"]
["Michigan","Dickinson","26043950400","Low-Income Community","2011-2015"]
["Michigan","Eaton","26045020901","Low-Income Community","2011-2015"]
["Michigan","Emmet","26047970100","Low-Income Community","2011-2015"]
["Michigan","Genesee","26049000300","Low-Income Community","2011-2015"]
["Michigan","Genesee","26049000500","Low-Income Community","2011-2015"]
["Michigan","Genesee","26049001500","Low-Income Community","2011-2015"]
["Michigan","Genesee","26049001600","Low-Income Community","2011-2015"]
["Michigan","Genesee","26049001700","Low-Income Community","2011-2015"]
["Michigan","Genesee","26049002200","Low-Income Community","2011-2015"]
["Michigan","Genesee","26049002800","Low-Income Community","2011-2015"]
["Michigan","Genesee","26049003700","Low-Income Community","2011-2015"]
["Michigan","Genesee","26049010501","Low-Income Community","2011-2015"]
["Michigan","Genesee","26049010502","Low-Income Community","2011-2015"]
["Michigan","Genesee","26049010912","Low-Income Community","2011-2015"]
["Michigan","Genesee","26049011210","Low-Income Community","2011-2015"]
["Michigan","Genesee","26049011212","Low-Income Community","2011-2015"]
["Michigan","Genesee","26049011508","Low-Income Community","2011-2015"]
["Michigan","Genesee","26049012202","Low-Income Community","2011-2015"]
["Michigan","Genesee","26049013600","Low-Income Community","2011-2015"]
["Michigan","Gladwin","26051000700","Low-Income Community","2011-2015"]
["Michigan","Gladwin","26051000800","Low-Income Community","2011-2015"]
["Michigan","Gogebic","26053950600","Low-Income Community","2011-2015"]
["Michigan","Grand Traverse","26055551300","Low-Income Community","2011-2015"]
["Michigan","Gratiot","26057000500","Low-Income Community","2011-2015"]
["Michigan","Hillsdale","26059050700","Low-Income Community","2011-2015"]
["Michigan","Hillsdale","26059050800","Low-Income Community","2011-2015"]
["Michigan","Houghton","26061000800","Low-Income Community","2011-2015"]
["Michigan","Huron","26063951000","Low-Income Community","2011-2015"]
["Michigan","Ingham","26065003301","Low-Income Community","2011-2015"]
["Michigan","Ingham","26065003602","Low-Income Community","2011-2015"]
["Michigan","Ingham","26065003700","Low-Income Community","2011-2015"]
["Michigan","Ingham","26065004301","Low-Income Community","2011-2015"]
["Michigan","Ingham","26065005100","Low-Income Community","2011-2015"]
["Michigan","Ingham","26065005303","Low-Income Community","2011-2015"]
["Michigan","Ingham","26065005402","Low-Income Community","2011-2015"]
["Michigan","Ingham","26065006600","Low-Income Community","2011-2015"]
["Michigan","Ingham","26065006700","Low-Income Community","2011-2015"]
["Michigan","Ionia","26067031700","Low-Income Community","2011-2015"]
["Michigan","Iosco","26069000400","Low-Income Community","2011-2015"]
["Michigan","Iosco","26069000500","Low-Income Community","2011-2015"]
["Michigan","Iron","26071000300","Low-Income Community","2011-2015"]
["Michigan","Isabella","26073940400","Low-Income Community","2011-2015"]
["Michigan","Isabella","26073940500","Low-Income Community","2011-2015"]
["Michigan","Jackson","26075000600","Low-Income Community","2011-2015"]
["Michigan","Jackson","26075001000","Low-Income Community","2011-2015"]
["Michigan","Jackson","26075001200","Low-Income Community","2011-2015"]
["Michigan","Jackson","26075005500","Low-Income Community","2011-2015"]
["Michigan","Kalamazoo","26077000201","Low-Income Community","2011-2015"]
["Michigan","Kalamazoo","26077000202","Low-Income Community","2011-2015"]
["Michigan","Kalamazoo","26077000900","Low-Income Community","2011-2015"]
["Michigan","Kalamazoo","26077001000","Low-Income Community","2011-2015"]
["Michigan","Kalamazoo","26077001905","Low-Income Community","2011-2015"]
["Michigan","Kalkaska","26079950400","Low-Income Community","2011-2015"]
["Michigan","Kent","26081002600","Low-Income Community","2011-2015"]
["Michigan","Kent","26081002800","Low-Income Community","2011-2015"]
["Michigan","Kent","26081003000","Low-Income Community","2011-2015"]
["Michigan","Kent","26081003200","Low-Income Community","2011-2015"]
["Michigan","Kent","26081003500","Low-Income Community","2011-2015"]
["Michigan","Kent","26081003600","Low-Income Community","2011-2015"]
["Michigan","Kent","26081003700","Low-Income Community","2011-2015"]
["Michigan","Kent","26081003800","Low-Income Community","2011-2015"]
["Michigan","Kent","26081013500","Low-Income Community","2011-2015"]
["Michigan","Kent","26081014200","Low-Income Community","2011-2015"]
["Michigan","Keweenaw","26083000100","Low-Income Community","2011-2015"]
["Michigan","Lake","26085961100","Low-Income Community","2011-2015"]
["Michigan","Lapeer","26087337500","Low-Income Community","2011-2015"]
["Michigan","Lenawee","26091061600","Low-Income Community","2011-2015"]
["Michigan","Livingston","26093722300","Low-Income Community","2011-2015"]
["Michigan","Luce","26095960100","Low-Income Community","2011-2015"]
["Michigan","Mackinac","26097950500","Low-Income Community","2011-2015"]
["Michigan","Macomb","26099230300","Low-Income Community","2011-2015"]
["Michigan","Macomb","26099230500","Low-Income Community","2011-2015"]
["Michigan","Macomb","26099240000","Low-Income Community","2011-2015"]
["Michigan","Macomb","26099241600","Low-Income Community","2011-2015"]
["Michigan","Macomb","26099241700","Low-Income Community","2011-2015"]
["Michigan","Macomb","26099245000","Low-Income Community","2011-2015"]
["Michigan","Macomb","26099256200","Low-Income Community","2011-2015"]
["Michigan","Macomb","26099256300","Low-Income Community","2011-2015"]
["Michigan","Macomb","26099256600","Low-Income Community","2011-2015"]
["Michigan","Macomb","26099256700","Low-Income Community","2011-2015"]
["Michigan","Macomb","26099258300","Low-Income Community","2011-2015"]
["Michigan","Macomb","26099258900","Low-Income Community","2011-2015"]
["Michigan","Macomb","26099262800","Low-Income Community","2011-2015"]
["Michigan","Macomb","26099262900","Low-Income Community","2011-2015"]
["Michigan","Macomb","26099264000","Low-Income Community","2011-2015"]
["Michigan","Macomb","26099268400","Low-Income Community","2011-2015"]
["Michigan","Macomb","26099982200","Low-Income Community","2011-2015"]
["Michigan","Manistee","26101000900","Low-Income Community","2011-2015"]
["Michigan","Marquette","26103000600","Low-Income Community","2011-2015"]
["Michigan","Marquette","26103000700","Low-Income Community","2011-2015"]
["Michigan","Mason","26105950500","Low-Income Community","2011-2015"]
["Michigan","Mecosta","26107960500","Low-Income Community","2011-2015"]
["Michigan","Mecosta","26107960600","Low-Income Community","2011-2015"]
["Michigan","Menominee","26109960200","Low-Income Community","2011-2015"]
["Michigan","Midland","26111290100","Low-Income Community","2011-2015"]
["Michigan","Midland","26111290200","Low-Income Community","2011-2015"]
["Michigan","Missaukee","26113960200","Low-Income Community","2011-2015"]
["Michigan","Monroe","26115831400","Low-Income Community","2011-2015"]
["Michigan","Monroe","26115831800","Low-Income Community","2011-2015"]
["Michigan","Montcalm","26117970800","Low-Income Community","2011-2015"]
["Michigan","Montcalm","26117971200","Low-Income Community","2011-2015"]
["Michigan","Montmorency","26119910200","Low-Income Community","2011-2015"]
["Michigan","Muskegon","26121000800","Low-Income Community","2011-2015"]
["Michigan","Muskegon","26121000900","Low-Income Community","2011-2015"]
["Michigan","Muskegon","26121001300","Low-Income Community","2011-2015"]
["Michigan","Muskegon","26121004200","Low-Income Community","2011-2015"]
["Michigan","Muskegon","26121004300","Low-Income Community","2011-2015"]
["Michigan","Newaygo","26123971200","Low-Income Community","2011-2015"]
["Michigan","Oakland","26125133100","Low-Income Community","2011-2015"]
["Michigan","Oakland","26125141500","Low-Income Community","2011-2015"]
["Michigan","Oakland","26125141600","Low-Income Community","2011-2015"]
["Michigan","Oakland","26125142200","Low-Income Community","2011-2015"]
["Michigan","Oakland","26125142400","Low-Income Community","2011-2015"]
["Michigan","Oakland","26125145900","Low-Income Community","2011-2015"]
["Michigan","Oakland","26125160400","Low-Income Community","2011-2015"]
["Michigan","Oakland","26125160900","Low-Income Community","2011-2015"]
["Michigan","Oakland","26125162200","Low-Income Community","2011-2015"]
["Michigan","Oakland","26125171500","Low-Income Community","2011-2015"]
["Michigan","Oakland","26125173400","Low-Income Community","2011-2015"]
["Michigan","Oakland","26125175000","Low-Income Community","2011-2015"]
["Michigan","Oakland","26125181000","Low-Income Community","2011-2015"]
["Michigan","Oakland","26125194500","Low-Income Community","2011-2015"]
["Michigan","Oakland","26125197600","Low-Income Community","2011-2015"]
["Michigan","Oceana","26127010400","Low-Income Community","2011-2015"]
["Michigan","Ogemaw","26129950100","Low-Income Community","2011-2015"]
["Michigan","Ogemaw","26129950500","Low-Income Community","2011-2015"]
["Michigan","Ontonagon","26131970200","Low-Income Community","2011-2015"]
["Michigan","Osceola","26133970400","Low-Income Community","2011-2015"]
["Michigan","Oscoda","26135970300","Low-Income Community","2011-2015"]
["Michigan","Otsego","26137950300","Low-Income Community","2011-2015"]
["Michigan","Ottawa","26139024900","Low-Income Community","2011-2015"]
["Michigan","Presque Isle","26141950200","Low-Income Community","2011-2015"]
["Michigan","Roscommon","26143970300","Low-Income Community","2011-2015"]
["Michigan","Roscommon","26143971200","Low-Income Community","2011-2015"]
["Michigan","Saginaw","26145000100","Low-Income Community","2011-2015"]
["Michigan","Saginaw","26145000400","Low-Income Community","2011-2015"]
["Michigan","Saginaw","26145000600","Low-Income Community","2011-2015"]
["Michigan","Saginaw","26145001700","Low-Income Community","2011-2015"]
["Michigan","Saginaw","26145001800","Low-Income Community","2011-2015"]
["Michigan","Saginaw","26145010200","Low-Income Community","2011-2015"]
["Michigan","Saginaw","26145011000","Low-Income Community","2011-2015"]
["Michigan","St. Clair","26147620000","Low-Income Community","2011-2015"]
["Michigan","St. Clair","26147624000","Low-Income Community","2011-2015"]
["Michigan","St. Clair","26147625000","Low-Income Community","2011-2015"]
["Michigan","St. Joseph","26149040300","Low-Income Community","2011-2015"]
["Michigan","St. Joseph","26149040700","Low-Income Community","2011-2015"]
["Michigan","Sanilac","26151970400","Low-Income Community","2011-2015"]
["Michigan","Schoolcraft","26153000300","Low-Income Community","2011-2015"]
["Michigan","Shiawassee","26155030600","Low-Income Community","2011-2015"]
["Michigan","Tuscola","26157000600","Low-Income Community","2011-2015"]
["Michigan","Van Buren","26159011300","Low-Income Community","2011-2015"]
["Michigan","Van Buren","26159011800","Low-Income Community","2011-2015"]
["Michigan","Washtenaw","26161405600","Low-Income Community","2011-2015"]
["Michigan","Washtenaw","26161410300","Low-Income Community","2011-2015"]
["Michigan","Washtenaw","26161410500","Low-Income Community","2011-2015"]
["Michigan","Washtenaw","26161410600","Low-Income Community","2011-2015"]
["Michigan","Washtenaw","26161410800","Low-Income Community","2011-2015"]
["Michigan","Washtenaw","26161411700","Low-Income Community","2011-2015"]
["Michigan","Washtenaw","26161411900","Low-Income Community","2011-2015"]
["Michigan","Washtenaw","26161412000","Low-Income Community","2011-2015"]
["Michigan","Washtenaw","26161414000","Low-Income Community","2011-2015"]
["Michigan","Washtenaw","26161446200","Low-Income Community","2011-2015"]
["Michigan","Washtenaw","26161984000","Low-Income Community","2011-2015"]
["Michigan","Wayne","26163501400","Low-Income Community","2011-2015"]
["Michigan","Wayne","26163501800","Low-Income Community","2011-2015"]
["Michigan","Wayne","26163504700","Low-Income Community","2011-2015"]
["Michigan","Wayne","26163504800","Low-Income Community","2011-2015"]
["Michigan","Wayne","26163505500","Low-Income Community","2011-2015"]
["Michigan","Wayne","26163508000","Low-Income Community","2011-2015"]
["Michigan","Wayne","26163510500","Low-Income Community","2011-2015"]
["Michigan","Wayne","26163511000","Low-Income Community","2011-2015"]
["Michigan","Wayne","26163511200","Low-Income Community","2011-2015"]
["Michigan","Wayne","26163511900","Low-Income Community","2011-2015"]
["Michigan","Wayne","26163512900","Low-Income Community","2011-2015"]
["Michigan","Wayne","26163513200","Low-Income Community","2011-2015"]
["Michigan","Wayne","26163513700","Low-Income Community","2011-2015"]
["Michigan","Wayne","26163515200","Low-Income Community","2011-2015"]
["Michigan","Wayne","26163515300","Low-Income Community","2011-2015"]
["Michigan","Wayne","26163515400","Low-Income Community","2011-2015"]
["Michigan","Wayne","26163515600","Low-Income Community","2011-2015"]
["Michigan","Wayne","26163515700","Non-LIC Contiguous","2011-2015"]
["Michigan","Wayne","26163516100","Low-Income Community","2011-2015"]
["Michigan","Wayne","26163516200","Low-Income Community","2011-2015"]
["Michigan","Wayne","26163516400","Low-Income Community","2011-2015"]
["Michigan","Wayne","26163516500","Low-Income Community","2011-2015"]
["Michigan","Wayne","26163516600","Low-Income Community","2011-2015"]
["Michigan","Wayne","26163516900","Low-Income Community","2011-2015"]
["Michigan","Wayne","26163517000","Non-LIC Contiguous","2011-2015"]
["Michigan","Wayne","26163517100","Low-Income Community","2011-2015"]
["Michigan","Wayne","26163517200","Low-Income Community","2011-2015"]
["Michigan","Wayne","26163517300","Low-Income Community","2011-2015"]
["Michigan","Wayne","26163517500","Low-Income Community","2011-2015"]
["Michigan","Wayne","26163518000","Low-Income Community","2011-2015"]
["Michigan","Wayne","26163518400","Low-Income Community","2011-2015"]
["Michigan","Wayne","26163518800","Low-Income Community","2011-2015"]
["Michigan","Wayne","26163518900","Low-Income Community","2011-2015"]
["Michigan","Wayne","26163520200","Low-Income Community","2011-2015"]
["Michigan","Wayne","26163520300","Low-Income Community","2011-2015"]
["Michigan","Wayne","26163520400","Low-Income Community","2011-2015"]
["Michigan","Wayne","26163520700","Low-Income Community","2011-2015"]
["Michigan","Wayne","26163520800","Low-Income Community","2011-2015"]
["Michigan","Wayne","26163521100","Low-Income Community","2011-2015"]
["Michigan","Wayne","26163521400","Low-Income Community","2011-2015"]
["Michigan","Wayne","26163521500","Low-Income Community","2011-2015"]
["Michigan","Wayne","26163522400","Low-Income Community","2011-2015"]
["Michigan","Wayne","26163522500","Low-Income Community","2011-2015"]
["Michigan","Wayne","26163523100","Low-Income Community","2011-2015"]
["Michigan","Wayne","26163523300","Low-Income Community","2011-2015"]
["Michigan","Wayne","26163523400","Low-Income Community","2011-2015"]
["Michigan","Wayne","26163524000","Low-Income Community","2011-2015"]
["Michigan","Wayne","26163524900","Low-Income Community","2011-2015"]
["Michigan","Wayne","26163525000","Low-Income Community","2011-2015"]
["Michigan","Wayne","26163527300","Low-Income Community","2011-2015"]
["Michigan","Wayne","26163530300","Low-Income Community","2011-2015"]
["Michigan","Wayne","26163532400","Low-Income Community","2011-2015"]
["Michigan","Wayne","26163532600","Low-Income Community","2011-2015"]
["Michigan","Wayne","26163532700","Low-Income Community","2011-2015"]
["Michigan","Wayne","26163533900","Low-Income Community","2011-2015"]
["Michigan","Wayne","26163535300","Low-Income Community","2011-2015"]
["Michigan","Wayne","26163536100","Low-Income Community","2011-2015"]
["Michigan","Wayne","26163538500","Low-Income Community","2011-2015"]
["Michigan","Wayne","26163538600","Low-Income Community","2011-2015"]
["Michigan","Wayne","26163538900","Non-LIC Contiguous","2011-2015"]
["Michigan","Wayne","26163541200","Low-Income Community","2011-2015"]
["Michigan","Wayne","26163541400","Low-Income Community","2011-2015"]
["Michigan","Wayne","26163542700","Low-Income Community","2011-2015"]
["Michigan","Wayne","26163542900","Non-LIC Contiguous","2011-2015"]
["Michigan","Wayne","26163543000","Low-Income Community","2011-2015"]
["Michigan","Wayne","26163543400","Low-Income Community","2011-2015"]
["Michigan","Wayne","26163546900","Low-Income Community","2011-2015"]
["Michigan","Wayne","26163552300","Low-Income Community","2011-2015"]
["Michigan","Wayne","26163553600","Low-Income Community","2011-2015"]
["Michigan","Wayne","26163554100","Low-Income Community","2011-2015"]
["Michigan","Wayne","26163555100","Low-Income Community","2011-2015"]
["Michigan","Wayne","26163555300","Low-Income Community","2011-2015"]
["Michigan","Wayne","26163565300","Low-Income Community","2011-2015"]
["Michigan","Wayne","26163566500","Low-Income Community","2011-2015"]
["Michigan","Wayne","26163568800","Low-Income Community","2011-2015"]
["Michigan","Wayne","26163570400","Low-Income Community","2011-2015"]
["Michigan","Wayne","26163571600","Low-Income Community","2011-2015"]
["Michigan","Wayne","26163572100","Low-Income Community","2011-2015"]
["Michigan","Wayne","26163572600","Low-Income Community","2011-2015"]
["Michigan","Wayne","26163573400","Low-Income Community","2011-2015"]
["Michigan","Wayne","26163573500","Low-Income Community","2011-2015"]
["Michigan","Wayne","26163574100","Low-Income Community","2011-2015"]
["Michigan","Wayne","26163577000","Low-Income Community","2011-2015"]
["Michigan","Wayne","26163577500","Low-Income Community","2011-2015"]
["Michigan","Wayne","26163579100","Low-Income Community","2011-2015"]
["Michigan","Wayne","26163583000","Low-Income Community","2011-2015"]
["Michigan","Wayne","26163583200","Low-Income Community","2011-2015"]
["Michigan","Wayne","26163584500","Low-Income Community","2011-2015"]
["Michigan","Wayne","26163585900","Low-Income Community","2011-2015"]
["Michigan","Wayne","26163586200","Low-Income Community","2011-2015"]
["Michigan","Wayne","26163588100","Low-Income Community","2011-2015"]
["Michigan","Wayne","26163985100","Low-Income Community","2011-2015"]
["Michigan","Wayne","26163985300","Low-Income Community","2011-2015"]
["Michigan","Wayne","26163985900","Low-Income Community","2011-2015"]
["Michigan","Wexford","26165380700","Low-Income Community","2011-2015"]
["Minnesota","Aitkin","27001770300","Low-Income Community","2011-2015"]
["Minnesota","Aitkin","27001770400","Low-Income Community","2011-2015"]
["Minnesota","Anoka","27003050402","Low-Income Community","2011-2015"]
["Minnesota","Anoka","27003050606","Low-Income Community","2011-2015"]
["Minnesota","Anoka","27003051501","Low-Income Community","2011-2015"]
["Minnesota","Becker","27005450500","Low-Income Community","2011-2015"]
["Minnesota","Beltrami","27007450702","Low-Income Community","2011-2015"]
["Minnesota","Beltrami","27007940001","Low-Income Community","2011-2015"]
["Minnesota","Benton","27009021200","Low-Income Community","2011-2015"]
["Minnesota","Big Stone","27011950300","Low-Income Community","2011-2015"]
["Minnesota","Blue Earth","27013170300","Low-Income Community","2011-2015"]
["Minnesota","Blue Earth","27013170700","Low-Income Community","2011-2015"]
["Minnesota","Carlton","27017940000","Low-Income Community","2011-2015"]
["Minnesota","Cass","27021940002","Low-Income Community","2011-2015"]
["Minnesota","Chippewa","27023950600","Low-Income Community","2011-2015"]
["Minnesota","Chisago","27025110301","Low-Income Community","2011-2015"]
["Minnesota","Clay","27027020300","Low-Income Community","2011-2015"]
["Minnesota","Clearwater","27029000100","Low-Income Community","2011-2015"]
["Minnesota","Cook","27031480100","Low-Income Community","2011-2015"]
["Minnesota","Cottonwood","27033270400","Low-Income Community","2011-2015"]
["Minnesota","Crow Wing","27035951100","Low-Income Community","2011-2015"]
["Minnesota","Crow Wing","27035951200","Low-Income Community","2011-2015"]
["Minnesota","Dakota","27037060104","Low-Income Community","2011-2015"]
["Minnesota","Dakota","27037060105","Low-Income Community","2011-2015"]
["Minnesota","Dakota","27037060301","Low-Income Community","2011-2015"]
["Minnesota","Douglas","27041450600","Low-Income Community","2011-2015"]
["Minnesota","Faribault","27043460400","Low-Income Community","2011-2015"]
["Minnesota","Fillmore","27045960500","Low-Income Community","2011-2015"]
["Minnesota","Freeborn","27047180600","Low-Income Community","2011-2015"]
["Minnesota","Goodhue","27049080200","Low-Income Community","2011-2015"]
["Minnesota","Hennepin","27053005902","Low-Income Community","2011-2015"]
["Minnesota","Hennepin","27053007700","Low-Income Community","2011-2015"]
["Minnesota","Hennepin","27053009500","Low-Income Community","2011-2015"]
["Minnesota","Hennepin","27053020200","Low-Income Community","2011-2015"]
["Minnesota","Hennepin","27053020804","Low-Income Community","2011-2015"]
["Minnesota","Hennepin","27053021300","Low-Income Community","2011-2015"]
["Minnesota","Hennepin","27053023400","Low-Income Community","2011-2015"]
["Minnesota","Hennepin","27053025100","Low-Income Community","2011-2015"]
["Minnesota","Hennepin","27053026810","Low-Income Community","2011-2015"]
["Minnesota","Hennepin","27053100400","Low-Income Community","2011-2015"]
["Minnesota","Hennepin","27053100500","Low-Income Community","2011-2015"]
["Minnesota","Hennepin","27053100900","Low-Income Community","2011-2015"]
["Minnesota","Hennepin","27053102100","Low-Income Community","2011-2015"]
["Minnesota","Hennepin","27053102800","Low-Income Community","2011-2015"]
["Minnesota","Hennepin","27053102900","Low-Income Community","2011-2015"]
["Minnesota","Hennepin","27053103400","Low-Income Community","2011-2015"]
["Minnesota","Hennepin","27053104000","Low-Income Community","2011-2015"]
["Minnesota","Hennepin","27053104100","Low-Income Community","2011-2015"]
["Minnesota","Hennepin","27053104800","Low-Income Community","2011-2015"]
["Minnesota","Hennepin","27053106000","Low-Income Community","2011-2015"]
["Minnesota","Hennepin","27053106200","Low-Income Community","2011-2015"]
["Minnesota","Hennepin","27053107400","Low-Income Community","2011-2015"]
["Minnesota","Hennepin","27053125800","Low-Income Community","2011-2015"]
["Minnesota","Hennepin","27053125900","Low-Income Community","2011-2015"]
["Minnesota","Hennepin","27053126000","Low-Income Community","2011-2015"]
["Minnesota","Hubbard","27057070600","Low-Income Community","2011-2015"]
["Minnesota","Isanti","27059130301","Low-Income Community","2011-2015"]
["Minnesota","Itasca","27061480300","Low-Income Community","2011-2015"]
["Minnesota","Itasca","27061480500","Low-Income Community","2011-2015"]
["Minnesota","Jackson","27063480400","Low-Income Community","2011-2015"]
["Minnesota","Kanabec","27065480300","Low-Income Community","2011-2015"]
["Minnesota","Kandiyohi","27067780800","Low-Income Community","2011-2015"]
["Minnesota","Koochiching","27071790100","Low-Income Community","2011-2015"]
["Minnesota","Lake","27075370300","Low-Income Community","2011-2015"]
["Minnesota","Lake of the Woods","27077460300","Low-Income Community","2011-2015"]
["Minnesota","Lyon","27083360500","Low-Income Community","2011-2015"]
["Minnesota","Mahnomen","27087940100","Low-Income Community","2011-2015"]
["Minnesota","Martin","27091790600","Low-Income Community","2011-2015"]
["Minnesota","Meeker","27093560300","Low-Income Community","2011-2015"]
["Minnesota","Mille Lacs","27095170500","Low-Income Community","2011-2015"]
["Minnesota","Mille Lacs","27095970100","Low-Income Community","2011-2015"]
["Minnesota","Mille Lacs","27095970200","Low-Income Community","2011-2015"]
["Minnesota","Morrison","27097780600","Low-Income Community","2011-2015"]
["Minnesota","Mower","27099000410","Low-Income Community","2011-2015"]
["Minnesota","Nobles","27105105400","Low-Income Community","2011-2015"]
["Minnesota","Olmsted","27109000100","Low-Income Community","2011-2015"]
["Minnesota","Olmsted","27109000600","Low-Income Community","2011-2015"]
["Minnesota","Otter Tail","27111960300","Low-Income Community","2011-2015"]
["Minnesota","Pennington","27113090200","Low-Income Community","2011-2015"]
["Minnesota","Pennington","27113090400","Low-Income Community","2011-2015"]
["Minnesota","Pine","27115950400","Low-Income Community","2011-2015"]
["Minnesota","Pine","27115950500","Low-Income Community","2011-2015"]
["Minnesota","Pine","27115950700","Low-Income Community","2011-2015"]
["Minnesota","Pipestone","27117460200","Low-Income Community","2011-2015"]
["Minnesota","Polk","27119021000","Low-Income Community","2011-2015"]
["Minnesota","Ramsey","27123030400","Low-Income Community","2011-2015"]
["Minnesota","Ramsey","27123030500","Low-Income Community","2011-2015"]
["Minnesota","Ramsey","27123031500","Low-Income Community","2011-2015"]
["Minnesota","Ramsey","27123031600","Low-Income Community","2011-2015"]
["Minnesota","Ramsey","27123031701","Low-Income Community","2011-2015"]
["Minnesota","Ramsey","27123031702","Low-Income Community","2011-2015"]
["Minnesota","Ramsey","27123031900","Low-Income Community","2011-2015"]
["Minnesota","Ramsey","27123032100","Low-Income Community","2011-2015"]
["Minnesota","Ramsey","27123032500","Low-Income Community","2011-2015"]
["Minnesota","Ramsey","27123032700","Low-Income Community","2011-2015"]
["Minnesota","Ramsey","27123033100","Low-Income Community","2011-2015"]
["Minnesota","Ramsey","27123033400","Low-Income Community","2011-2015"]
["Minnesota","Ramsey","27123033500","Low-Income Community","2011-2015"]
["Minnesota","Ramsey","27123033700","Low-Income Community","2011-2015"]
["Minnesota","Ramsey","27123034201","Low-Income Community","2011-2015"]
["Minnesota","Ramsey","27123034701","Low-Income Community","2011-2015"]
["Minnesota","Ramsey","27123036000","Non-LIC Contiguous","2011-2015"]
["Minnesota","Ramsey","27123037100","Low-Income Community","2011-2015"]
["Minnesota","Ramsey","27123041602","Low-Income Community","2011-2015"]
["Minnesota","Redwood","27127750300","Low-Income Community","2011-2015"]
["Minnesota","Renville","27129790500","Low-Income Community","2011-2015"]
["Minnesota","Rice","27131070700","Low-Income Community","2011-2015"]
["Minnesota","Rock","27133570300","Low-Income Community","2011-2015"]
["Minnesota","St. Louis","27137001700","Low-Income Community","2011-2015"]
["Minnesota","St. Louis","27137001900","Low-Income Community","2011-2015"]
["Minnesota","St. Louis","27137002000","Low-Income Community","2011-2015"]
["Minnesota","St. Louis","27137012400","Low-Income Community","2011-2015"]
["Minnesota","St. Louis","27137013100","Low-Income Community","2011-2015"]
["Minnesota","St. Louis","27137015300","Low-Income Community","2011-2015"]
["Minnesota","St. Louis","27137015500","Low-Income Community","2011-2015"]
["Minnesota","St. Louis","27137015600","Low-Income Community","2011-2015"]
["Minnesota","St. Louis","27137015800","Low-Income Community","2011-2015"]
["Minnesota","Sherburne","27141031500","Low-Income Community","2011-2015"]
["Minnesota","Stearns","27145011600","Low-Income Community","2011-2015"]
["Minnesota","Steele","27147960400","Low-Income Community","2011-2015"]
["Minnesota","Stevens","27149480200","Low-Income Community","2011-2015"]
["Minnesota","Swift","27151960400","Low-Income Community","2011-2015"]
["Minnesota","Todd","27153790600","Low-Income Community","2011-2015"]
["Minnesota","Wabasha","27157490300","Low-Income Community","2011-2015"]
["Minnesota","Wadena","27159480300","Low-Income Community","2011-2015"]
["Minnesota","Waseca","27161790500","Low-Income Community","2011-2015"]
["Minnesota","Winona","27169670500","Low-Income Community","2011-2015"]
["Minnesota","Yellow Medicine","27173970100","Low-Income Community","2011-2015"]
["Mississippi","Adams","28001000200","Low-Income Community","2011-2015"]
["Mississippi","Adams","28001000700","Low-Income Community","2011-2015"]
["Mississippi","Adams","28001000800","Low-Income Community","2011-2015"]
["Mississippi","Alcorn","28003950500","Low-Income Community","2011-2015"]
["Mississippi","Alcorn","28003950600","Low-Income Community","2011-2015"]
["Mississippi","Attala","28007060600","Low-Income Community","2011-2015"]
["Mississippi","Bolivar","28011950701","Low-Income Community","2011-2015"]
["Mississippi","Chickasaw","28017950300","Low-Income Community","2011-2015"]
["Mississippi","Choctaw","28019950200","Low-Income Community","2011-2015"]
["Mississippi","Claiborne","28021950300","Low-Income Community","2011-2015"]
["Mississippi","Coahoma","28027950300","Low-Income Community","2011-2015"]
["Mississippi","Covington","28031950200","Low-Income Community","2011-2015"]
["Mississippi","DeSoto","28033070101","Low-Income Community","2011-2015"]
["Mississippi","DeSoto","28033070610","Low-Income Community","2011-2015"]
["Mississippi","Forrest","28035000600","Low-Income Community","2011-2015"]
["Mississippi","Forrest","28035000800","Low-Income Community","2011-2015"]
["Mississippi","Forrest","28035010200","Low-Income Community","2011-2015"]
["Mississippi","Forrest","28035010500","Low-Income Community","2011-2015"]
["Mississippi","Forrest","28035010600","Low-Income Community","2011-2015"]
["Mississippi","Forrest","28035010700","Low-Income Community","2011-2015"]
["Mississippi","Hancock","28045030100","Low-Income Community","2011-2015"]
["Mississippi","Hancock","28045030300","Low-Income Community","2011-2015"]
["Mississippi","Harrison","28047000100","Low-Income Community","2011-2015"]
["Mississippi","Harrison","28047001400","Low-Income Community","2011-2015"]
["Mississippi","Harrison","28047003206","Low-Income Community","2011-2015"]
["Mississippi","Harrison","28047003301","Non-LIC Contiguous","2011-2015"]
["Mississippi","Harrison","28047003404","Non-LIC Contiguous","2011-2015"]
["Mississippi","Harrison","28047003600","Low-Income Community","2011-2015"]
["Mississippi","Harrison","28047003800","Low-Income Community","2012-2016"]
["Mississippi","Harrison","28047003900","Low-Income Community","2011-2015"]
["Mississippi","Hinds","28049001100","Low-Income Community","2011-2015"]
["Mississippi","Hinds","28049001300","Low-Income Community","2011-2015"]
["Mississippi","Hinds","28049001600","Low-Income Community","2011-2015"]
["Mississippi","Hinds","28049002100","Low-Income Community","2011-2015"]
["Mississippi","Hinds","28049002700","Low-Income Community","2011-2015"]
["Mississippi","Hinds","28049003000","Low-Income Community","2011-2015"]
["Mississippi","Hinds","28049010500","Low-Income Community","2011-2015"]
["Mississippi","Hinds","28049010902","Low-Income Community","2011-2015"]
["Mississippi","Hinds","28049011001","Low-Income Community","2011-2015"]
["Mississippi","Hinds","28049011500","Low-Income Community","2011-2015"]
["Mississippi","Jackson","28059041300","Low-Income Community","2011-2015"]
["Mississippi","Jackson","28059042900","Low-Income Community","2011-2015"]
["Mississippi","Jones","28067950500","Low-Income Community","2011-2015"]
["Mississippi","Jones","28067950600","Low-Income Community","2011-2015"]
["Mississippi","Lafayette","28071950201","Low-Income Community","2011-2015"]
["Mississippi","Lafayette","28071950202","Low-Income Community","2011-2015"]
["Mississippi","Lafayette","28071950401","Low-Income Community","2011-2015"]
["Mississippi","Lamar","28073020600","Low-Income Community","2011-2015"]
["Mississippi","Lauderdale","28075000700","Low-Income Community","2011-2015"]
["Mississippi","Lauderdale","28075010700","Low-Income Community","2011-2015"]
["Mississippi","Lee","28081950401","Low-Income Community","2011-2015"]
["Mississippi","Lee","28081950500","Low-Income Community","2011-2015"]
["Mississippi","Lee","28081950602","Low-Income Community","2011-2015"]
["Mississippi","Lee","28081950700","Low-Income Community","2011-2015"]
["Mississippi","Lee","28081951002","Low-Income Community","2011-2015"]
["Mississippi","Leflore","28083950400","Low-Income Community","2011-2015"]
["Mississippi","Leflore","28083950800","Low-Income Community","2011-2015"]
["Mississippi","Lincoln","28085950200","Low-Income Community","2011-2015"]
["Mississippi","Lincoln","28085950600","Low-Income Community","2011-2015"]
["Mississippi","Lowndes","28087000900","Low-Income Community","2011-2015"]
["Mississippi","Lowndes","28087001000","Non-LIC Contiguous","2011-2015"]
["Mississippi","Madison","28089030106","Low-Income Community","2011-2015"]
["Mississippi","Madison","28089030500","Low-Income Community","2011-2015"]
["Mississippi","Madison","28089030600","Low-Income Community","2011-2015"]
["Mississippi","Marion","28091950200","Low-Income Community","2011-2015"]
["Mississippi","Marion","28091950400","Low-Income Community","2011-2015"]
["Mississippi","Marion","28091950500","Low-Income Community","2011-2015"]
["Mississippi","Marshall","28093950100","Non-LIC Contiguous","2011-2015"]
["Mississippi","Marshall","28093950300","Low-Income Community","2011-2015"]
["Mississippi","Monroe","28095950400","Low-Income Community","2011-2015"]
["Mississippi","Neshoba","28099940100","Low-Income Community","2011-2015"]
["Mississippi","Oktibbeha","28105950100","Low-Income Community","2011-2015"]
["Mississippi","Oktibbeha","28105950500","Low-Income Community","2011-2015"]
["Mississippi","Oktibbeha","28105950602","Low-Income Community","2011-2015"]
["Mississippi","Panola","28107950300","Low-Income Community","2011-2015"]
["Mississippi","Pearl River","28109950600","Low-Income Community","2011-2015"]
["Mississippi","Pike","28113950500","Low-Income Community","2011-2015"]
["Mississippi","Pike","28113950600","Low-Income Community","2011-2015"]
["Mississippi","Pike","28113950700","Low-Income Community","2011-2015"]
["Mississippi","Rankin","28121020207","Non-LIC Contiguous","2011-2015"]
["Mississippi","Rankin","28121020401","Low-Income Community","2011-2015"]
["Mississippi","Rankin","28121020701","Low-Income Community","2011-2015"]
["Mississippi","Simpson","28127950200","Low-Income Community","2011-2015"]
["Mississippi","Simpson","28127950500","Low-Income Community","2011-2015"]
["Mississippi","Sunflower","28133950300","Low-Income Community","2011-2015"]
["Mississippi","Sunflower","28133950402","Low-Income Community","2011-2015"]
["Mississippi","Sunflower","28133950500","Low-Income Community","2011-2015"]
["Mississippi","Sunflower","28133950600","Low-Income Community","2011-2015"]
["Mississippi","Tate","28137950400","Low-Income Community","2011-2015"]
["Mississippi","Tishomingo","28141950300","Low-Income Community","2011-2015"]
["Mississippi","Tunica","28143950100","Low-Income Community","2011-2015"]
["Mississippi","Union","28145950500","Low-Income Community","2011-2015"]
["Mississippi","Warren","28149950100","Low-Income Community","2012-2016"]
["Mississippi","Warren","28149950300","Low-Income Community","2011-2015"]
["Mississippi","Warren","28149950500","Low-Income Community","2011-2015"]
["Mississippi","Washington","28151000300","Low-Income Community","2011-2015"]
["Mississippi","Washington","28151000600","Low-Income Community","2011-2015"]
["Mississippi","Wayne","28153950200","Low-Income Community","2011-2015"]
["Mississippi","Winston","28159950300","Low-Income Community","2011-2015"]
["Mississippi","Winston","28159950400","Low-Income Community","2011-2015"]
["Missouri","Adair","29001950300","Low-Income Community","2011-2015"]
["Missouri","Adair","29001950400","Non-LIC Contiguous","2011-2015"]
["Missouri","Adair","29001950500","Low-Income Community","2011-2015"]
["Missouri","Adair","29001950900","Low-Income Community","2011-2015"]
["Missouri","Audrain","29007950400","Low-Income Community","2011-2015"]
["Missouri","Barry","29009960300","Low-Income Community","2011-2015"]
["Missouri","Benton","29015460300","Low-Income Community","2011-2015"]
["Missouri","Benton","29015460700","Low-Income Community","2011-2015"]
["Missouri","Boone","29019001502","Low-Income Community","2011-2015"]
["Missouri","Buchanan","29021001200","Low-Income Community","2011-2015"]
["Missouri","Buchanan","29021003000","Low-Income Community","2011-2015"]
["Missouri","Butler","29023950400","Low-Income Community","2011-2015"]
["Missouri","Butler","29023950500","Low-Income Community","2011-2015"]
["Missouri","Butler","29023950800","Low-Income Community","2011-2015"]
["Missouri","Caldwell","29025950200","Low-Income Community","2011-2015"]
["Missouri","Camden","29029951200","Low-Income Community","2011-2015"]
["Missouri","Cape Girardeau","29031881400","Low-Income Community","2011-2015"]
["Missouri","Cape Girardeau","29031881600","Low-Income Community","2011-2015"]
["Missouri","Clay","29047021701","Low-Income Community","2011-2015"]
["Missouri","Clay","29047021702","Low-Income Community","2011-2015"]
["Missouri","Clay","29047022100","Low-Income Community","2011-2015"]
["Missouri","Cole","29051010500","Low-Income Community","2011-2015"]
["Missouri","Cole","29051010600","Low-Income Community","2011-2015"]
["Missouri","Cole","29051020700","Low-Income Community","2011-2015"]
["Missouri","Dallas","29059480200","Low-Income Community","2011-2015"]
["Missouri","Dunklin","29069360500","Low-Income Community","2011-2015"]
["Missouri","Dunklin","29069360600","Low-Income Community","2011-2015"]
["Missouri","Greene","29077000100","Low-Income Community","2011-2015"]
["Missouri","Greene","29077000600","Low-Income Community","2011-2015"]
["Missouri","Greene","29077000700","Low-Income Community","2011-2015"]
["Missouri","Greene","29077001200","Non-LIC Contiguous","2011-2015"]
["Missouri","Greene","29077001500","Low-Income Community","2011-2015"]
["Missouri","Greene","29077002200","Low-Income Community","2011-2015"]
["Missouri","Greene","29077003600","Low-Income Community","2011-2015"]
["Missouri","Greene","29077004302","Non-LIC Contiguous","2011-2015"]
["Missouri","Greene","29077004400","Low-Income Community","2011-2015"]
["Missouri","Greene","29077005600","Low-Income Community","2011-2015"]
["Missouri","Howell","29091090300","Low-Income Community","2011-2015"]
["Missouri","Howell","29091090700","Low-Income Community","2011-2015"]
["Missouri","Jackson","29095000900","Low-Income Community","2011-2015"]
["Missouri","Jackson","29095001000","Low-Income Community","2011-2015"]
["Missouri","Jackson","29095001800","Low-Income Community","2011-2015"]
["Missouri","Jackson","29095001900","Low-Income Community","2011-2015"]
["Missouri","Jackson","29095002100","Low-Income Community","2011-2015"]
["Missouri","Jackson","29095003700","Low-Income Community","2011-2015"]
["Missouri","Jackson","29095003800","Low-Income Community","2011-2015"]
["Missouri","Jackson","29095004300","Low-Income Community","2011-2015"]
["Missouri","Jackson","29095005200","Low-Income Community","2011-2015"]
["Missouri","Jackson","29095005400","Low-Income Community","2011-2015"]
["Missouri","Jackson","29095005500","Low-Income Community","2011-2015"]
["Missouri","Jackson","29095005601","Low-Income Community","2011-2015"]
["Missouri","Jackson","29095005602","Low-Income Community","2011-2015"]
["Missouri","Jackson","29095006100","Low-Income Community","2011-2015"]
["Missouri","Jackson","29095006300","Low-Income Community","2011-2015"]
["Missouri","Jackson","29095007700","Low-Income Community","2011-2015"]
["Missouri","Jackson","29095007802","Low-Income Community","2011-2015"]
["Missouri","Jackson","29095008000","Low-Income Community","2011-2015"]
["Missouri","Jackson","29095011000","Low-Income Community","2011-2015"]
["Missouri","Jackson","29095011100","Low-Income Community","2011-2015"]
["Missouri","Jackson","29095011200","Low-Income Community","2011-2015"]
["Missouri","Jackson","29095011600","Low-Income Community","2011-2015"]
["Missouri","Jackson","29095011700","Low-Income Community","2011-2015"]
["Missouri","Jackson","29095011800","Low-Income Community","2011-2015"]
["Missouri","Jackson","29095012501","Low-Income Community","2011-2015"]
["Missouri","Jackson","29095012600","Low-Income Community","2011-2015"]
["Missouri","Jackson","29095013401","Low-Income Community","2011-2015"]
["Missouri","Jackson","29095013405","Low-Income Community","2011-2015"]
["Missouri","Jackson","29095015100","Non-LIC Contiguous","2011-2015"]
["Missouri","Jackson","29095015300","Low-Income Community","2011-2015"]
["Missouri","Jackson","29095015400","Low-Income Community","2011-2015"]
["Missouri","Jackson","29095015500","Low-Income Community","2011-2015"]
["Missouri","Jackson","29095015600","Low-Income Community","2011-2015"]
["Missouri","Jackson","29095015900","Low-Income Community","2011-2015"]
["Missouri","Jackson","29095016000","Low-Income Community","2011-2015"]
["Missouri","Jackson","29095016100","Low-Income Community","2011-2015"]
["Missouri","Jackson","29095016200","Low-Income Community","2011-2015"]
["Missouri","Jackson","29095016300","Low-Income Community","2011-2015"]
["Missouri","Jackson","29095016600","Low-Income Community","2011-2015"]
["Missouri","Jackson","29095016900","Low-Income Community","2011-2015"]
["Missouri","Jackson","29095017200","Low-Income Community","2011-2015"]
["Missouri","Jackson","29095017400","Low-Income Community","2011-2015"]
["Missouri","Jasper","29097010100","Low-Income Community","2011-2015"]
["Missouri","Johnson","29101960400","Low-Income Community","2011-2015"]
["Missouri","Johnson","29101960600","Low-Income Community","2011-2015"]
["Missouri","Laclede","29105960100","Low-Income Community","2011-2015"]
["Missouri","Laclede","29105960400","Low-Income Community","2011-2015"]
["Missouri","Laclede","29105960500","Low-Income Community","2011-2015"]
["Missouri","Laclede","29105960600","Low-Income Community","2011-2015"]
["Missouri","Lafayette","29107090100","Low-Income Community","2011-2015"]
["Missouri","Lafayette","29107090300","Low-Income Community","2011-2015"]
["Missouri","Marion","29127960800","Low-Income Community","2011-2015"]
["Missouri","Montgomery","29139970200","Low-Income Community","2011-2015"]
["Missouri","Montgomery","29139970300","Non-LIC Contiguous","2011-2015"]
["Missouri","New Madrid","29143960100","Non-LIC Contiguous","2011-2015"]
["Missouri","New Madrid","29143960200","Low-Income Community","2011-2015"]
["Missouri","New Madrid","29143960300","Low-Income Community","2011-2015"]
["Missouri","New Madrid","29143960400","Low-Income Community","2011-2015"]
["Missouri","New Madrid","29143960600","Low-Income Community","2011-2015"]
["Missouri","Newton","29145020200","Non-LIC Contiguous","2011-2015"]
["Missouri","Newton","29145020800","Low-Income Community","2011-2015"]
["Missouri","Nodaway","29147470300","Low-Income Community","2011-2015"]
["Missouri","Nodaway","29147470400","Low-Income Community","2011-2015"]
["Missouri","Pemiscot","29155470400","Low-Income Community","2011-2015"]
["Missouri","Polk","29167960100","Low-Income Community","2011-2015"]
["Missouri","Polk","29167960400","Non-LIC Contiguous","2011-2015"]
["Missouri","Pulaski","29169470101","Low-Income Community","2011-2015"]
["Missouri","Pulaski","29169470102","Low-Income Community","2011-2015"]
["Missouri","Randolph","29175490300","Low-Income Community","2011-2015"]
["Missouri","Ripley","29181870300","Low-Income Community","2011-2015"]
["Missouri","St. Louis","29189211402","Low-Income Community","2011-2015"]
["Missouri","St. Louis","29189211500","Low-Income Community","2011-2015"]
["Missouri","St. Louis","29189212001","Low-Income Community","2011-2015"]
["Missouri","St. Louis","29189212002","Low-Income Community","2011-2015"]
["Missouri","St. Louis","29189212101","Low-Income Community","2011-2015"]
["Missouri","St. Louis","29189212400","Low-Income Community","2011-2015"]
["Missouri","St. Louis","29189212700","Low-Income Community","2011-2015"]
["Missouri","St. Louis","29189213700","Low-Income Community","2011-2015"]
["Missouri","St. Louis","29189213900","Low-Income Community","2011-2015"]
["Missouri","St. Louis","29189214100","Low-Income Community","2011-2015"]
["Missouri","St. Louis","29189215600","Low-Income Community","2011-2015"]
["Missouri","St. Louis","29189215700","Low-Income Community","2011-2015"]
["Missouri","St. Louis","29189220200","Low-Income Community","2011-2015"]
["Missouri","St. Louis","29189221800","Low-Income Community","2011-2015"]
["Missouri","Saline","29195090100","Low-Income Community","2011-2015"]
["Missouri","Saline","29195090400","Low-Income Community","2011-2015"]
["Missouri","Scott","29201780600","Low-Income Community","2011-2015"]
["Missouri","Sullivan","29211480100","Low-Income Community","2011-2015"]
["Missouri","Sullivan","29211480300","Low-Income Community","2011-2015"]
["Missouri","Taney","29213480105","Low-Income Community","2011-2015"]
["Missouri","Warren","29219820101","Low-Income Community","2011-2015"]
["Missouri","Warren","29219820102","Low-Income Community","2011-2015"]
["Missouri","Washington","29221460300","Low-Income Community","2011-2015"]
["Missouri","Washington","29221460400","Low-Income Community","2011-2015"]
["Missouri","Wayne","29223690300","Low-Income Community","2011-2015"]
["Missouri","St. Louis","29510101800","Low-Income Community","2011-2015"]
["Missouri","St. Louis","29510106100","Low-Income Community","2011-2015"]
["Missouri","St. Louis","29510106200","Low-Income Community","2011-2015"]
["Missouri","St. Louis","29510106300","Low-Income Community","2011-2015"]
["Missouri","St. Louis","29510106600","Low-Income Community","2011-2015"]
["Missouri","St. Louis","29510109600","Low-Income Community","2011-2015"]
["Missouri","St. Louis","29510109700","Low-Income Community","2011-2015"]
["Missouri","St. Louis","29510111100","Low-Income Community","2011-2015"]
["Missouri","St. Louis","29510111200","Low-Income Community","2011-2015"]
["Missouri","St. Louis","29510112200","Low-Income Community","2011-2015"]
["Missouri","St. Louis","29510112300","Low-Income Community","2011-2015"]
["Missouri","St. Louis","29510115300","Low-Income Community","2011-2015"]
["Missouri","St. Louis","29510115500","Low-Income Community","2011-2015"]
["Missouri","St. Louis","29510118100","Low-Income Community","2011-2015"]
["Missouri","St. Louis","29510118600","Low-Income Community","2011-2015"]
["Missouri","St. Louis","29510119300","Low-Income Community","2011-2015"]
["Missouri","St. Louis","29510121100","Low-Income Community","2011-2015"]
["Missouri","St. Louis","29510124600","Low-Income Community","2011-2015"]
["Missouri","St. Louis","29510125600","Low-Income Community","2011-2015"]
["Missouri","St. Louis","29510125700","Low-Income Community","2011-2015"]
["Missouri","St. Louis","29510126600","Low-Income Community","2011-2015"]
["Missouri","St. Louis","29510126700","Low-Income Community","2011-2015"]
["Missouri","St. Louis","29510126900","Low-Income Community","2011-2015"]
["Missouri","St. Louis","29510127000","Low-Income Community","2011-2015"]
["Missouri","St. Louis","29510127100","Low-Income Community","2011-2015"]
["Missouri","St. Louis","29510127400","Low-Income Community","2011-2015"]
["Missouri","St. Louis","29510127500","Low-Income Community","2011-2015"]
["Montana","Big Horn","30003940600","Low-Income Community","2011-2015"]
["Montana","Blaine","30005940100","Low-Income Community","2011-2015"]
["Montana","Carbon","30009000300","Low-Income Community","2011-2015"]
["Montana","Cascade","30013010800","Low-Income Community","2011-2015"]
["Montana","Custer","30017962000","Low-Income Community","2011-2015"]
["Montana","Deer Lodge","30023000300","Low-Income Community","2011-2015"]
["Montana","Fergus","30027030200","Low-Income Community","2011-2015"]
["Montana","Flathead","30029001100","Low-Income Community","2011-2015"]
["Montana","Gallatin","30031001102","Low-Income Community","2011-2015"]
["Montana","Glacier","30035940400","Low-Income Community","2011-2015"]
["Montana","Hill","30041940300","Low-Income Community","2011-2015"]
["Montana","Lewis and Clark","30049000800","Low-Income Community","2011-2015"]
["Montana","Lincoln","30053000200","Low-Income Community","2011-2015"]
["Montana","Meagher","30059000100","Low-Income Community","2011-2015"]
["Montana","Mineral","30061964600","Low-Income Community","2011-2015"]
["Montana","Missoula","30063000201","Low-Income Community","2011-2015"]
["Montana","Ravalli","30081000600","Low-Income Community","2011-2015"]
["Montana","Roosevelt","30085940002","Low-Income Community","2011-2015"]
["Montana","Rosebud","30087940400","Low-Income Community","2011-2015"]
["Montana","Sanders","30089000200","Low-Income Community","2011-2015"]
["Montana","Sanders","30089940300","Low-Income Community","2011-2015"]
["Montana","Silver Bow","30093000100","Low-Income Community","2011-2015"]
["Montana","Toole","30101000200","Low-Income Community","2011-2015"]
["Montana","Wheatland","30107000100","Low-Income Community","2011-2015"]
["Montana","Yellowstone","30111000402","Low-Income Community","2011-2015"]
["Nebraska","Adams","31001966000","Low-Income Community","2011-2015"]
["Nebraska","Buffalo","31019969300","Low-Income Community","2011-2015"]
["Nebraska","Buffalo","31019969600","Low-Income Community","2011-2015"]
["Nebraska","Colfax","31037964800","Low-Income Community","2011-2015"]
["Nebraska","Dakota","31043010100","Low-Income Community","2011-2015"]
["Nebraska","Dawson","31047968300","Low-Income Community","2011-2015"]
["Nebraska","Dawson","31047968400","Low-Income Community","2011-2015"]
["Nebraska","Dodge","31053963800","Low-Income Community","2011-2015"]
["Nebraska","Dodge","31053964400","Low-Income Community","2011-2015"]
["Nebraska","Douglas","31055000500","Low-Income Community","2011-2015"]
["Nebraska","Douglas","31055000700","Low-Income Community","2011-2015"]
["Nebraska","Douglas","31055000800","Low-Income Community","2011-2015"]
["Nebraska","Douglas","31055001100","Low-Income Community","2011-2015"]
["Nebraska","Douglas","31055001600","Low-Income Community","2011-2015"]
["Nebraska","Douglas","31055001800","Non-LIC Contiguous","2011-2015"]
["Nebraska","Douglas","31055001900","Low-Income Community","2011-2015"]
["Nebraska","Douglas","31055003900","Low-Income Community","2011-2015"]
["Nebraska","Douglas","31055004000","Low-Income Community","2011-2015"]
["Nebraska","Douglas","31055004300","Low-Income Community","2011-2015"]
["Nebraska","Douglas","31055004400","Low-Income Community","2012-2016"]
["Nebraska","Douglas","31055005200","Low-Income Community","2011-2015"]
["Nebraska","Douglas","31055005902","Low-Income Community","2011-2015"]
["Nebraska","Douglas","31055007001","Low-Income Community","2011-2015"]
["Nebraska","Douglas","31055007459","Low-Income Community","2011-2015"]
["Nebraska","Garfield","31071973200","Low-Income Community","2011-2015"]
["Nebraska","Hall","31079000400","Low-Income Community","2011-2015"]
["Nebraska","Hall","31079000900","Low-Income Community","2011-2015"]
["Nebraska","Lancaster","31109000500","Low-Income Community","2011-2015"]
["Nebraska","Lancaster","31109000700","Low-Income Community","2011-2015"]
["Nebraska","Lancaster","31109001800","Low-Income Community","2011-2015"]
["Nebraska","Lancaster","31109001900","Low-Income Community","2011-2015"]
["Nebraska","Lancaster","31109002001","Low-Income Community","2011-2015"]
["Nebraska","Lancaster","31109002002","Low-Income Community","2011-2015"]
["Nebraska","Lancaster","31109002100","Low-Income Community","2011-2015"]
["Nebraska","Lancaster","31109003003","Low-Income Community","2011-2015"]
["Nebraska","Lincoln","31111960200","Low-Income Community","2011-2015"]
["Nebraska","Madison","31119960700","Low-Income Community","2011-2015"]
["Nebraska","Madison","31119961100","Low-Income Community","2012-2016"]
["Nebraska","Merrick","31121966800","Low-Income Community","2011-2015"]
["Nebraska","Red Willow","31145963300","Low-Income Community","2011-2015"]
["Nebraska","Scotts Bluff","31157953700","Low-Income Community","2011-2015"]
["Nebraska","Thurston","31173940200","Low-Income Community","2011-2015"]
["Nebraska","Valley","31175971400","Low-Income Community","2011-2015"]
["Nebraska","York","31185969700","Low-Income Community","2011-2015"]
["Nevada","Churchill","32001950500","Low-Income Community","2011-2015"]
["Nevada","Clark","32003000103","Low-Income Community","2011-2015"]
["Nevada","Clark","32003000105","Low-Income Community","2011-2015"]
["Nevada","Clark","32003000106","Low-Income Community","2011-2015"]
["Nevada","Clark","32003000201","Low-Income Community","2011-2015"]
["Nevada","Clark","32003000203","Low-Income Community","2011-2015"]
["Nevada","Clark","32003000301","Low-Income Community","2011-2015"]
["Nevada","Clark","32003000401","Low-Income Community","2011-2015"]
["Nevada","Clark","32003000402","Low-Income Community","2011-2015"]
["Nevada","Clark","32003000403","Low-Income Community","2011-2015"]
["Nevada","Clark","32003000510","Low-Income Community","2011-2015"]
["Nevada","Clark","32003000520","Low-Income Community","2011-2015"]
["Nevada","Clark","32003000521","Low-Income Community","2011-2015"]
["Nevada","Clark","32003000522","Low-Income Community","2011-2015"]
["Nevada","Clark","32003000523","Low-Income Community","2011-2015"]
["Nevada","Clark","32003000600","Low-Income Community","2011-2015"]
["Nevada","Clark","32003000700","Low-Income Community","2011-2015"]
["Nevada","Clark","32003000800","Low-Income Community","2011-2015"]
["Nevada","Clark","32003001100","Low-Income Community","2011-2015"]
["Nevada","Clark","32003001300","Low-Income Community","2011-2015"]
["Nevada","Clark","32003001501","Low-Income Community","2011-2015"]
["Nevada","Clark","32003001607","Low-Income Community","2011-2015"]
["Nevada","Clark","32003001801","Low-Income Community","2011-2015"]
["Nevada","Clark","32003001901","Low-Income Community","2011-2015"]
["Nevada","Clark","32003002201","Low-Income Community","2011-2015"]
["Nevada","Clark","32003002403","Low-Income Community","2011-2015"]
["Nevada","Clark","32003002404","Low-Income Community","2011-2015"]
["Nevada","Clark","32003002405","Low-Income Community","2011-2015"]
["Nevada","Clark","32003002506","Low-Income Community","2011-2015"]
["Nevada","Clark","32003002603","Low-Income Community","2011-2015"]
["Nevada","Clark","32003002847","Low-Income Community","2011-2015"]
["Nevada","Clark","32003002905","Low-Income Community","2011-2015"]
["Nevada","Clark","32003002962","Low-Income Community","2011-2015"]
["Nevada","Clark","32003003006","Low-Income Community","2011-2015"]
["Nevada","Clark","32003003616","Low-Income Community","2011-2015"]
["Nevada","Clark","32003003700","Low-Income Community","2011-2015"]
["Nevada","Clark","32003003800","Low-Income Community","2011-2015"]
["Nevada","Clark","32003004000","Low-Income Community","2011-2015"]
["Nevada","Clark","32003004302","Low-Income Community","2011-2015"]
["Nevada","Clark","32003005005","Low-Income Community","2011-2015"]
["Nevada","Clark","32003005200","Low-Income Community","2011-2015"]
["Nevada","Clark","32003005421","Low-Income Community","2011-2015"]
["Nevada","Clark","32003005422","Low-Income Community","2011-2015"]
["Nevada","Clark","32003005438","Low-Income Community","2011-2015"]
["Nevada","Clark","32003006800","Low-Income Community","2011-2015"]
["Nevada","Clark","32003007800","Low-Income Community","2011-2015"]
["Nevada","Elko","32007951500","Low-Income Community","2011-2015"]
["Nevada","Lyon","32019960103","Low-Income Community","2011-2015"]
["Nevada","Lyon","32019960201","Low-Income Community","2011-2015"]
["Nevada","Nye","32023960401","Low-Income Community","2011-2015"]
["Nevada","Storey","32029970200","Non-LIC Contiguous","2012-2016"]
["Nevada","Washoe","32031000101","Low-Income Community","2011-2015"]
["Nevada","Washoe","32031000102","Low-Income Community","2011-2015"]
["Nevada","Washoe","32031000201","Low-Income Community","2011-2015"]
["Nevada","Washoe","32031000202","Low-Income Community","2011-2015"]
["Nevada","Washoe","32031000900","Low-Income Community","2011-2015"]
["Nevada","Washoe","32031001009","Low-Income Community","2011-2015"]
["Nevada","Washoe","32031001502","Low-Income Community","2011-2015"]
["Nevada","Washoe","32031003101","Low-Income Community","2011-2015"]
["Nevada","Washoe","32031940200","Low-Income Community","2011-2015"]
["Nevada","Carson City","32510000600","Low-Income Community","2011-2015"]
["New Hampshire","Belknap","33001966000","Low-Income Community","2011-2015"]
["New Hampshire","Carroll","33003955300","Low-Income Community","2011-2015"]
["New Hampshire","Carroll","33003955400","Low-Income Community","2011-2015"]
["New Hampshire","Cheshire","33005971401","Low-Income Community","2011-2015"]
["New Hampshire","Coos","33007950200","Low-Income Community","2011-2015"]
["New Hampshire","Coos","33007950300","Low-Income Community","2011-2015"]
["New Hampshire","Coos","33007950400","Low-Income Community","2011-2015"]
["New Hampshire","Coos","33007950500","Low-Income Community","2011-2015"]
["New Hampshire","Coos","33007950600","Low-Income Community","2011-2015"]
["New Hampshire","Grafton","33009960100","Low-Income Community","2011-2015"]
["New Hampshire","Grafton","33009960400","Low-Income Community","2011-2015"]
["New Hampshire","Grafton","33009961000","Low-Income Community","2011-2015"]
["New Hampshire","Hillsborough","33011010700","Low-Income Community","2011-2015"]
["New Hampshire","Hillsborough","33011010800","Low-Income Community","2011-2015"]
["New Hampshire","Hillsborough","33011200400","Low-Income Community","2011-2015"]
["New Hampshire","Merrimack","33013043001","Low-Income Community","2011-2015"]
["New Hampshire","Merrimack","33013043002","Low-Income Community","2011-2015"]
["New Hampshire","Rockingham","33015003500","Low-Income Community","2011-2015"]
["New Hampshire","Rockingham","33015055002","Low-Income Community","2011-2015"]
["New Hampshire","Rockingham","33015063001","Low-Income Community","2011-2015"]
["New Hampshire","Strafford","33017080203","Low-Income Community","2011-2015"]
["New Hampshire","Strafford","33017081400","Low-Income Community","2011-2015"]
["New Hampshire","Strafford","33017083001","Low-Income Community","2011-2015"]
["New Hampshire","Strafford","33017084300","Low-Income Community","2011-2015"]
["New Hampshire","Strafford","33017084400","Low-Income Community","2011-2015"]
["New Hampshire","Sullivan","33019975400","Low-Income Community","2011-2015"]
["New Hampshire","Sullivan","33019975800","Low-Income Community","2011-2015"]
["New Jersey","Atlantic","34001000400","Low-Income Community","2011-2015"]
["New Jersey","Atlantic","34001001900","Low-Income Community","2011-2015"]
["New Jersey","Atlantic","34001002300","Low-Income Community","2011-2015"]
["New Jersey","Atlantic","34001002400","Low-Income Community","2011-2015"]
["New Jersey","Atlantic","34001010600","Low-Income Community","2011-2015"]
["New Jersey","Atlantic","34001011702","Low-Income Community","2011-2015"]
["New Jersey","Atlantic","34001012100","Low-Income Community","2011-2015"]
["New Jersey","Atlantic","34001012702","Low-Income Community","2011-2015"]
["New Jersey","Bergen","34003006300","Low-Income Community","2011-2015"]
["New Jersey","Bergen","34003015400","Low-Income Community","2011-2015"]
["New Jersey","Bergen","34003018200","Low-Income Community","2011-2015"]
["New Jersey","Bergen","34003021200","Low-Income Community","2011-2015"]
["New Jersey","Bergen","34003021500","Low-Income Community","2011-2015"]
["New Jersey","Bergen","34003021600","Low-Income Community","2011-2015"]
["New Jersey","Bergen","34003023100","Low-Income Community","2011-2015"]
["New Jersey","Bergen","34003023200","Low-Income Community","2012-2016"]
["New Jersey","Bergen","34003023402","Low-Income Community","2011-2015"]
["New Jersey","Bergen","34003030100","Low-Income Community","2011-2015"]
["New Jersey","Bergen","34003030300","Low-Income Community","2011-2015"]
["New Jersey","Bergen","34003036100","Low-Income Community","2011-2015"]
["New Jersey","Burlington","34005700104","Low-Income Community","2011-2015"]
["New Jersey","Burlington","34005700703","Low-Income Community","2011-2015"]
["New Jersey","Burlington","34005701204","Low-Income Community","2011-2015"]
["New Jersey","Burlington","34005702207","Low-Income Community","2011-2015"]
["New Jersey","Burlington","34005702807","Low-Income Community","2011-2015"]
["New Jersey","Camden","34007600200","Low-Income Community","2011-2015"]
["New Jersey","Camden","34007600700","Low-Income Community","2011-2015"]
["New Jersey","Camden","34007601300","Low-Income Community","2011-2015"]
["New Jersey","Camden","34007601500","Low-Income Community","2011-2015"]
["New Jersey","Camden","34007601800","Low-Income Community","2011-2015"]
["New Jersey","Camden","34007607702","Low-Income Community","2011-2015"]
["New Jersey","Camden","34007608504","Low-Income Community","2011-2015"]
["New Jersey","Camden","34007610300","Low-Income Community","2011-2015"]
["New Jersey","Camden","34007610400","Low-Income Community","2011-2015"]
["New Jersey","Camden","34007610600","Low-Income Community","2011-2015"]
["New Jersey","Camden","34007610800","Low-Income Community","2011-2015"]
["New Jersey","Cape May","34009021400","Low-Income Community","2011-2015"]
["New Jersey","Cape May","34009021804","Low-Income Community","2011-2015"]
["New Jersey","Cumberland","34011020100","Low-Income Community","2011-2015"]
["New Jersey","Cumberland","34011020503","Low-Income Community","2011-2015"]
["New Jersey","Cumberland","34011030100","Low-Income Community","2011-2015"]
["New Jersey","Cumberland","34011040500","Low-Income Community","2011-2015"]
["New Jersey","Cumberland","34011041100","Low-Income Community","2011-2015"]
["New Jersey","Essex","34013001400","Low-Income Community","2011-2015"]
["New Jersey","Essex","34013004100","Low-Income Community","2011-2015"]
["New Jersey","Essex","34013004802","Low-Income Community","2011-2015"]
["New Jersey","Essex","34013005000","Low-Income Community","2011-2015"]
["New Jersey","Essex","34013006800","Low-Income Community","2011-2015"]
["New Jersey","Essex","34013007400","Low-Income Community","2011-2015"]
["New Jersey","Essex","34013007501","Low-Income Community","2011-2015"]
["New Jersey","Essex","34013007502","Low-Income Community","2011-2015"]
["New Jersey","Essex","34013008000","Low-Income Community","2011-2015"]
["New Jersey","Essex","34013008100","Low-Income Community","2011-2015"]
["New Jersey","Essex","34013009600","Low-Income Community","2011-2015"]
["New Jersey","Essex","34013010600","Low-Income Community","2011-2015"]
["New Jersey","Essex","34013010900","Low-Income Community","2011-2015"]
["New Jersey","Essex","34013011300","Low-Income Community","2011-2015"]
["New Jersey","Essex","34013013100","Low-Income Community","2011-2015"]
["New Jersey","Essex","34013013200","Low-Income Community","2011-2015"]
["New Jersey","Essex","34013013300","Low-Income Community","2011-2015"]
["New Jersey","Essex","34013018300","Low-Income Community","2011-2015"]
["New Jersey","Essex","34013018600","Low-Income Community","2011-2015"]
["New Jersey","Essex","34013018700","Low-Income Community","2011-2015"]
["New Jersey","Essex","34013018900","Low-Income Community","2011-2015"]
["New Jersey","Essex","34013022900","Low-Income Community","2011-2015"]
["New Jersey","Essex","34013023100","Low-Income Community","2011-2015"]
["New Jersey","Gloucester","34015501001","Low-Income Community","2011-2015"]
["New Jersey","Gloucester","34015501101","Low-Income Community","2011-2015"]
["New Jersey","Gloucester","34015501402","Low-Income Community","2011-2015"]
["New Jersey","Gloucester","34015501406","Low-Income Community","2011-2015"]
["New Jersey","Hudson","34017001900","Low-Income Community","2011-2015"]
["New Jersey","Hudson","34017002000","Low-Income Community","2011-2015"]
["New Jersey","Hudson","34017002900","Low-Income Community","2011-2015"]
["New Jersey","Hudson","34017004102","Low-Income Community","2011-2015"]
["New Jersey","Hudson","34017004600","Low-Income Community","2011-2015"]
["New Jersey","Hudson","34017004700","Low-Income Community","2011-2015"]
["New Jersey","Hudson","34017004800","Low-Income Community","2011-2015"]
["New Jersey","Hudson","34017005200","Low-Income Community","2011-2015"]
["New Jersey","Hudson","34017006000","Low-Income Community","2011-2015"]
["New Jersey","Hudson","34017006300","Low-Income Community","2011-2015"]
["New Jersey","Hudson","34017006800","Low-Income Community","2011-2015"]
["New Jersey","Hudson","34017010300","Low-Income Community","2011-2015"]
["New Jersey","Hudson","34017010800","Low-Income Community","2012-2016"]
["New Jersey","Hudson","34017012700","Low-Income Community","2011-2015"]
["New Jersey","Hudson","34017014600","Low-Income Community","2011-2015"]
["New Jersey","Hudson","34017014800","Low-Income Community","2011-2015"]
["New Jersey","Hudson","34017015500","Low-Income Community","2011-2015"]
["New Jersey","Hudson","34017016200","Low-Income Community","2011-2015"]
["New Jersey","Hudson","34017016400","Low-Income Community","2011-2015"]
["New Jersey","Hudson","34017016900","Low-Income Community","2011-2015"]
["New Jersey","Hudson","34017017800","Low-Income Community","2011-2015"]
["New Jersey","Hunterdon","34019011400","Low-Income Community","2011-2015"]
["New Jersey","Mercer","34021000100","Low-Income Community","2011-2015"]
["New Jersey","Mercer","34021000200","Low-Income Community","2011-2015"]
["New Jersey","Mercer","34021000800","Low-Income Community","2011-2015"]
["New Jersey","Mercer","34021000900","Low-Income Community","2011-2015"]
["New Jersey","Mercer","34021001000","Low-Income Community","2011-2015"]
["New Jersey","Mercer","34021002000","Low-Income Community","2011-2015"]
["New Jersey","Mercer","34021002100","Low-Income Community","2011-2015"]
["New Jersey","Mercer","34021002902","Low-Income Community","2011-2015"]
["New Jersey","Middlesex","34023003600","Low-Income Community","2011-2015"]
["New Jersey","Middlesex","34023004500","Low-Income Community","2011-2015"]
["New Jersey","Middlesex","34023004600","Low-Income Community","2011-2015"]
["New Jersey","Middlesex","34023004800","Low-Income Community","2011-2015"]
["New Jersey","Middlesex","34023004900","Low-Income Community","2011-2015"]
["New Jersey","Middlesex","34023005300","Low-Income Community","2011-2015"]
["New Jersey","Middlesex","34023005500","Low-Income Community","2011-2015"]
["New Jersey","Middlesex","34023005602","Low-Income Community","2011-2015"]
["New Jersey","Middlesex","34023005700","Low-Income Community","2011-2015"]
["New Jersey","Middlesex","34023005800","Low-Income Community","2011-2015"]
["New Jersey","Middlesex","34023006800","Low-Income Community","2011-2015"]
["New Jersey","Middlesex","34023008300","Low-Income Community","2011-2015"]
["New Jersey","Middlesex","34023009300","Low-Income Community","2011-2015"]
["New Jersey","Monmouth","34025803400","Low-Income Community","2011-2015"]
["New Jersey","Monmouth","34025805800","Low-Income Community","2011-2015"]
["New Jersey","Monmouth","34025806000","Low-Income Community","2011-2015"]
["New Jersey","Monmouth","34025807003","Low-Income Community","2011-2015"]
["New Jersey","Monmouth","34025807300","Low-Income Community","2011-2015"]
["New Jersey","Monmouth","34025807600","Low-Income Community","2011-2015"]
["New Jersey","Monmouth","34025808100","Low-Income Community","2011-2015"]
["New Jersey","Monmouth","34025810900","Low-Income Community","2011-2015"]
["New Jersey","Morris","34027044800","Low-Income Community","2011-2015"]
["New Jersey","Morris","34027044900","Low-Income Community","2011-2015"]
["New Jersey","Morris","34027045000","Low-Income Community","2011-2015"]
["New Jersey","Morris","34027045100","Low-Income Community","2012-2016"]
["New Jersey","Ocean","34029715000","Low-Income Community","2011-2015"]
["New Jersey","Ocean","34029715200","Low-Income Community","2011-2015"]
["New Jersey","Ocean","34029715402","Low-Income Community","2011-2015"]
["New Jersey","Ocean","34029715500","Low-Income Community","2011-2015"]
["New Jersey","Ocean","34029715600","Low-Income Community","2011-2015"]
["New Jersey","Ocean","34029715800","Low-Income Community","2011-2015"]
["New Jersey","Ocean","34029720101","Low-Income Community","2011-2015"]
["New Jersey","Ocean","34029720102","Low-Income Community","2011-2015"]
["New Jersey","Ocean","34029720202","Low-Income Community","2011-2015"]
["New Jersey","Ocean","34029731101","Low-Income Community","2011-2015"]
["New Jersey","Ocean","34029731205","Low-Income Community","2011-2015"]
["New Jersey","Passaic","34031124601","Low-Income Community","2011-2015"]
["New Jersey","Passaic","34031125100","Low-Income Community","2011-2015"]
["New Jersey","Passaic","34031175200","Low-Income Community","2011-2015"]
["New Jersey","Passaic","34031175301","Low-Income Community","2011-2015"]
["New Jersey","Passaic","34031175402","Low-Income Community","2011-2015"]
["New Jersey","Passaic","34031175900","Low-Income Community","2011-2015"]
["New Jersey","Passaic","34031181500","Low-Income Community","2011-2015"]
["New Jersey","Passaic","34031181800","Low-Income Community","2011-2015"]
["New Jersey","Passaic","34031182302","Low-Income Community","2011-2015"]
["New Jersey","Passaic","34031182500","Low-Income Community","2011-2015"]
["New Jersey","Passaic","34031182800","Low-Income Community","2011-2015"]
["New Jersey","Passaic","34031182900","Low-Income Community","2011-2015"]
["New Jersey","Passaic","34031183200","Low-Income Community","2011-2015"]
["New Jersey","Passaic","34031203600","Low-Income Community","2011-2015"]
["New Jersey","Passaic","34031264200","Low-Income Community","2011-2015"]
["New Jersey","Salem","34033020600","Low-Income Community","2011-2015"]
["New Jersey","Salem","34033022100","Low-Income Community","2011-2015"]
["New Jersey","Somerset","34035051100","Low-Income Community","2011-2015"]
["New Jersey","Somerset","34035051200","Low-Income Community","2011-2015"]
["New Jersey","Somerset","34035051700","Low-Income Community","2011-2015"]
["New Jersey","Sussex","34037371200","Low-Income Community","2011-2015"]
["New Jersey","Union","34039031100","Low-Income Community","2011-2015"]
["New Jersey","Union","34039031200","Low-Income Community","2011-2015"]
["New Jersey","Union","34039031602","Low-Income Community","2011-2015"]
["New Jersey","Union","34039032400","Low-Income Community","2011-2015"]
["New Jersey","Union","34039035300","Low-Income Community","2011-2015"]
["New Jersey","Union","34039035400","Low-Income Community","2011-2015"]
["New Jersey","Union","34039036000","Low-Income Community","2011-2015"]
["New Jersey","Union","34039039000","Low-Income Community","2011-2015"]
["New Jersey","Union","34039039300","Low-Income Community","2011-2015"]
["New Jersey","Union","34039039800","Low-Income Community","2011-2015"]
["New Jersey","Union","34039039900","Low-Income Community","2011-2015"]
["New Jersey","Warren","34041030700","Low-Income Community","2011-2015"]
["New Mexico","Bernalillo","35001000124","Low-Income Community","2011-2015"]
["New Mexico","Bernalillo","35001001200","Low-Income Community","2011-2015"]
["New Mexico","Bernalillo","35001001600","Low-Income Community","2011-2015"]
["New Mexico","Bernalillo","35001002100","Low-Income Community","2011-2015"]
["New Mexico","Bernalillo","35001002500","Low-Income Community","2011-2015"]
["New Mexico","Bernalillo","35001002700","Low-Income Community","2011-2015"]
["New Mexico","Bernalillo","35001003400","Low-Income Community","2011-2015"]
["New Mexico","Bernalillo","35001003736","Low-Income Community","2011-2015"]
["New Mexico","Bernalillo","35001004001","Low-Income Community","2011-2015"]
["New Mexico","Bernalillo","35001004300","Low-Income Community","2011-2015"]
["New Mexico","Bernalillo","35001004736","Low-Income Community","2011-2015"]
["New Mexico","Bernalillo","35001004741","Low-Income Community","2011-2015"]
["New Mexico","Bernalillo","35001004744","Non-LIC Contiguous","2011-2015"]
["New Mexico","Bernalillo","35001940600","Low-Income Community","2011-2015"]
["New Mexico","Chaves","35005000700","Low-Income Community","2011-2015"]
["New Mexico","Chaves","35005001101","Low-Income Community","2011-2015"]
["New Mexico","Chaves","35005001300","Low-Income Community","2011-2015"]
["New Mexico","Cibola","35006946100","Low-Income Community","2011-2015"]
["New Mexico","Cibola","35006974400","Low-Income Community","2011-2015"]
["New Mexico","Colfax","35007950500","Low-Income Community","2011-2015"]
["New Mexico","Curry","35009000400","Low-Income Community","2011-2015"]
["New Mexico","Curry","35009000603","Low-Income Community","2011-2015"]
["New Mexico","Doña Ana","35013000102","Low-Income Community","2011-2015"]
["New Mexico","Doña Ana","35013000500","Low-Income Community","2011-2015"]
["New Mexico","Doña Ana","35013001000","Low-Income Community","2011-2015"]
["New Mexico","Doña Ana","35013001303","Low-Income Community","2011-2015"]
["New Mexico","Doña Ana","35013001500","Non-LIC Contiguous","2011-2015"]
["New Mexico","Doña Ana","35013001701","Low-Income Community","2011-2015"]
["New Mexico","Doña Ana","35013001705","Low-Income Community","2011-2015"]
["New Mexico","Eddy","35015000100","Low-Income Community","2011-2015"]
["New Mexico","Eddy","35015000800","Low-Income Community","2011-2015"]
["New Mexico","Grant","35017964400","Low-Income Community","2011-2015"]
["New Mexico","Hidalgo","35023970200","Low-Income Community","2011-2015"]
["New Mexico","Lea","35025000300","Low-Income Community","2011-2015"]
["New Mexico","Luna","35029000500","Low-Income Community","2011-2015"]
["New Mexico","McKinley","35031943902","Low-Income Community","2011-2015"]
["New Mexico","McKinley","35031945200","Low-Income Community","2011-2015"]
["New Mexico","McKinley","35031946000","Low-Income Community","2011-2015"]
["New Mexico","Quay","35037958601","Low-Income Community","2011-2015"]
["New Mexico","Rio Arriba","35039000300","Low-Income Community","2011-2015"]
["New Mexico","Rio Arriba","35039941000","Low-Income Community","2011-2015"]
["New Mexico","Roosevelt","35041000300","Low-Income Community","2011-2015"]
["New Mexico","Sandoval","35043940500","Low-Income Community","2011-2015"]
["New Mexico","Sandoval","35043940900","Low-Income Community","2011-2015"]
["New Mexico","San Juan","35045000401","Low-Income Community","2011-2015"]
["New Mexico","San Juan","35045000402","Low-Income Community","2011-2015"]
["New Mexico","San Juan","35045000705","Low-Income Community","2011-2015"]
["New Mexico","San Juan","35045943000","Low-Income Community","2011-2015"]
["New Mexico","San Juan","35045943201","Low-Income Community","2011-2015"]
["New Mexico","Santa Fe","35049001002","Low-Income Community","2011-2015"]
["New Mexico","Santa Fe","35049001103","Low-Income Community","2011-2015"]
["New Mexico","Santa Fe","35049001202","Low-Income Community","2011-2015"]
["New Mexico","Santa Fe","35049001302","Low-Income Community","2011-2015"]
["New Mexico","Santa Fe","35049001304","Low-Income Community","2011-2015"]
["New Mexico","Sierra","35051962300","Low-Income Community","2011-2015"]
["New Mexico","Sierra","35051962401","Non-LIC Contiguous","2011-2015"]
["New Mexico","Taos","35055952300","Low-Income Community","2011-2015"]
["New Mexico","Torrance","35057963202","Low-Income Community","2011-2015"]
["New Mexico","Torrance","35057963600","Low-Income Community","2011-2015"]
["New Mexico","Valencia","35061970401","Low-Income Community","2011-2015"]
["New Mexico","Valencia","35061971000","Low-Income Community","2011-2015"]
["New Mexico","Valencia","35061971300","Low-Income Community","2011-2015"]
["New Mexico","Valencia","35061971400","Non-LIC Contiguous","2011-2015"]
["New York","Albany","36001000200","Low-Income Community","2011-2015"]
["New York","Albany","36001001100","Low-Income Community","2011-2015"]
["New York","Albany","36001002100","Low-Income Community","2011-2015"]
["New York","Albany","36001002300","Low-Income Community","2011-2015"]
["New York","Albany","36001002500","Low-Income Community","2011-2015"]
["New York","Albany","36001002600","Low-Income Community","2011-2015"]
["New York","Allegany","36003950700","Low-Income Community","2011-2015"]
["New York","Allegany","36003950800","Low-Income Community","2011-2015"]
["New York","Bronx","36005001900","Low-Income Community","2011-2015"]
["New York","Bronx","36005002300","Low-Income Community","2011-2015"]
["New York","Bronx","36005002500","Low-Income Community","2011-2015"]
["New York","Bronx","36005002701","Low-Income Community","2011-2015"]
["New York","Bronx","36005002702","Low-Income Community","2011-2015"]
["New York","Bronx","36005002800","Low-Income Community","2011-2015"]
["New York","Bronx","36005003500","Low-Income Community","2011-2015"]
["New York","Bronx","36005003900","Low-Income Community","2011-2015"]
["New York","Bronx","36005004100","Low-Income Community","2011-2015"]
["New York","Bronx","36005004300","Low-Income Community","2011-2015"]
["New York","Bronx","36005005001","Low-Income Community","2011-2015"]
["New York","Bronx","36005005100","Low-Income Community","2011-2015"]
["New York","Bronx","36005005200","Low-Income Community","2011-2015"]
["New York","Bronx","36005005902","Low-Income Community","2011-2015"]
["New York","Bronx","36005006100","Low-Income Community","2011-2015"]
["New York","Bronx","36005006300","Low-Income Community","2011-2015"]
["New York","Bronx","36005006500","Low-Income Community","2011-2015"]
["New York","Bronx","36005006700","Low-Income Community","2011-2015"]
["New York","Bronx","36005007100","Low-Income Community","2011-2015"]
["New York","Bronx","36005007500","Low-Income Community","2011-2015"]
["New York","Bronx","36005008700","Low-Income Community","2011-2015"]
["New York","Bronx","36005008900","Low-Income Community","2011-2015"]
["New York","Bronx","36005009000","Low-Income Community","2011-2015"]
["New York","Bronx","36005009300","Low-Income Community","2011-2015"]
["New York","Bronx","36005009600","Low-Income Community","2011-2015"]
["New York","Bronx","36005011502","Low-Income Community","2011-2015"]
["New York","Bronx","36005011700","Low-Income Community","2011-2015"]
["New York","Bronx","36005011900","Low-Income Community","2011-2015"]
["New York","Bronx","36005012101","Low-Income Community","2011-2015"]
["New York","Bronx","36005012102","Low-Income Community","2011-2015"]
["New York","Bronx","36005012300","Low-Income Community","2011-2015"]
["New York","Bronx","36005012701","Low-Income Community","2011-2015"]
["New York","Bronx","36005012901","Low-Income Community","2011-2015"]
["New York","Bronx","36005013100","Low-Income Community","2011-2015"]
["New York","Bronx","36005014100","Low-Income Community","2011-2015"]
["New York","Bronx","36005014500","Low-Income Community","2011-2015"]
["New York","Bronx","36005014900","Low-Income Community","2011-2015"]
["New York","Bronx","36005015700","Low-Income Community","2011-2015"]
["New York","Bronx","36005016100","Low-Income Community","2011-2015"]
["New York","Bronx","36005016500","Low-Income Community","2011-2015"]
["New York","Bronx","36005016700","Low-Income Community","2011-2015"]
["New York","Bronx","36005017500","Low-Income Community","2011-2015"]
["New York","Bronx","36005017701","Low-Income Community","2011-2015"]
["New York","Bronx","36005018102","Low-Income Community","2011-2015"]
["New York","Bronx","36005018301","Low-Income Community","2011-2015"]
["New York","Bronx","36005018900","Low-Income Community","2011-2015"]
["New York","Bronx","36005019300","Low-Income Community","2011-2015"]
["New York","Bronx","36005019500","Low-Income Community","2011-2015"]
["New York","Bronx","36005019700","Low-Income Community","2011-2015"]
["New York","Bronx","36005019900","Low-Income Community","2011-2015"]
["New York","Bronx","36005020100","Low-Income Community","2011-2015"]
["New York","Bronx","36005020501","Low-Income Community","2011-2015"]
["New York","Bronx","36005020502","Low-Income Community","2011-2015"]
["New York","Bronx","36005021502","Low-Income Community","2011-2015"]
["New York","Bronx","36005023100","Low-Income Community","2011-2015"]
["New York","Bronx","36005024300","Low-Income Community","2011-2015"]
["New York","Bronx","36005024501","Low-Income Community","2011-2015"]
["New York","Bronx","36005024502","Low-Income Community","2011-2015"]
["New York","Bronx","36005024700","Low-Income Community","2011-2015"]
["New York","Bronx","36005025100","Low-Income Community","2011-2015"]
["New York","Bronx","36005025500","Low-Income Community","2011-2015"]
["New York","Bronx","36005025700","Low-Income Community","2011-2015"]
["New York","Bronx","36005028400","Low-Income Community","2011-2015"]
["New York","Bronx","36005036100","Low-Income Community","2011-2015"]
["New York","Bronx","36005036502","Low-Income Community","2011-2015"]
["New York","Bronx","36005037504","Low-Income Community","2011-2015"]
["New York","Bronx","36005038302","Low-Income Community","2011-2015"]
["New York","Bronx","36005038500","Low-Income Community","2011-2015"]
["New York","Bronx","36005038900","Low-Income Community","2011-2015"]
["New York","Bronx","36005039100","Low-Income Community","2011-2015"]
["New York","Bronx","36005039300","Low-Income Community","2011-2015"]
["New York","Bronx","36005039500","Low-Income Community","2011-2015"]
["New York","Bronx","36005043100","Low-Income Community","2011-2015"]
["New York","Bronx","36005046201","Low-Income Community","2011-2015"]
["New York","Bronx","36005046202","Low-Income Community","2011-2015"]
["New York","Broome","36007000200","Low-Income Community","2011-2015"]
["New York","Broome","36007000400","Low-Income Community","2011-2015"]
["New York","Broome","36007000500","Low-Income Community","2011-2015"]
["New York","Broome","36007013400","Low-Income Community","2011-2015"]
["New York","Broome","36007013500","Low-Income Community","2011-2015"]
["New York","Broome","36007013900","Low-Income Community","2011-2015"]
["New York","Cattaraugus","36009960600","Low-Income Community","2011-2015"]
["New York","Cattaraugus","36009961600","Low-Income Community","2011-2015"]
["New York","Cattaraugus","36009961700","Low-Income Community","2011-2015"]
["New York","Cayuga","36011041300","Low-Income Community","2011-2015"]
["New York","Chautauqua","36013030500","Low-Income Community","2011-2015"]
["New York","Chautauqua","36013035400","Low-Income Community","2011-2015"]
["New York","Chautauqua","36013035500","Low-Income Community","2011-2015"]
["New York","Chautauqua","36013035600","Low-Income Community","2011-2015"]
["New York","Chautauqua","36013035700","Low-Income Community","2011-2015"]
["New York","Chautauqua","36013035800","Low-Income Community","2011-2015"]
["New York","Chautauqua","36013037300","Low-Income Community","2011-2015"]
["New York","Chemung","36015000600","Low-Income Community","2011-2015"]
["New York","Chemung","36015000700","Low-Income Community","2011-2015"]
["New York","Chemung","36015001000","Low-Income Community","2011-2015"]
["New York","Chenango","36017970400","Low-Income Community","2011-2015"]
["New York","Clinton","36019101300","Low-Income Community","2011-2015"]
["New York","Clinton","36019101600","Low-Income Community","2011-2015"]
["New York","Columbia","36021001200","Low-Income Community","2011-2015"]
["New York","Columbia","36021001300","Low-Income Community","2011-2015"]
["New York","Cortland","36023970600","Low-Income Community","2011-2015"]
["New York","Cortland","36023970900","Low-Income Community","2011-2015"]
["New York","Delaware","36025970400","Low-Income Community","2011-2015"]
["New York","Delaware","36025970500","Low-Income Community","2011-2015"]
["New York","Delaware","36025970600","Low-Income Community","2011-2015"]
["New York","Dutchess","36027210101","Low-Income Community","2011-2015"]
["New York","Dutchess","36027220100","Low-Income Community","2011-2015"]
["New York","Dutchess","36027221100","Low-Income Community","2011-2015"]
["New York","Dutchess","36027640002","Low-Income Community","2011-2015"]
["New York","Erie","36029000110","Low-Income Community","2011-2015"]
["New York","Erie","36029000500","Low-Income Community","2011-2015"]
["New York","Erie","36029001600","Low-Income Community","2011-2015"]
["New York","Erie","36029002502","Low-Income Community","2011-2015"]
["New York","Erie","36029003100","Low-Income Community","2011-2015"]
["New York","Erie","36029003400","Low-Income Community","2011-2015"]
["New York","Erie","36029004001","Low-Income Community","2011-2015"]
["New York","Erie","36029004700","Low-Income Community","2011-2015"]
["New York","Erie","36029005600","Low-Income Community","2011-2015"]
["New York","Erie","36029006100","Low-Income Community","2011-2015"]
["New York","Erie","36029006702","Low-Income Community","2011-2015"]
["New York","Erie","36029008300","Low-Income Community","2011-2015"]
["New York","Erie","36029008400","Low-Income Community","2011-2015"]
["New York","Erie","36029009200","Low-Income Community","2011-2015"]
["New York","Erie","36029012300","Low-Income Community","2011-2015"]
["New York","Erie","36029016300","Low-Income Community","2011-2015"]
["New York","Erie","36029016400","Low-Income Community","2011-2015"]
["New York","Erie","36029016500","Low-Income Community","2011-2015"]
["New York","Erie","36029016800","Low-Income Community","2011-2015"]
["New York","Erie","36029017000","Low-Income Community","2011-2015"]
["New York","Erie","36029017100","Low-Income Community","2011-2015"]
["New York","Erie","36029017200","Low-Income Community","2011-2015"]
["New York","Erie","36029017400","Low-Income Community","2011-2015"]
["New York","Franklin","36033950501","Low-Income Community","2011-2015"]
["New York","Fulton","36035970700","Low-Income Community","2011-2015"]
["New York","Fulton","36035970800","Low-Income Community","2011-2015"]
["New York","Fulton","36035971200","Low-Income Community","2011-2015"]
["New York","Genesee","36037950600","Low-Income Community","2011-2015"]
["New York","Genesee","36037951000","Low-Income Community","2011-2015"]
["New York","Greene","36039081000","Low-Income Community","2011-2015"]
["New York","Herkimer","36043010702","Low-Income Community","2011-2015"]
["New York","Herkimer","36043011200","Low-Income Community","2011-2015"]
["New York","Jefferson","36045061300","Low-Income Community","2011-2015"]
["New York","Jefferson","36045061400","Low-Income Community","2011-2015"]
["New York","Jefferson","36045062100","Low-Income Community","2011-2015"]
["New York","Kings","36047000100","Non-LIC Contiguous","2011-2015"]
["New York","Kings","36047000200","Low-Income Community","2011-2015"]
["New York","Kings","36047000502","Non-LIC Contiguous","2011-2015"]
["New York","Kings","36047001100","Non-LIC Contiguous","2011-2015"]
["New York","Kings","36047001300","Low-Income Community","2011-2015"]
["New York","Kings","36047001500","Low-Income Community","2011-2015"]
["New York","Kings","36047002000","Low-Income Community","2011-2015"]
["New York","Kings","36047002200","Low-Income Community","2011-2015"]
["New York","Kings","36047002300","Low-Income Community","2011-2015"]
["New York","Kings","36047002901","Low-Income Community","2011-2015"]
["New York","Kings","36047003400","Low-Income Community","2011-2015"]
["New York","Kings","36047005300","Low-Income Community","2011-2015"]
["New York","Kings","36047007000","Low-Income Community","2011-2015"]
["New York","Kings","36047007100","Low-Income Community","2011-2015"]
["New York","Kings","36047007400","Low-Income Community","2011-2015"]
["New York","Kings","36047008200","Low-Income Community","2011-2015"]
["New York","Kings","36047008400","Low-Income Community","2011-2015"]
["New York","Kings","36047008500","Low-Income Community","2011-2015"]
["New York","Kings","36047009800","Low-Income Community","2011-2015"]
["New York","Kings","36047010100","Low-Income Community","2011-2015"]
["New York","Kings","36047010400","Low-Income Community","2011-2015"]
["New York","Kings","36047011600","Low-Income Community","2011-2015"]
["New York","Kings","36047011700","Low-Income Community","2011-2015"]
["New York","Kings","36047011800","Low-Income Community","2011-2015"]
["New York","Kings","36047011900","Non-LIC Contiguous","2011-2015"]
["New York","Kings","36047012700","Low-Income Community","2011-2015"]
["New York","Kings","36047018501","Low-Income Community","2011-2015"]
["New York","Kings","36047019100","Low-Income Community","2011-2015"]
["New York","Kings","36047021100","Low-Income Community","2011-2015"]
["New York","Kings","36047021300","Low-Income Community","2011-2015"]
["New York","Kings","36047021500","Non-LIC Contiguous","2011-2015"]
["New York","Kings","36047021700","Low-Income Community","2011-2015"]
["New York","Kings","36047024100","Low-Income Community","2011-2015"]
["New York","Kings","36047024300","Non-LIC Contiguous","2011-2015"]
["New York","Kings","36047025100","Low-Income Community","2011-2015"]
["New York","Kings","36047026300","Low-Income Community","2011-2015"]
["New York","Kings","36047026500","Low-Income Community","2011-2015"]
["New York","Kings","36047028100","Low-Income Community","2011-2015"]
["New York","Kings","36047028300","Low-Income Community","2011-2015"]
["New York","Kings","36047028900","Low-Income Community","2011-2015"]
["New York","Kings","36047029300","Low-Income Community","2011-2015"]
["New York","Kings","36047029400","Low-Income Community","2011-2015"]
["New York","Kings","36047030300","Low-Income Community","2011-2015"]
["New York","Kings","36047030400","Low-Income Community","2011-2015"]
["New York","Kings","36047030700","Low-Income Community","2011-2015"]
["New York","Kings","36047030900","Low-Income Community","2011-2015"]
["New York","Kings","36047031400","Low-Income Community","2011-2015"]
["New York","Kings","36047031900","Low-Income Community","2011-2015"]
["New York","Kings","36047032300","Low-Income Community","2011-2015"]
["New York","Kings","36047032600","Low-Income Community","2011-2015"]
["New York","Kings","36047033000","Low-Income Community","2011-2015"]
["New York","Kings","36047033100","Low-Income Community","2011-2015"]
["New York","Kings","36047033900","Low-Income Community","2011-2015"]
["New York","Kings","36047034200","Low-Income Community","2011-2015"]
["New York","Kings","36047034700","Low-Income Community","2011-2015"]
["New York","Kings","36047034800","Low-Income Community","2011-2015"]
["New York","Kings","36047034900","Low-Income Community","2011-2015"]
["New York","Kings","36047035000","Low-Income Community","2011-2015"]
["New York","Kings","36047035200","Low-Income Community","2011-2015"]
["New York","Kings","36047035700","Low-Income Community","2011-2015"]
["New York","Kings","36047035900","Low-Income Community","2011-2015"]
["New York","Kings","36047036001","Low-Income Community","2011-2015"]
["New York","Kings","36047036100","Low-Income Community","2011-2015"]
["New York","Kings","36047036200","Low-Income Community","2011-2015"]
["New York","Kings","36047036300","Low-Income Community","2011-2015"]
["New York","Kings","36047036501","Low-Income Community","2011-2015"]
["New York","Kings","36047036502","Low-Income Community","2011-2015"]
["New York","Kings","36047036700","Low-Income Community","2011-2015"]
["New York","Kings","36047036900","Low-Income Community","2011-2015"]
["New York","Kings","36047037300","Low-Income Community","2011-2015"]
["New York","Kings","36047039700","Low-Income Community","2011-2015"]
["New York","Kings","36047039900","Low-Income Community","2011-2015"]
["New York","Kings","36047040100","Low-Income Community","2011-2015"]
["New York","Kings","36047040500","Low-Income Community","2011-2015"]
["New York","Kings","36047041300","Low-Income Community","2011-2015"]
["New York","Kings","36047041500","Low-Income Community","2011-2015"]
["New York","Kings","36047041700","Low-Income Community","2011-2015"]
["New York","Kings","36047041900","Low-Income Community","2011-2015"]
["New York","Kings","36047042100","Low-Income Community","2011-2015"]
["New York","Kings","36047042300","Low-Income Community","2011-2015"]
["New York","Kings","36047042900","Low-Income Community","2011-2015"]
["New York","Kings","36047043300","Low-Income Community","2011-2015"]
["New York","Kings","36047044700","Low-Income Community","2011-2015"]
["New York","Kings","36047044900","Low-Income Community","2011-2015"]
["New York","Kings","36047045300","Low-Income Community","2011-2015"]
["New York","Kings","36047051300","Low-Income Community","2011-2015"]
["New York","Kings","36047053200","Non-LIC Contiguous","2011-2015"]
["New York","Kings","36047054300","Non-LIC Contiguous","2011-2015"]
["New York","Kings","36047054700","Low-Income Community","2011-2015"]
["New York","Kings","36047054900","Low-Income Community","2011-2015"]
["New York","Kings","36047056300","Low-Income Community","2011-2015"]
["New York","Kings","36047057900","Non-LIC Contiguous","2011-2015"]
["New York","Kings","36047061004","Low-Income Community","2011-2015"]
["New York","Kings","36047076200","Low-Income Community","2011-2015"]
["New York","Kings","36047077400","Low-Income Community","2011-2015"]
["New York","Kings","36047078200","Low-Income Community","2011-2015"]
["New York","Kings","36047080400","Low-Income Community","2011-2015"]
["New York","Kings","36047080600","Low-Income Community","2011-2015"]
["New York","Kings","36047081000","Low-Income Community","2011-2015"]
["New York","Kings","36047081600","Low-Income Community","2011-2015"]
["New York","Kings","36047081800","Low-Income Community","2011-2015"]
["New York","Kings","36047082000","Low-Income Community","2011-2015"]
["New York","Kings","36047082400","Low-Income Community","2011-2015"]
["New York","Kings","36047082800","Low-Income Community","2011-2015"]
["New York","Kings","36047083000","Low-Income Community","2011-2015"]
["New York","Kings","36047087401","Low-Income Community","2011-2015"]
["New York","Kings","36047087600","Low-Income Community","2011-2015"]
["New York","Kings","36047088200","Low-Income Community","2011-2015"]
["New York","Kings","36047089000","Low-Income Community","2011-2015"]
["New York","Kings","36047089200","Low-Income Community","2011-2015"]
["New York","Kings","36047090000","Low-Income Community","2011-2015"]
["New York","Kings","36047090600","Low-Income Community","2011-2015"]
["New York","Kings","36047090800","Low-Income Community","2011-2015"]
["New York","Kings","36047111600","Low-Income Community","2011-2015"]
["New York","Kings","36047111800","Low-Income Community","2011-2015"]
["New York","Kings","36047113400","Low-Income Community","2011-2015"]
["New York","Kings","36047114201","Low-Income Community","2011-2015"]
["New York","Kings","36047114400","Low-Income Community","2011-2015"]
["New York","Kings","36047114600","Low-Income Community","2011-2015"]
["New York","Kings","36047115000","Low-Income Community","2011-2015"]
["New York","Kings","36047115200","Low-Income Community","2011-2015"]
["New York","Kings","36047115600","Low-Income Community","2011-2015"]
["New York","Kings","36047116200","Low-Income Community","2011-2015"]
["New York","Kings","36047119400","Low-Income Community","2011-2015"]
["New York","Kings","36047119800","Low-Income Community","2011-2015"]
["New York","Livingston","36051030900","Low-Income Community","2011-2015"]
["New York","Monroe","36055000200","Low-Income Community","2011-2015"]
["New York","Monroe","36055000700","Low-Income Community","2011-2015"]
["New York","Monroe","36055001800","Low-Income Community","2011-2015"]
["New York","Monroe","36055001900","Low-Income Community","2011-2015"]
["New York","Monroe","36055004702","Low-Income Community","2011-2015"]
["New York","Monroe","36055005600","Low-Income Community","2011-2015"]
["New York","Monroe","36055005700","Low-Income Community","2011-2015"]
["New York","Monroe","36055005900","Low-Income Community","2011-2015"]
["New York","Monroe","36055006400","Low-Income Community","2011-2015"]
["New York","Monroe","36055006900","Low-Income Community","2011-2015"]
["New York","Monroe","36055008500","Low-Income Community","2011-2015"]
["New York","Monroe","36055009200","Low-Income Community","2011-2015"]
["New York","Monroe","36055009301","Low-Income Community","2011-2015"]
["New York","Monroe","36055009302","Low-Income Community","2011-2015"]
["New York","Monroe","36055009400","Low-Income Community","2011-2015"]
["New York","Monroe","36055009601","Low-Income Community","2011-2015"]
["New York","Monroe","36055009602","Low-Income Community","2011-2015"]
["New York","Monroe","36055009603","Low-Income Community","2011-2015"]
["New York","Monroe","36055010601","Low-Income Community","2011-2015"]
["New York","Monroe","36055011400","Low-Income Community","2011-2015"]
["New York","Montgomery","36057070200","Low-Income Community","2011-2015"]
["New York","Montgomery","36057070900","Low-Income Community","2011-2015"]
["New York","Montgomery","36057072600","Low-Income Community","2011-2015"]
["New York","Nassau","36059406801","Low-Income Community","2011-2015"]
["New York","Nassau","36059406802","Low-Income Community","2011-2015"]
["New York","Nassau","36059416500","Low-Income Community","2011-2015"]
["New York","Nassau","36059517200","Low-Income Community","2011-2015"]
["New York","New York","36061000202","Low-Income Community","2011-2015"]
["New York","New York","36061002201","Low-Income Community","2011-2015"]
["New York","New York","36061002601","Low-Income Community","2011-2015"]
["New York","New York","36061006200","Low-Income Community","2011-2015"]
["New York","New York","36061013500","Low-Income Community","2011-2015"]
["New York","New York","36061016800","Low-Income Community","2011-2015"]
["New York","New York","36061018000","Low-Income Community","2011-2015"]
["New York","New York","36061019200","Low-Income Community","2011-2015"]
["New York","New York","36061019400","Low-Income Community","2011-2015"]
["New York","New York","36061019600","Low-Income Community","2011-2015"]
["New York","New York","36061020600","Low-Income Community","2011-2015"]
["New York","New York","36061020800","Low-Income Community","2011-2015"]
["New York","New York","36061020901","Low-Income Community","2011-2015"]
["New York","New York","36061021303","Low-Income Community","2011-2015"]
["New York","New York","36061021500","Low-Income Community","2011-2015"]
["New York","New York","36061021600","Low-Income Community","2011-2015"]
["New York","New York","36061021800","Low-Income Community","2011-2015"]
["New York","New York","36061021900","Low-Income Community","2011-2015"]
["New York","New York","36061022200","Low-Income Community","2011-2015"]
["New York","New York","36061022301","Low-Income Community","2011-2015"]
["New York","New York","36061022302","Low-Income Community","2011-2015"]
["New York","New York","36061022400","Low-Income Community","2011-2015"]
["New York","New York","36061023000","Low-Income Community","2011-2015"]
["New York","New York","36061023200","Low-Income Community","2011-2015"]
["New York","New York","36061024100","Low-Income Community","2011-2015"]
["New York","New York","36061024200","Low-Income Community","2011-2015"]
["New York","New York","36061024301","Low-Income Community","2011-2015"]
["New York","New York","36061026100","Low-Income Community","2011-2015"]
["New York","New York","36061026900","Low-Income Community","2011-2015"]
["New York","New York","36061027700","Low-Income Community","2011-2015"]
["New York","New York","36061027900","Low-Income Community","2011-2015"]
["New York","New York","36061028700","Low-Income Community","2011-2015"]
["New York","New York","36061029100","Low-Income Community","2011-2015"]
["New York","New York","36061029300","Low-Income Community","2011-2015"]
["New York","New York","36061029900","Low-Income Community","2011-2015"]
["New York","New York","36061030300","Low-Income Community","2011-2015"]
["New York","Niagara","36063020200","Low-Income Community","2011-2015"]
["New York","Niagara","36063020500","Low-Income Community","2011-2015"]
["New York","Niagara","36063021100","Low-Income Community","2011-2015"]
["New York","Niagara","36063021200","Low-Income Community","2011-2015"]
["New York","Niagara","36063021700","Low-Income Community","2011-2015"]
["New York","Niagara","36063023100","Low-Income Community","2011-2015"]
["New York","Niagara","36063023200","Low-Income Community","2011-2015"]
["New York","Niagara","36063023700","Low-Income Community","2011-2015"]
["New York","Oneida","36065020102","Low-Income Community","2011-2015"]
["New York","Oneida","36065020300","Low-Income Community","2011-2015"]
["New York","Oneida","36065020900","Low-Income Community","2011-2015"]
["New York","Oneida","36065021900","Low-Income Community","2011-2015"]
["New York","Oneida","36065022500","Low-Income Community","2011-2015"]
["New York","Oneida","36065026300","Low-Income Community","2011-2015"]
["New York","Oneida","36065026400","Low-Income Community","2011-2015"]
["New York","Onondaga","36067000501","Low-Income Community","2011-2015"]
["New York","Onondaga","36067001600","Low-Income Community","2011-2015"]
["New York","Onondaga","36067002101","Low-Income Community","2011-2015"]
["New York","Onondaga","36067002300","Low-Income Community","2011-2015"]
["New York","Onondaga","36067003000","Low-Income Community","2011-2015"]
["New York","Onondaga","36067003200","Low-Income Community","2011-2015"]
["New York","Onondaga","36067003400","Low-Income Community","2011-2015"]
["New York","Onondaga","36067003500","Low-Income Community","2011-2015"]
["New York","Onondaga","36067003900","Low-Income Community","2011-2015"]
["New York","Onondaga","36067004000","Low-Income Community","2011-2015"]
["New York","Onondaga","36067004200","Low-Income Community","2011-2015"]
["New York","Onondaga","36067005200","Low-Income Community","2011-2015"]
["New York","Onondaga","36067005300","Low-Income Community","2011-2015"]
["New York","Onondaga","36067005400","Low-Income Community","2011-2015"]
["New York","Ontario","36069051000","Low-Income Community","2011-2015"]
["New York","Ontario","36069051100","Low-Income Community","2011-2015"]
["New York","Ontario","36069051800","Low-Income Community","2011-2015"]
["New York","Orange","36071000300","Low-Income Community","2011-2015"]
["New York","Orange","36071000400","Low-Income Community","2011-2015"]
["New York","Orange","36071001500","Low-Income Community","2011-2015"]
["New York","Orange","36071002200","Low-Income Community","2011-2015"]
["New York","Orange","36071002300","Low-Income Community","2011-2015"]
["New York","Orange","36071015100","Low-Income Community","2011-2015"]
["New York","Orleans","36073040700","Low-Income Community","2011-2015"]
["New York","Oswego","36075020301","Low-Income Community","2011-2015"]
["New York","Oswego","36075020302","Low-Income Community","2011-2015"]
["New York","Oswego","36075021102","Low-Income Community","2011-2015"]
["New York","Oswego","36075021605","Low-Income Community","2011-2015"]
["New York","Otsego","36077591100","Low-Income Community","2011-2015"]
["New York","Queens","36081000100","Non-LIC Contiguous","2011-2015"]
["New York","Queens","36081002500","Low-Income Community","2011-2015"]
["New York","Queens","36081003100","Low-Income Community","2011-2015"]
["New York","Queens","36081003300","Low-Income Community","2011-2015"]
["New York","Queens","36081003900","Low-Income Community","2011-2015"]
["New York","Queens","36081005100","Low-Income Community","2011-2015"]
["New York","Queens","36081005500","Low-Income Community","2011-2015"]
["New York","Queens","36081005700","Low-Income Community","2011-2015"]
["New York","Queens","36081007900","Low-Income Community","2011-2015"]
["New York","Queens","36081008500","Low-Income Community","2011-2015"]
["New York","Queens","36081008700","Low-Income Community","2011-2015"]
["New York","Queens","36081011300","Low-Income Community","2011-2015"]
["New York","Queens","36081011400","Low-Income Community","2011-2015"]
["New York","Queens","36081011600","Low-Income Community","2011-2015"]
["New York","Queens","36081011900","Low-Income Community","2011-2015"]
["New York","Queens","36081014202","Low-Income Community","2011-2015"]
["New York","Queens","36081014400","Low-Income Community","2011-2015"]
["New York","Queens","36081015700","Low-Income Community","2011-2015"]
["New York","Queens","36081015900","Low-Income Community","2011-2015"]
["New York","Queens","36081017900","Low-Income Community","2011-2015"]
["New York","Queens","36081018101","Low-Income Community","2011-2015"]
["New York","Queens","36081018900","Low-Income Community","2011-2015"]
["New York","Queens","36081019600","Low-Income Community","2011-2015"]
["New York","Queens","36081019900","Non-LIC Contiguous","2011-2015"]
["New York","Queens","36081020400","Low-Income Community","2011-2015"]
["New York","Queens","36081020500","Low-Income Community","2011-2015"]
["New York","Queens","36081020800","Low-Income Community","2011-2015"]
["New York","Queens","36081021200","Low-Income Community","2011-2015"]
["New York","Queens","36081024000","Low-Income Community","2011-2015"]
["New York","Queens","36081025400","Low-Income Community","2011-2015"]
["New York","Queens","36081026000","Low-Income Community","2011-2015"]
["New York","Queens","36081026901","Low-Income Community","2011-2015"]
["New York","Queens","36081028300","Low-Income Community","2011-2015"]
["New York","Queens","36081030600","Non-LIC Contiguous","2011-2015"]
["New York","Queens","36081032000","Low-Income Community","2011-2015"]
["New York","Queens","36081041400","Low-Income Community","2011-2015"]
["New York","Queens","36081041500","Low-Income Community","2011-2015"]
["New York","Queens","36081044000","Low-Income Community","2011-2015"]
["New York","Queens","36081044400","Low-Income Community","2011-2015"]
["New York","Queens","36081044601","Low-Income Community","2011-2015"]
["New York","Queens","36081044602","Low-Income Community","2011-2015"]
["New York","Queens","36081066400","Non-LIC Contiguous","2011-2015"]
["New York","Queens","36081069300","Low-Income Community","2011-2015"]
["New York","Queens","36081071100","Low-Income Community","2011-2015"]
["New York","Queens","36081071304","Low-Income Community","2011-2015"]
["New York","Queens","36081071702","Low-Income Community","2011-2015"]
["New York","Queens","36081079200","Low-Income Community","2011-2015"]
["New York","Queens","36081084602","Low-Income Community","2011-2015"]
["New York","Queens","36081086900","Low-Income Community","2011-2015"]
["New York","Queens","36081087100","Low-Income Community","2011-2015"]
["New York","Queens","36081088901","Low-Income Community","2011-2015"]
["New York","Queens","36081092500","Low-Income Community","2011-2015"]
["New York","Queens","36081094201","Low-Income Community","2011-2015"]
["New York","Queens","36081097203","Low-Income Community","2011-2015"]
["New York","Queens","36081099200","Low-Income Community","2011-2015"]
["New York","Queens","36081099802","Low-Income Community","2011-2015"]
["New York","Queens","36081100802","Low-Income Community","2011-2015"]
["New York","Queens","36081101001","Low-Income Community","2011-2015"]
["New York","Queens","36081101002","Low-Income Community","2011-2015"]
["New York","Queens","36081103201","Low-Income Community","2011-2015"]
["New York","Queens","36081103202","Low-Income Community","2011-2015"]
["New York","Queens","36081117100","Low-Income Community","2011-2015"]
["New York","Rensselaer","36083040400","Low-Income Community","2011-2015"]
["New York","Rensselaer","36083040700","Low-Income Community","2011-2015"]
["New York","Rensselaer","36083040800","Low-Income Community","2011-2015"]
["New York","Rensselaer","36083051500","Low-Income Community","2011-2015"]
["New York","Richmond","36085000300","Non-LIC Contiguous","2011-2015"]
["New York","Richmond","36085000700","Low-Income Community","2011-2015"]
["New York","Richmond","36085001100","Low-Income Community","2011-2015"]
["New York","Richmond","36085002100","Low-Income Community","2011-2015"]
["New York","Richmond","36085013301","Low-Income Community","2011-2015"]
["New York","Richmond","36085020700","Low-Income Community","2011-2015"]
["New York","Richmond","36085022300","Low-Income Community","2011-2015"]
["New York","Richmond","36085031902","Low-Income Community","2011-2015"]
["New York","Rockland","36087010702","Low-Income Community","2011-2015"]
["New York","Rockland","36087010703","Low-Income Community","2011-2015"]
["New York","St. Lawrence","36089490100","Low-Income Community","2011-2015"]
["New York","St. Lawrence","36089490200","Low-Income Community","2011-2015"]
["New York","St. Lawrence","36089490300","Low-Income Community","2011-2015"]
["New York","St. Lawrence","36089490900","Low-Income Community","2011-2015"]
["New York","St. Lawrence","36089491400","Low-Income Community","2011-2015"]
["New York","St. Lawrence","36089491500","Low-Income Community","2011-2015"]
["New York","St. Lawrence","36089491600","Low-Income Community","2011-2015"]
["New York","Saratoga","36091060400","Low-Income Community","2011-2015"]
["New York","Schenectady","36093020200","Low-Income Community","2011-2015"]
["New York","Schenectady","36093021001","Low-Income Community","2011-2015"]
["New York","Schenectady","36093033500","Low-Income Community","2011-2015"]
["New York","Schoharie","36095740200","Non-LIC Contiguous","2011-2015"]
["New York","Schoharie","36095740400","Low-Income Community","2011-2015"]
["New York","Schuyler","36097950300","Low-Income Community","2011-2015"]
["New York","Schuyler","36097950500","Low-Income Community","2011-2015"]
["New York","Seneca","36099950600","Low-Income Community","2011-2015"]
["New York","Steuben","36101960700","Low-Income Community","2011-2015"]
["New York","Steuben","36101960800","Low-Income Community","2011-2015"]
["New York","Suffolk","36103110902","Low-Income Community","2011-2015"]
["New York","Suffolk","36103122501","Low-Income Community","2011-2015"]
["New York","Suffolk","36103146203","Low-Income Community","2011-2015"]
["New York","Suffolk","36103159103","Low-Income Community","2011-2015"]
["New York","Suffolk","36103169704","Non-LIC Contiguous","2011-2015"]
["New York","Suffolk","36103169800","Low-Income Community","2011-2015"]
["New York","Sullivan","36105950700","Low-Income Community","2011-2015"]
["New York","Sullivan","36105951500","Low-Income Community","2011-2015"]
["New York","Sullivan","36105951800","Low-Income Community","2011-2015"]
["New York","Tioga","36107020600","Non-LIC Contiguous","2011-2015"]
["New York","Tioga","36107020701","Low-Income Community","2011-2015"]
["New York","Tompkins","36109000800","Low-Income Community","2011-2015"]
["New York","Tompkins","36109001100","Low-Income Community","2011-2015"]
["New York","Ulster","36111951700","Low-Income Community","2011-2015"]
["New York","Ulster","36111952100","Low-Income Community","2011-2015"]
["New York","Ulster","36111952400","Low-Income Community","2011-2015"]
["New York","Ulster","36111954800","Low-Income Community","2011-2015"]
["New York","Warren","36113070200","Low-Income Community","2011-2015"]
["New York","Warren","36113074000","Low-Income Community","2011-2015"]
["New York","Washington","36115088000","Low-Income Community","2011-2015"]
["New York","Wayne","36117021100","Low-Income Community","2011-2015"]
["New York","Wayne","36117021200","Low-Income Community","2011-2015"]
["New York","Westchester","36119000300","Low-Income Community","2011-2015"]
["New York","Westchester","36119000401","Low-Income Community","2011-2015"]
["New York","Westchester","36119000600","Low-Income Community","2011-2015"]
["New York","Westchester","36119003100","Low-Income Community","2011-2015"]
["New York","Westchester","36119005800","Low-Income Community","2011-2015"]
["New York","Westchester","36119006100","Low-Income Community","2011-2015"]
["New York","Westchester","36119007900","Low-Income Community","2011-2015"]
["New York","Westchester","36119008000","Low-Income Community","2011-2015"]
["New York","Westchester","36119009300","Low-Income Community","2011-2015"]
["New York","Westchester","36119014300","Low-Income Community","2011-2015"]
["New York","Westchester","36119981000","Low-Income Community","2011-2015"]
["New York","Westchester","36119984000","Low-Income Community","2011-2015"]
["New York","Wyoming","36121970500","Low-Income Community","2011-2015"]
["North Carolina","Alamance","37001020300","Low-Income Community","2011-2015"]
["North Carolina","Alamance","37001020801","Low-Income Community","2011-2015"]
["North Carolina","Alamance","37001021000","Low-Income Community","2011-2015"]
["North Carolina","Alamance","37001021201","Low-Income Community","2011-2015"]
["North Carolina","Alexander","37003040400","Low-Income Community","2011-2015"]
["North Carolina","Alleghany","37005950200","Low-Income Community","2011-2015"]
["North Carolina","Anson","37007920500","Low-Income Community","2011-2015"]
["North Carolina","Ashe","37009970400","Low-Income Community","2011-2015"]
["North Carolina","Avery","37011930302","Low-Income Community","2011-2015"]
["North Carolina","Beaufort","37013930400","Low-Income Community","2011-2015"]
["North Carolina","Bertie","37015960200","Low-Income Community","2011-2015"]
["North Carolina","Bladen","37017950400","Low-Income Community","2011-2015"]
["North Carolina","Brunswick","37019020101","Low-Income Community","2011-2015"]
["North Carolina","Brunswick","37019020104","Low-Income Community","2011-2015"]
["North Carolina","Brunswick","37019020602","Non-LIC Contiguous","2011-2015"]
["North Carolina","Buncombe","37021000200","Low-Income Community","2011-2015"]
["North Carolina","Buncombe","37021000700","Low-Income Community","2011-2015"]
["North Carolina","Buncombe","37021000900","Low-Income Community","2011-2015"]
["North Carolina","Buncombe","37021001400","Low-Income Community","2011-2015"]
["North Carolina","Buncombe","37021002000","Low-Income Community","2011-2015"]
["North Carolina","Burke","37023020301","Non-LIC Contiguous","2011-2015"]
["North Carolina","Burke","37023021100","Low-Income Community","2011-2015"]
["North Carolina","Burke","37023021400","Low-Income Community","2011-2015"]
["North Carolina","Cabarrus","37025041000","Low-Income Community","2011-2015"]
["North Carolina","Cabarrus","37025041902","Low-Income Community","2011-2015"]
["North Carolina","Cabarrus","37025042300","Low-Income Community","2011-2015"]
["North Carolina","Caldwell","37027030100","Low-Income Community","2011-2015"]
["North Carolina","Caldwell","37027030300","Low-Income Community","2011-2015"]
["North Carolina","Caldwell","37027030800","Low-Income Community","2011-2015"]
["North Carolina","Caldwell","37027031100","Low-Income Community","2011-2015"]
["North Carolina","Camden","37029950102","Non-LIC Contiguous","2011-2015"]
["North Carolina","Carteret","37031970304","Low-Income Community","2011-2015"]
["North Carolina","Carteret","37031970501","Low-Income Community","2011-2015"]
["North Carolina","Caswell","37033930300","Low-Income Community","2011-2015"]
["North Carolina","Catawba","37035010900","Low-Income Community","2011-2015"]
["North Carolina","Catawba","37035011300","Low-Income Community","2011-2015"]
["North Carolina","Chatham","37037020300","Low-Income Community","2011-2015"]
["North Carolina","Chatham","37037020600","Low-Income Community","2011-2015"]
["North Carolina","Chatham","37037020702","Non-LIC Contiguous","2011-2015"]
["North Carolina","Cherokee","37039930200","Low-Income Community","2011-2015"]
["North Carolina","Chowan","37041930200","Low-Income Community","2011-2015"]
["North Carolina","Clay","37043950200","Low-Income Community","2011-2015"]
["North Carolina","Cleveland","37045950500","Low-Income Community","2011-2015"]
["North Carolina","Cleveland","37045951000","Low-Income Community","2011-2015"]
["North Carolina","Columbus","37047930600","Low-Income Community","2011-2015"]
["North Carolina","Columbus","37047930900","Low-Income Community","2011-2015"]
["North Carolina","Columbus","37047931200","Low-Income Community","2011-2015"]
["North Carolina","Craven","37049960900","Low-Income Community","2011-2015"]
["North Carolina","Cumberland","37051000200","Low-Income Community","2011-2015"]
["North Carolina","Cumberland","37051000500","Low-Income Community","2011-2015"]
["North Carolina","Cumberland","37051000702","Low-Income Community","2011-2015"]
["North Carolina","Cumberland","37051000800","Low-Income Community","2011-2015"]
["North Carolina","Cumberland","37051001000","Low-Income Community","2011-2015"]
["North Carolina","Cumberland","37051001100","Low-Income Community","2011-2015"]
["North Carolina","Cumberland","37051001604","Low-Income Community","2011-2015"]
["North Carolina","Cumberland","37051003203","Low-Income Community","2011-2015"]
["North Carolina","Cumberland","37051003800","Low-Income Community","2011-2015"]
["North Carolina","Currituck","37053110302","Low-Income Community","2011-2015"]
["North Carolina","Dare","37055970501","Low-Income Community","2011-2015"]
["North Carolina","Davidson","37057060700","Low-Income Community","2011-2015"]
["North Carolina","Davidson","37057061400","Low-Income Community","2011-2015"]
["North Carolina","Davie","37059080500","Low-Income Community","2011-2015"]
["North Carolina","Duplin","37061090300","Low-Income Community","2011-2015"]
["North Carolina","Duplin","37061090702","Low-Income Community","2011-2015"]
["North Carolina","Durham","37063001001","Low-Income Community","2011-2015"]
["North Carolina","Durham","37063001100","Low-Income Community","2011-2015"]
["North Carolina","Durham","37063001304","Low-Income Community","2011-2015"]
["North Carolina","Durham","37063001400","Low-Income Community","2011-2015"]
["North Carolina","Durham","37063001502","Low-Income Community","2011-2015"]
["North Carolina","Durham","37063002016","Low-Income Community","2011-2015"]
["North Carolina","Durham","37063002300","Low-Income Community","2011-2015"]
["North Carolina","Edgecombe","37065020200","Low-Income Community","2011-2015"]
["North Carolina","Edgecombe","37065020400","Low-Income Community","2011-2015"]
["North Carolina","Edgecombe","37065020900","Low-Income Community","2011-2015"]
["North Carolina","Edgecombe","37065021000","Low-Income Community","2011-2015"]
["North Carolina","Edgecombe","37065021300","Non-LIC Contiguous","2011-2015"]
["North Carolina","Forsyth","37067000100","Low-Income Community","2011-2015"]
["North Carolina","Forsyth","37067000200","Low-Income Community","2011-2015"]
["North Carolina","Forsyth","37067000301","Low-Income Community","2011-2015"]
["North Carolina","Forsyth","37067000302","Low-Income Community","2011-2015"]
["North Carolina","Forsyth","37067000700","Low-Income Community","2011-2015"]
["North Carolina","Forsyth","37067000801","Low-Income Community","2011-2015"]
["North Carolina","Forsyth","37067000802","Low-Income Community","2011-2015"]
["North Carolina","Forsyth","37067001400","Low-Income Community","2011-2015"]
["North Carolina","Forsyth","37067001602","Low-Income Community","2011-2015"]
["North Carolina","Forsyth","37067001700","Low-Income Community","2011-2015"]
["North Carolina","Forsyth","37067003313","Low-Income Community","2011-2015"]
["North Carolina","Franklin","37069060600","Non-LIC Contiguous","2011-2015"]
["North Carolina","Franklin","37069060802","Low-Income Community","2011-2015"]
["North Carolina","Gaston","37071030601","Low-Income Community","2011-2015"]
["North Carolina","Gaston","37071031302","Low-Income Community","2011-2015"]
["North Carolina","Gaston","37071031401","Low-Income Community","2011-2015"]
["North Carolina","Gaston","37071031500","Low-Income Community","2011-2015"]
["North Carolina","Gaston","37071031600","Low-Income Community","2011-2015"]
["North Carolina","Gaston","37071031900","Low-Income Community","2011-2015"]
["North Carolina","Gaston","37071032000","Low-Income Community","2011-2015"]
["North Carolina","Gaston","37071032200","Low-Income Community","2011-2015"]
["North Carolina","Gaston","37071033400","Low-Income Community","2011-2015"]
["North Carolina","Gates","37073970200","Non-LIC Contiguous","2011-2015"]
["North Carolina","Graham","37075920300","Low-Income Community","2011-2015"]
["North Carolina","Granville","37077970300","Low-Income Community","2011-2015"]
["North Carolina","Greene","37079950101","Low-Income Community","2011-2015"]
["North Carolina","Guilford","37081010200","Low-Income Community","2011-2015"]
["North Carolina","Guilford","37081010300","Low-Income Community","2011-2015"]
["North Carolina","Guilford","37081010800","Low-Income Community","2011-2015"]
["North Carolina","Guilford","37081011000","Low-Income Community","2011-2015"]
["North Carolina","Guilford","37081011101","Low-Income Community","2011-2015"]
["North Carolina","Guilford","37081011102","Low-Income Community","2011-2015"]
["North Carolina","Guilford","37081011200","Low-Income Community","2011-2015"]
["North Carolina","Guilford","37081011300","Low-Income Community","2011-2015"]
["North Carolina","Guilford","37081011400","Low-Income Community","2011-2015"]
["North Carolina","Guilford","37081012803","Low-Income Community","2011-2015"]
["North Carolina","Guilford","37081013800","Low-Income Community","2011-2015"]
["North Carolina","Guilford","37081014300","Low-Income Community","2011-2015"]
["North Carolina","Halifax","37083930400","Low-Income Community","2011-2015"]
["North Carolina","Halifax","37083930900","Low-Income Community","2011-2015"]
["North Carolina","Harnett","37085070100","Low-Income Community","2011-2015"]
["North Carolina","Harnett","37085070200","Low-Income Community","2011-2015"]
["North Carolina","Harnett","37085070801","Low-Income Community","2011-2015"]
["North Carolina","Haywood","37087920300","Low-Income Community","2011-2015"]
["North Carolina","Henderson","37089931000","Low-Income Community","2011-2015"]
["North Carolina","Hertford","37091950100","Low-Income Community","2011-2015"]
["North Carolina","Hoke","37093970300","Low-Income Community","2011-2015"]
["North Carolina","Hyde","37095920100","Low-Income Community","2011-2015"]
["North Carolina","Iredell","37097060100","Low-Income Community","2011-2015"]
["North Carolina","Iredell","37097060200","Low-Income Community","2011-2015"]
["North Carolina","Iredell","37097061301","Low-Income Community","2011-2015"]
["North Carolina","Jackson","37099950600","Low-Income Community","2011-2015"]
["North Carolina","Johnston","37101040301","Low-Income Community","2011-2015"]
["North Carolina","Johnston","37101040400","Low-Income Community","2011-2015"]
["North Carolina","Johnston","37101040901","Low-Income Community","2011-2015"]
["North Carolina","Johnston","37101041001","Low-Income Community","2011-2015"]
["North Carolina","Jones","37103920100","Low-Income Community","2011-2015"]
["North Carolina","Lee","37105030200","Low-Income Community","2011-2015"]
["North Carolina","Lenoir","37107010100","Low-Income Community","2011-2015"]
["North Carolina","Lenoir","37107010800","Non-LIC Contiguous","2011-2015"]
["North Carolina","Lenoir","37107010900","Low-Income Community","2011-2015"]
["North Carolina","Lincoln","37109070800","Low-Income Community","2011-2015"]
["North Carolina","McDowell","37111970500","Low-Income Community","2011-2015"]
["North Carolina","McDowell","37111970700","Low-Income Community","2011-2015"]
["North Carolina","Macon","37113970301","Low-Income Community","2011-2015"]
["North Carolina","Madison","37115010200","Low-Income Community","2011-2015"]
["North Carolina","Martin","37117970200","Low-Income Community","2011-2015"]
["North Carolina","Mecklenburg","37119001606","Low-Income Community","2011-2015"]
["North Carolina","Mecklenburg","37119001607","Low-Income Community","2011-2015"]
["North Carolina","Mecklenburg","37119001702","Low-Income Community","2011-2015"]
["North Carolina","Mecklenburg","37119003902","Low-Income Community","2011-2015"]
["North Carolina","Mecklenburg","37119003903","Low-Income Community","2011-2015"]
["North Carolina","Mecklenburg","37119004000","Low-Income Community","2011-2015"]
["North Carolina","Mecklenburg","37119004100","Low-Income Community","2011-2015"]
["North Carolina","Mecklenburg","37119004200","Low-Income Community","2011-2015"]
["North Carolina","Mecklenburg","37119004500","Low-Income Community","2011-2015"]
["North Carolina","Mecklenburg","37119004600","Low-Income Community","2011-2015"]
["North Carolina","Mecklenburg","37119004700","Low-Income Community","2011-2015"]
["North Carolina","Mecklenburg","37119004800","Low-Income Community","2011-2015"]
["North Carolina","Mecklenburg","37119005100","Low-Income Community","2011-2015"]
["North Carolina","Mecklenburg","37119005200","Low-Income Community","2011-2015"]
["North Carolina","Mecklenburg","37119005301","Low-Income Community","2011-2015"]
["North Carolina","Mecklenburg","37119005305","Low-Income Community","2011-2015"]
["North Carolina","Mecklenburg","37119005306","Low-Income Community","2011-2015"]
["North Carolina","Mitchell","37121950300","Low-Income Community","2011-2015"]
["North Carolina","Montgomery","37123960100","Low-Income Community","2011-2015"]
["North Carolina","Moore","37125950200","Low-Income Community","2011-2015"]
["North Carolina","Nash","37127010400","Low-Income Community","2011-2015"]
["North Carolina","Nash","37127011500","Low-Income Community","2011-2015"]
["North Carolina","New Hanover","37129011000","Low-Income Community","2011-2015"]
["North Carolina","New Hanover","37129011100","Low-Income Community","2011-2015"]
["North Carolina","New Hanover","37129011200","Low-Income Community","2011-2015"]
["North Carolina","New Hanover","37129011903","Low-Income Community","2011-2015"]
["North Carolina","Northampton","37131920401","Low-Income Community","2011-2015"]
["North Carolina","Onslow","37133001101","Low-Income Community","2011-2015"]
["North Carolina","Onslow","37133002600","Low-Income Community","2011-2015"]
["North Carolina","Orange","37135011400","Low-Income Community","2011-2015"]
["North Carolina","Pamlico","37137950102","Low-Income Community","2011-2015"]
["North Carolina","Pasquotank","37139960100","Low-Income Community","2011-2015"]
["North Carolina","Pasquotank","37139960200","Low-Income Community","2011-2015"]
["North Carolina","Pender","37141920601","Low-Income Community","2011-2015"]
["North Carolina","Pender","37141920602","Low-Income Community","2011-2015"]
["North Carolina","Perquimans","37143920201","Low-Income Community","2011-2015"]
["North Carolina","Person","37145920100","Low-Income Community","2011-2015"]
["North Carolina","Person","37145920200","Low-Income Community","2011-2015"]
["North Carolina","Pitt","37147000701","Low-Income Community","2011-2015"]
["North Carolina","Pitt","37147000702","Low-Income Community","2011-2015"]
["North Carolina","Pitt","37147000800","Low-Income Community","2011-2015"]
["North Carolina","Pitt","37147000900","Low-Income Community","2011-2015"]
["North Carolina","Pitt","37147001800","Low-Income Community","2011-2015"]
["North Carolina","Polk","37149920200","Non-LIC Contiguous","2011-2015"]
["North Carolina","Randolph","37151031000","Low-Income Community","2011-2015"]
["North Carolina","Randolph","37151031200","Low-Income Community","2011-2015"]
["North Carolina","Randolph","37151031400","Low-Income Community","2011-2015"]
["North Carolina","Richmond","37153970300","Low-Income Community","2011-2015"]
["North Carolina","Richmond","37153971100","Low-Income Community","2011-2015"]
["North Carolina","Robeson","37155960101","Low-Income Community","2011-2015"]
["North Carolina","Robeson","37155960102","Low-Income Community","2011-2015"]
["North Carolina","Robeson","37155960201","Low-Income Community","2011-2015"]
["North Carolina","Robeson","37155960401","Low-Income Community","2011-2015"]
["North Carolina","Robeson","37155960502","Low-Income Community","2011-2015"]
["North Carolina","Robeson","37155960600","Low-Income Community","2011-2015"]
["North Carolina","Robeson","37155960801","Low-Income Community","2011-2015"]
["North Carolina","Rockingham","37157040200","Low-Income Community","2011-2015"]
["North Carolina","Rockingham","37157040900","Low-Income Community","2011-2015"]
["North Carolina","Rockingham","37157041300","Low-Income Community","2011-2015"]
["North Carolina","Rowan","37159050201","Low-Income Community","2011-2015"]
["North Carolina","Rowan","37159050202","Low-Income Community","2011-2015"]
["North Carolina","Rowan","37159050800","Low-Income Community","2011-2015"]
["North Carolina","Rowan","37159051700","Low-Income Community","2011-2015"]
["North Carolina","Rowan","37159052000","Low-Income Community","2011-2015"]
["North Carolina","Rutherford","37161960200","Low-Income Community","2011-2015"]
["North Carolina","Rutherford","37161960900","Low-Income Community","2011-2015"]
["North Carolina","Rutherford","37161961101","Low-Income Community","2011-2015"]
["North Carolina","Sampson","37163970100","Low-Income Community","2011-2015"]
["North Carolina","Sampson","37163970600","Low-Income Community","2011-2015"]
["North Carolina","Scotland","37165010400","Low-Income Community","2011-2015"]
["North Carolina","Stanly","37167931000","Low-Income Community","2011-2015"]
["North Carolina","Stokes","37169070501","Low-Income Community","2011-2015"]
["North Carolina","Surry","37171930400","Low-Income Community","2011-2015"]
["North Carolina","Surry","37171930600","Low-Income Community","2011-2015"]
["North Carolina","Surry","37171931002","Low-Income Community","2011-2015"]
["North Carolina","Swain","37173960200","Low-Income Community","2011-2015"]
["North Carolina","Transylvania","37175960100","Low-Income Community","2011-2015"]
["North Carolina","Tyrrell","37177960100","Low-Income Community","2011-2015"]
["North Carolina","Union","37179020601","Low-Income Community","2011-2015"]
["North Carolina","Union","37179020602","Low-Income Community","2011-2015"]
["North Carolina","Vance","37181960500","Low-Income Community","2011-2015"]
["North Carolina","Wake","37183050900","Low-Income Community","2011-2015"]
["North Carolina","Wake","37183052407","Low-Income Community","2011-2015"]
["North Carolina","Wake","37183052704","Low-Income Community","2011-2015"]
["North Carolina","Wake","37183052706","Low-Income Community","2011-2015"]
["North Carolina","Wake","37183052803","Low-Income Community","2011-2015"]
["North Carolina","Wake","37183052807","Low-Income Community","2011-2015"]
["North Carolina","Wake","37183053009","Low-Income Community","2011-2015"]
["North Carolina","Wake","37183053519","Low-Income Community","2011-2015"]
["North Carolina","Wake","37183054008","Low-Income Community","2011-2015"]
["North Carolina","Wake","37183054018","Low-Income Community","2011-2015"]
["North Carolina","Wake","37183054108","Low-Income Community","2011-2015"]
["North Carolina","Wake","37183054112","Low-Income Community","2011-2015"]
["North Carolina","Wake","37183054500","Low-Income Community","2011-2015"]
["North Carolina","Warren","37185950200","Low-Income Community","2011-2015"]
["North Carolina","Washington","37187950200","Low-Income Community","2011-2015"]
["North Carolina","Watauga","37189920601","Low-Income Community","2011-2015"]
["North Carolina","Wayne","37191000901","Low-Income Community","2011-2015"]
["North Carolina","Wayne","37191001500","Low-Income Community","2011-2015"]
["North Carolina","Wayne","37191001800","Low-Income Community","2011-2015"]
["North Carolina","Wayne","37191001900","Low-Income Community","2011-2015"]
["North Carolina","Wilkes","37193960600","Low-Income Community","2011-2015"]
["North Carolina","Wilkes","37193961001","Non-LIC Contiguous","2011-2015"]
["North Carolina","Wilkes","37193961100","Low-Income Community","2011-2015"]
["North Carolina","Wilson","37195000100","Low-Income Community","2011-2015"]
["North Carolina","Wilson","37195000801","Low-Income Community","2011-2015"]
["North Carolina","Wilson","37195001100","Non-LIC Contiguous","2011-2015"]
["North Carolina","Yadkin","37197050501","Low-Income Community","2011-2015"]
["North Carolina","Yancey","37199960300","Low-Income Community","2011-2015"]
["North Dakota","Barnes","38003968200","Low-Income Community","2011-2015"]
["North Dakota","Benson","38005940100","Low-Income Community","2011-2015"]
["North Dakota","Burleigh","38015010100","Low-Income Community","2011-2015"]
["North Dakota","Burleigh","38015010200","Low-Income Community","2011-2015"]
["North Dakota","Burleigh","38015010800","Low-Income Community","2011-2015"]
["North Dakota","Cass","38017000501","Low-Income Community","2011-2015"]
["North Dakota","Cass","38017000502","Low-Income Community","2011-2015"]
["North Dakota","Cass","38017000600","Low-Income Community","2011-2015"]
["North Dakota","Cass","38017000700","Low-Income Community","2011-2015"]
["North Dakota","Cass","38017010107","Low-Income Community","2011-2015"]
["North Dakota","Dickey","38021973400","Low-Income Community","2011-2015"]
["North Dakota","Emmons","38029966500","Low-Income Community","2011-2015"]
["North Dakota","Grand Forks","38035010100","Low-Income Community","2011-2015"]
["North Dakota","Grand Forks","38035010200","Low-Income Community","2011-2015"]
["North Dakota","Grand Forks","38035010600","Low-Income Community","2012-2016"]
["North Dakota","McKenzie","38053940100","Low-Income Community","2011-2015"]
["North Dakota","Morton","38059020500","Low-Income Community","2011-2015"]
["North Dakota","Rolette","38079941800","Low-Income Community","2011-2015"]
["North Dakota","Rolette","38079951600","Low-Income Community","2011-2015"]
["North Dakota","Rolette","38079951700","Low-Income Community","2011-2015"]
["North Dakota","Sioux","38085940900","Low-Income Community","2011-2015"]
["North Dakota","Stutsman","38093967800","Low-Income Community","2011-2015"]
["North Dakota","Walsh","38099958000","Low-Income Community","2011-2015"]
["North Dakota","Ward","38101010100","Low-Income Community","2012-2016"]
["North Dakota","Wells","38103959800","Low-Income Community","2011-2015"]
["Northern Mariana Islands","Rota ","69100950100","Low-Income Community","2011-2015"]
["Northern Mariana Islands","Saipan ","69110000100","Low-Income Community","2011-2015"]
["Northern Mariana Islands","Saipan ","69110000200","Low-Income Community","2011-2015"]
["Northern Mariana Islands","Saipan ","69110000300","Low-Income Community","2011-2015"]
["Northern Mariana Islands","Saipan ","69110000400","Low-Income Community","2011-2015"]
["Northern Mariana Islands","Saipan ","69110000500","Low-Income Community","2011-2015"]
["Northern Mariana Islands","Saipan ","69110000600","Low-Income Community","2011-2015"]
["Northern Mariana Islands","Saipan ","69110000700","Low-Income Community","2011-2015"]
["Northern Mariana Islands","Saipan ","69110000800","Low-Income Community","2011-2015"]
["Northern Mariana Islands","Saipan ","69110000900","Low-Income Community","2011-2015"]
["Northern Mariana Islands","Saipan ","69110001000","Low-Income Community","2011-2015"]
["Northern Mariana Islands","Saipan ","69110001100","Low-Income Community","2011-2015"]
["Northern Mariana Islands","Saipan ","69110001200","Low-Income Community","2011-2015"]
["Northern Mariana Islands","Saipan ","69110001300","Low-Income Community","2011-2015"]
["Northern Mariana Islands","Saipan ","69110001400","Low-Income Community","2011-2015"]
["Northern Mariana Islands","Saipan ","69110001500","Low-Income Community","2011-2015"]
["Northern Mariana Islands","Saipan ","69110001600","Low-Income Community","2011-2015"]
["Northern Mariana Islands","Saipan ","69110001700","Low-Income Community","2011-2015"]
["Northern Mariana Islands","Tinian ","69120950101","Low-Income Community","2011-2015"]
["Northern Mariana Islands","Tinian ","69120950200","Low-Income Community","2011-2015"]
["Ohio","Adams","39001770200","Low-Income Community","2011-2015"]
["Ohio","Allen","39003012600","Low-Income Community","2011-2015"]
["Ohio","Allen","39003012900","Low-Income Community","2011-2015"]
["Ohio","Allen","39003014100","Low-Income Community","2011-2015"]
["Ohio","Ashtabula","39007000103","Low-Income Community","2011-2015"]
["Ohio","Ashtabula","39007000400","Low-Income Community","2011-2015"]
["Ohio","Athens","39009972800","Low-Income Community","2011-2015"]
["Ohio","Athens","39009973400","Low-Income Community","2011-2015"]
["Ohio","Athens","39009973800","Low-Income Community","2011-2015"]
["Ohio","Athens","39009973902","Low-Income Community","2011-2015"]
["Ohio","Belmont","39013010802","Low-Income Community","2011-2015"]
["Ohio","Belmont","39013011700","Low-Income Community","2011-2015"]
["Ohio","Brown","39015951202","Low-Income Community","2011-2015"]
["Ohio","Brown","39015951300","Low-Income Community","2011-2015"]
["Ohio","Butler","39017000300","Low-Income Community","2011-2015"]
["Ohio","Butler","39017010906","Low-Income Community","2011-2015"]
["Ohio","Butler","39017010909","Low-Income Community","2011-2015"]
["Ohio","Butler","39017012200","Low-Income Community","2011-2015"]
["Ohio","Butler","39017014700","Low-Income Community","2011-2015"]
["Ohio","Carroll","39019720500","Low-Income Community","2011-2015"]
["Ohio","Champaign","39021010500","Low-Income Community","2011-2015"]
["Ohio","Clark","39023000200","Low-Income Community","2011-2015"]
["Ohio","Clark","39023000300","Low-Income Community","2011-2015"]
["Ohio","Clark","39023000901","Low-Income Community","2011-2015"]
["Ohio","Clark","39023003400","Low-Income Community","2011-2015"]
["Ohio","Clermont","39025040900","Low-Income Community","2011-2015"]
["Ohio","Clermont","39025041306","Low-Income Community","2011-2015"]
["Ohio","Clinton","39027964700","Low-Income Community","2011-2015"]
["Ohio","Columbiana","39029951800","Low-Income Community","2011-2015"]
["Ohio","Crawford","39033974400","Low-Income Community","2011-2015"]
["Ohio","Crawford","39033974900","Low-Income Community","2011-2015"]
["Ohio","Cuyahoga","39035103300","Low-Income Community","2011-2015"]
["Ohio","Cuyahoga","39035103602","Low-Income Community","2011-2015"]
["Ohio","Cuyahoga","39035103900","Low-Income Community","2011-2015"]
["Ohio","Cuyahoga","39035104100","Low-Income Community","2011-2015"]
["Ohio","Cuyahoga","39035104200","Low-Income Community","2011-2015"]
["Ohio","Cuyahoga","39035104300","Low-Income Community","2011-2015"]
["Ohio","Cuyahoga","39035104400","Low-Income Community","2011-2015"]
["Ohio","Cuyahoga","39035104600","Low-Income Community","2011-2015"]
["Ohio","Cuyahoga","39035104800","Low-Income Community","2011-2015"]
["Ohio","Cuyahoga","39035104900","Low-Income Community","2011-2015"]
["Ohio","Cuyahoga","39035105500","Low-Income Community","2011-2015"]
["Ohio","Cuyahoga","39035107101","Low-Income Community","2011-2015"]
["Ohio","Cuyahoga","39035107701","Low-Income Community","2011-2015"]
["Ohio","Cuyahoga","39035107802","Low-Income Community","2011-2015"]
["Ohio","Cuyahoga","39035108301","Low-Income Community","2011-2015"]
["Ohio","Cuyahoga","39035108701","Low-Income Community","2011-2015"]
["Ohio","Cuyahoga","39035111202","Low-Income Community","2011-2015"]
["Ohio","Cuyahoga","39035112301","Low-Income Community","2011-2015"]
["Ohio","Cuyahoga","39035112800","Low-Income Community","2011-2015"]
["Ohio","Cuyahoga","39035113101","Low-Income Community","2011-2015"]
["Ohio","Cuyahoga","39035113500","Low-Income Community","2011-2015"]
["Ohio","Cuyahoga","39035113600","Low-Income Community","2011-2015"]
["Ohio","Cuyahoga","39035113801","Low-Income Community","2011-2015"]
["Ohio","Cuyahoga","39035114100","Low-Income Community","2011-2015"]
["Ohio","Cuyahoga","39035114300","Low-Income Community","2011-2015"]
["Ohio","Cuyahoga","39035114501","Low-Income Community","2011-2015"]
["Ohio","Cuyahoga","39035114600","Low-Income Community","2011-2015"]
["Ohio","Cuyahoga","39035114700","Low-Income Community","2011-2015"]
["Ohio","Cuyahoga","39035116400","Low-Income Community","2011-2015"]
["Ohio","Cuyahoga","39035116500","Low-Income Community","2011-2015"]
["Ohio","Cuyahoga","39035116600","Low-Income Community","2011-2015"]
["Ohio","Cuyahoga","39035117600","Low-Income Community","2011-2015"]
["Ohio","Cuyahoga","39035117700","Low-Income Community","2011-2015"]
["Ohio","Cuyahoga","39035117800","Low-Income Community","2011-2015"]
["Ohio","Cuyahoga","39035118101","Low-Income Community","2011-2015"]
["Ohio","Cuyahoga","39035118200","Low-Income Community","2011-2015"]
["Ohio","Cuyahoga","39035118301","Low-Income Community","2011-2015"]
["Ohio","Cuyahoga","39035118400","Low-Income Community","2011-2015"]
["Ohio","Cuyahoga","39035118500","Low-Income Community","2011-2015"]
["Ohio","Cuyahoga","39035118602","Low-Income Community","2011-2015"]
["Ohio","Cuyahoga","39035118700","Low-Income Community","2011-2015"]
["Ohio","Cuyahoga","39035118800","Low-Income Community","2011-2015"]
["Ohio","Cuyahoga","39035118900","Low-Income Community","2011-2015"]
["Ohio","Cuyahoga","39035119100","Low-Income Community","2011-2015"]
["Ohio","Cuyahoga","39035119202","Low-Income Community","2011-2015"]
["Ohio","Cuyahoga","39035119300","Low-Income Community","2011-2015"]
["Ohio","Cuyahoga","39035119600","Low-Income Community","2011-2015"]
["Ohio","Cuyahoga","39035133103","Low-Income Community","2011-2015"]
["Ohio","Cuyahoga","39035133104","Low-Income Community","2011-2015"]
["Ohio","Cuyahoga","39035138105","Low-Income Community","2011-2015"]
["Ohio","Cuyahoga","39035140301","Low-Income Community","2011-2015"]
["Ohio","Cuyahoga","39035152303","Low-Income Community","2012-2016"]
["Ohio","Cuyahoga","39035152502","Low-Income Community","2011-2015"]
["Ohio","Cuyahoga","39035152603","Low-Income Community","2011-2015"]
["Ohio","Cuyahoga","39035152701","Low-Income Community","2011-2015"]
["Ohio","Cuyahoga","39035154501","Low-Income Community","2011-2015"]
["Ohio","Cuyahoga","39035171102","Low-Income Community","2011-2015"]
["Ohio","Cuyahoga","39035180104","Low-Income Community","2011-2015"]
["Ohio","Cuyahoga","39035188104","Low-Income Community","2011-2015"]
["Ohio","Cuyahoga","39035188105","Low-Income Community","2011-2015"]
["Ohio","Cuyahoga","39035188107","Low-Income Community","2011-2015"]
["Ohio","Cuyahoga","39035193800","Low-Income Community","2011-2015"]
["Ohio","Cuyahoga","39035196200","Low-Income Community","2011-2015"]
["Ohio","Cuyahoga","39035196500","Low-Income Community","2011-2015"]
["Ohio","Defiance","39039958500","Low-Income Community","2011-2015"]
["Ohio","Defiance","39039958600","Low-Income Community","2011-2015"]
["Ohio","Erie","39043040500","Low-Income Community","2011-2015"]
["Ohio","Erie","39043040800","Low-Income Community","2011-2015"]
["Ohio","Fairfield","39045031700","Low-Income Community","2011-2015"]
["Ohio","Fairfield","39045032200","Low-Income Community","2011-2015"]
["Ohio","Fayette","39047926200","Low-Income Community","2011-2015"]
["Ohio","Franklin","39049000720","Low-Income Community","2011-2015"]
["Ohio","Franklin","39049001122","Low-Income Community","2011-2015"]
["Ohio","Franklin","39049001400","Low-Income Community","2011-2015"]
["Ohio","Franklin","39049001600","Low-Income Community","2011-2015"]
["Ohio","Franklin","39049001700","Low-Income Community","2011-2015"]
["Ohio","Franklin","39049002300","Low-Income Community","2011-2015"]
["Ohio","Franklin","39049002800","Low-Income Community","2011-2015"]
["Ohio","Franklin","39049002900","Low-Income Community","2011-2015"]
["Ohio","Franklin","39049003600","Low-Income Community","2011-2015"]
["Ohio","Franklin","39049003700","Low-Income Community","2011-2015"]
["Ohio","Franklin","39049003800","Low-Income Community","2011-2015"]
["Ohio","Franklin","39049004200","Low-Income Community","2011-2015"]
["Ohio","Franklin","39049004300","Low-Income Community","2011-2015"]
["Ohio","Franklin","39049004900","Low-Income Community","2011-2015"]
["Ohio","Franklin","39049005000","Low-Income Community","2011-2015"]
["Ohio","Franklin","39049005100","Low-Income Community","2011-2015"]
["Ohio","Franklin","39049005300","Low-Income Community","2011-2015"]
["Ohio","Franklin","39049005500","Low-Income Community","2011-2015"]
["Ohio","Franklin","39049005610","Low-Income Community","2011-2015"]
["Ohio","Franklin","39049005620","Low-Income Community","2011-2015"]
["Ohio","Franklin","39049006000","Low-Income Community","2011-2015"]
["Ohio","Franklin","39049006933","Low-Income Community","2011-2015"]
["Ohio","Franklin","39049007043","Low-Income Community","2011-2015"]
["Ohio","Franklin","39049007531","Low-Income Community","2011-2015"]
["Ohio","Franklin","39049007534","Low-Income Community","2011-2015"]
["Ohio","Franklin","39049007550","Low-Income Community","2011-2015"]
["Ohio","Franklin","39049007710","Low-Income Community","2011-2015"]
["Ohio","Franklin","39049007721","Low-Income Community","2011-2015"]
["Ohio","Franklin","39049007812","Low-Income Community","2011-2015"]
["Ohio","Franklin","39049007820","Low-Income Community","2011-2015"]
["Ohio","Franklin","39049008110","Low-Income Community","2011-2015"]
["Ohio","Franklin","39049008210","Low-Income Community","2011-2015"]
["Ohio","Franklin","39049008230","Low-Income Community","2011-2015"]
["Ohio","Franklin","39049008811","Low-Income Community","2011-2015"]
["Ohio","Franklin","39049008812","Low-Income Community","2011-2015"]
["Ohio","Franklin","39049008821","Low-Income Community","2011-2015"]
["Ohio","Franklin","39049009210","Low-Income Community","2011-2015"]
["Ohio","Franklin","39049009325","Low-Income Community","2011-2015"]
["Ohio","Franklin","39049009383","Low-Income Community","2011-2015"]
["Ohio","Franklin","39049009590","Low-Income Community","2011-2015"]
["Ohio","Franklin","39049009600","Low-Income Community","2011-2015"]
["Ohio","Franklin","39049009900","Low-Income Community","2011-2015"]
["Ohio","Franklin","39049010300","Low-Income Community","2011-2015"]
["Ohio","Gallia","39053953600","Low-Income Community","2011-2015"]
["Ohio","Geauga","39055312400","Low-Income Community","2011-2015"]
["Ohio","Greene","39057240200","Low-Income Community","2011-2015"]
["Ohio","Greene","39057240600","Low-Income Community","2011-2015"]
["Ohio","Guernsey","39059977900","Low-Income Community","2011-2015"]
["Ohio","Hamilton","39061000200","Low-Income Community","2011-2015"]
["Ohio","Hamilton","39061000900","Low-Income Community","2011-2015"]
["Ohio","Hamilton","39061001000","Low-Income Community","2011-2015"]
["Ohio","Hamilton","39061001100","Low-Income Community","2011-2015"]
["Ohio","Hamilton","39061001600","Low-Income Community","2011-2015"]
["Ohio","Hamilton","39061001700","Low-Income Community","2011-2015"]
["Ohio","Hamilton","39061002800","Low-Income Community","2011-2015"]
["Ohio","Hamilton","39061003800","Low-Income Community","2011-2015"]
["Ohio","Hamilton","39061005500","Low-Income Community","2011-2015"]
["Ohio","Hamilton","39061006300","Low-Income Community","2011-2015"]
["Ohio","Hamilton","39061006400","Low-Income Community","2011-2015"]
["Ohio","Hamilton","39061006800","Low-Income Community","2011-2015"]
["Ohio","Hamilton","39061006900","Low-Income Community","2011-2015"]
["Ohio","Hamilton","39061007400","Low-Income Community","2011-2015"]
["Ohio","Hamilton","39061007700","Low-Income Community","2011-2015"]
["Ohio","Hamilton","39061007800","Low-Income Community","2011-2015"]
["Ohio","Hamilton","39061008202","Low-Income Community","2011-2015"]
["Ohio","Hamilton","39061008601","Low-Income Community","2011-2015"]
["Ohio","Hamilton","39061009200","Low-Income Community","2011-2015"]
["Ohio","Hamilton","39061009400","Low-Income Community","2011-2015"]
["Ohio","Hamilton","39061021504","Low-Income Community","2011-2015"]
["Ohio","Hamilton","39061022700","Low-Income Community","2011-2015"]
["Ohio","Hamilton","39061025600","Low-Income Community","2011-2015"]
["Ohio","Hamilton","39061026300","Low-Income Community","2011-2015"]
["Ohio","Hamilton","39061026400","Low-Income Community","2011-2015"]
["Ohio","Hamilton","39061026500","Low-Income Community","2011-2015"]
["Ohio","Hamilton","39061027000","Low-Income Community","2011-2015"]
["Ohio","Hamilton","39061027100","Low-Income Community","2011-2015"]
["Ohio","Hamilton","39061027200","Low-Income Community","2011-2015"]
["Ohio","Hamilton","39061027400","Low-Income Community","2011-2015"]
["Ohio","Hancock","39063000100","Low-Income Community","2011-2015"]
["Ohio","Harrison","39067975600","Low-Income Community","2011-2015"]
["Ohio","Henry","39069000400","Low-Income Community","2011-2015"]
["Ohio","Highland","39071954400","Low-Income Community","2011-2015"]
["Ohio","Highland","39071954800","Low-Income Community","2011-2015"]
["Ohio","Hocking","39073965200","Low-Income Community","2011-2015"]
["Ohio","Holmes","39075976600","Low-Income Community","2011-2015"]
["Ohio","Jackson","39079957200","Low-Income Community","2011-2015"]
["Ohio","Jackson","39079957700","Low-Income Community","2011-2015"]
["Ohio","Jefferson","39081000800","Low-Income Community","2011-2015"]
["Ohio","Jefferson","39081011800","Low-Income Community","2011-2015"]
["Ohio","Jefferson","39081012300","Low-Income Community","2011-2015"]
["Ohio","Knox","39083007100","Low-Income Community","2011-2015"]
["Ohio","Lake","39085204000","Low-Income Community","2011-2015"]
["Ohio","Lake","39085204500","Low-Income Community","2011-2015"]
["Ohio","Lawrence","39087050200","Low-Income Community","2011-2015"]
["Ohio","Lawrence","39087050700","Low-Income Community","2011-2015"]
["Ohio","Licking","39089753100","Low-Income Community","2011-2015"]
["Ohio","Licking","39089758300","Low-Income Community","2011-2015"]
["Ohio","Logan","39091004500","Low-Income Community","2011-2015"]
["Ohio","Lorain","39093022400","Low-Income Community","2011-2015"]
["Ohio","Lorain","39093023000","Low-Income Community","2011-2015"]
["Ohio","Lorain","39093023100","Low-Income Community","2011-2015"]
["Ohio","Lorain","39093070800","Low-Income Community","2011-2015"]
["Ohio","Lorain","39093097300","Low-Income Community","2011-2015"]
["Ohio","Lucas","39095000800","Low-Income Community","2011-2015"]
["Ohio","Lucas","39095001303","Low-Income Community","2012-2016"]
["Ohio","Lucas","39095001400","Low-Income Community","2011-2015"]
["Ohio","Lucas","39095001500","Low-Income Community","2011-2015"]
["Ohio","Lucas","39095001600","Low-Income Community","2011-2015"]
["Ohio","Lucas","39095001700","Low-Income Community","2011-2015"]
["Ohio","Lucas","39095002200","Low-Income Community","2011-2015"]
["Ohio","Lucas","39095002300","Low-Income Community","2011-2015"]
["Ohio","Lucas","39095002600","Low-Income Community","2011-2015"]
["Ohio","Lucas","39095002700","Low-Income Community","2011-2015"]
["Ohio","Lucas","39095002800","Low-Income Community","2011-2015"]
["Ohio","Lucas","39095002900","Low-Income Community","2011-2015"]
["Ohio","Lucas","39095003300","Low-Income Community","2011-2015"]
["Ohio","Lucas","39095003700","Low-Income Community","2011-2015"]
["Ohio","Lucas","39095004600","Low-Income Community","2011-2015"]
["Ohio","Lucas","39095004701","Low-Income Community","2011-2015"]
["Ohio","Lucas","39095005400","Low-Income Community","2011-2015"]
["Ohio","Mahoning","39099800600","Low-Income Community","2011-2015"]
["Ohio","Mahoning","39099801300","Low-Income Community","2011-2015"]
["Ohio","Mahoning","39099804000","Low-Income Community","2011-2015"]
["Ohio","Mahoning","39099810200","Low-Income Community","2011-2015"]
["Ohio","Mahoning","39099810800","Low-Income Community","2011-2015"]
["Ohio","Mahoning","39099811100","Non-LIC Contiguous","2011-2015"]
["Ohio","Mahoning","39099812400","Low-Income Community","2011-2015"]
["Ohio","Mahoning","39099813700","Low-Income Community","2011-2015"]
["Ohio","Mahoning","39099814000","Low-Income Community","2011-2015"]
["Ohio","Mahoning","39099814100","Low-Income Community","2011-2015"]
["Ohio","Marion","39101000100","Low-Income Community","2011-2015"]
["Ohio","Medina","39103408201","Low-Income Community","2011-2015"]
["Ohio","Medina","39103411002","Low-Income Community","2011-2015"]
["Ohio","Meigs","39105964400","Low-Income Community","2011-2015"]
["Ohio","Mercer","39107967400","Low-Income Community","2011-2015"]
["Ohio","Miami","39109315300","Low-Income Community","2011-2015"]
["Ohio","Monroe","39111966600","Low-Income Community","2011-2015"]
["Ohio","Montgomery","39113000400","Low-Income Community","2011-2015"]
["Ohio","Montgomery","39113000500","Low-Income Community","2011-2015"]
["Ohio","Montgomery","39113000900","Low-Income Community","2011-2015"]
["Ohio","Montgomery","39113001501","Low-Income Community","2011-2015"]
["Ohio","Montgomery","39113001700","Low-Income Community","2011-2015"]
["Ohio","Montgomery","39113001800","Low-Income Community","2011-2015"]
["Ohio","Montgomery","39113001900","Low-Income Community","2011-2015"]
["Ohio","Montgomery","39113002000","Low-Income Community","2011-2015"]
["Ohio","Montgomery","39113003402","Low-Income Community","2011-2015"]
["Ohio","Montgomery","39113003404","Low-Income Community","2011-2015"]
["Ohio","Montgomery","39113003500","Low-Income Community","2011-2015"]
["Ohio","Montgomery","39113004100","Low-Income Community","2011-2015"]
["Ohio","Montgomery","39113004200","Low-Income Community","2011-2015"]
["Ohio","Montgomery","39113004600","Low-Income Community","2011-2015"]
["Ohio","Montgomery","39113070300","Low-Income Community","2011-2015"]
["Ohio","Montgomery","39113080400","Low-Income Community","2011-2015"]
["Ohio","Montgomery","39113165100","Low-Income Community","2011-2015"]
["Ohio","Montgomery","39113165200","Low-Income Community","2011-2015"]
["Ohio","Morgan","39115968900","Low-Income Community","2011-2015"]
["Ohio","Muskingum","39119911800","Low-Income Community","2011-2015"]
["Ohio","Muskingum","39119912100","Low-Income Community","2011-2015"]
["Ohio","Noble","39121968500","Low-Income Community","2011-2015"]
["Ohio","Perry","39127965900","Non-LIC Contiguous","2011-2015"]
["Ohio","Perry","39127966200","Low-Income Community","2011-2015"]
["Ohio","Pickaway","39129020400","Low-Income Community","2011-2015"]
["Ohio","Pike","39131952300","Low-Income Community","2011-2015"]
["Ohio","Portage","39133600603","Low-Income Community","2011-2015"]
["Ohio","Richland","39139000500","Low-Income Community","2011-2015"]
["Ohio","Richland","39139000600","Low-Income Community","2011-2015"]
["Ohio","Richland","39139003100","Low-Income Community","2011-2015"]
["Ohio","Ross","39141955603","Low-Income Community","2011-2015"]
["Ohio","Ross","39141956300","Low-Income Community","2011-2015"]
["Ohio","Ross","39141956500","Low-Income Community","2011-2015"]
["Ohio","Sandusky","39143961600","Low-Income Community","2011-2015"]
["Ohio","Scioto","39145002600","Low-Income Community","2011-2015"]
["Ohio","Scioto","39145003100","Low-Income Community","2011-2015"]
["Ohio","Scioto","39145003500","Low-Income Community","2011-2015"]
["Ohio","Scioto","39145003600","Low-Income Community","2011-2015"]
["Ohio","Seneca","39147963200","Low-Income Community","2011-2015"]
["Ohio","Stark","39151700100","Low-Income Community","2011-2015"]
["Ohio","Stark","39151700800","Low-Income Community","2011-2015"]
["Ohio","Stark","39151701100","Low-Income Community","2011-2015"]
["Ohio","Stark","39151701300","Low-Income Community","2011-2015"]
["Ohio","Stark","39151710400","Low-Income Community","2011-2015"]
["Ohio","Stark","39151711600","Non-LIC Contiguous","2011-2015"]
["Ohio","Stark","39151714200","Low-Income Community","2011-2015"]
["Ohio","Stark","39151715000","Low-Income Community","2011-2015"]
["Ohio","Summit","39153502101","Low-Income Community","2011-2015"]
["Ohio","Summit","39153502102","Low-Income Community","2011-2015"]
["Ohio","Summit","39153502200","Low-Income Community","2011-2015"]
["Ohio","Summit","39153503600","Low-Income Community","2011-2015"]
["Ohio","Summit","39153503800","Low-Income Community","2011-2015"]
["Ohio","Summit","39153505400","Low-Income Community","2011-2015"]
["Ohio","Summit","39153505600","Low-Income Community","2011-2015"]
["Ohio","Summit","39153505700","Low-Income Community","2011-2015"]
["Ohio","Summit","39153505900","Low-Income Community","2011-2015"]
["Ohio","Summit","39153506800","Low-Income Community","2011-2015"]
["Ohio","Summit","39153508301","Low-Income Community","2011-2015"]
["Ohio","Summit","39153508399","Low-Income Community","2011-2015"]
["Ohio","Summit","39153508900","Low-Income Community","2011-2015"]
["Ohio","Summit","39153510100","Low-Income Community","2011-2015"]
["Ohio","Summit","39153510301","Low-Income Community","2011-2015"]
["Ohio","Summit","39153520400","Low-Income Community","2011-2015"]
["Ohio","Trumbull","39155920500","Low-Income Community","2011-2015"]
["Ohio","Trumbull","39155921100","Low-Income Community","2011-2015"]
["Ohio","Trumbull","39155921200","Low-Income Community","2011-2015"]
["Ohio","Trumbull","39155933800","Low-Income Community","2011-2015"]
["Ohio","Trumbull","39155933900","Low-Income Community","2011-2015"]
["Ohio","Tuscarawas","39157021100","Low-Income Community","2011-2015"]
["Ohio","Tuscarawas","39157022001","Low-Income Community","2011-2015"]
["Ohio","Union","39159050500","Low-Income Community","2011-2015"]
["Ohio","Van Wert","39161020600","Low-Income Community","2011-2015"]
["Ohio","Van Wert","39161020700","Low-Income Community","2011-2015"]
["Ohio","Vinton","39163953100","Low-Income Community","2011-2015"]
["Ohio","Warren","39165030200","Low-Income Community","2011-2015"]
["Ohio","Washington","39167020500","Low-Income Community","2011-2015"]
["Ohio","Wayne","39169001200","Low-Income Community","2011-2015"]
["Ohio","Wayne","39169003400","Low-Income Community","2011-2015"]
["Ohio","Williams","39171950600","Low-Income Community","2011-2015"]
["Ohio","Wood","39173021701","Low-Income Community","2011-2015"]
["Ohio","Wyandot","39175938400","Low-Income Community","2011-2015"]
["Oklahoma","Adair","40001376900","Low-Income Community","2011-2015"]
["Oklahoma","Atoka","40005587700","Low-Income Community","2011-2015"]
["Oklahoma","Blaine","40011958800","Low-Income Community","2012-2016"]
["Oklahoma","Bryan","40013796300","Low-Income Community","2011-2015"]
["Oklahoma","Bryan","40013796500","Low-Income Community","2011-2015"]
["Oklahoma","Caddo","40015162100","Low-Income Community","2011-2015"]
["Oklahoma","Carter","40019892800","Low-Income Community","2011-2015"]
["Oklahoma","Cherokee","40021978100","Low-Income Community","2011-2015"]
["Oklahoma","Choctaw","40023967200","Low-Income Community","2011-2015"]
["Oklahoma","Cleveland","40027200700","Low-Income Community","2011-2015"]
["Oklahoma","Cleveland","40027201203","Low-Income Community","2011-2015"]
["Oklahoma","Cleveland","40027201404","Low-Income Community","2011-2015"]
["Oklahoma","Cleveland","40027202402","Non-LIC Contiguous","2011-2015"]
["Oklahoma","Comanche","40031001902","Low-Income Community","2011-2015"]
["Oklahoma","Comanche","40031002500","Low-Income Community","2011-2015"]
["Oklahoma","Craig","40035373300","Low-Income Community","2011-2015"]
["Oklahoma","Creek","40037020102","Low-Income Community","2011-2015"]
["Oklahoma","Creek","40037021000","Low-Income Community","2011-2015"]
["Oklahoma","Custer","40039950800","Low-Income Community","2011-2015"]
["Oklahoma","Custer","40039960600","Low-Income Community","2011-2015"]
["Oklahoma","Delaware","40041376000","Low-Income Community","2011-2015"]
["Oklahoma","Garfield","40047000100","Low-Income Community","2011-2015"]
["Oklahoma","Garfield","40047001500","Low-Income Community","2011-2015"]
["Oklahoma","Garvin","40049681400","Low-Income Community","2011-2015"]
["Oklahoma","Grady","40051000100","Low-Income Community","2011-2015"]
["Oklahoma","Jackson","40065968700","Low-Income Community","2011-2015"]
["Oklahoma","Johnston","40069660200","Low-Income Community","2011-2015"]
["Oklahoma","Kay","40071000100","Low-Income Community","2011-2015"]
["Oklahoma","Kay","40071001301","Low-Income Community","2011-2015"]
["Oklahoma","Kiowa","40075963700","Low-Income Community","2011-2015"]
["Oklahoma","Latimer","40077087200","Low-Income Community","2011-2015"]
["Oklahoma","Le Flore","40079040302","Low-Income Community","2011-2015"]
["Oklahoma","Le Flore","40079040303","Non-LIC Contiguous","2011-2015"]
["Oklahoma","Le Flore","40079040402","Low-Income Community","2011-2015"]
["Oklahoma","Logan","40083600300","Low-Income Community","2011-2015"]
["Oklahoma","Logan","40083600600","Low-Income Community","2011-2015"]
["Oklahoma","McCurtain","40089098200","Low-Income Community","2011-2015"]
["Oklahoma","McCurtain","40089098500","Low-Income Community","2011-2015"]
["Oklahoma","McCurtain","40089098600","Low-Income Community","2011-2015"]
["Oklahoma","McCurtain","40089098700","Low-Income Community","2011-2015"]
["Oklahoma","McIntosh","40091779700","Low-Income Community","2011-2015"]
["Oklahoma","McIntosh","40091780200","Low-Income Community","2011-2015"]
["Oklahoma","Marshall","40095094801","Low-Income Community","2011-2015"]
["Oklahoma","Marshall","40095094802","Non-LIC Contiguous","2011-2015"]
["Oklahoma","Mayes","40097040400","Low-Income Community","2011-2015"]
["Oklahoma","Muskogee","40101000400","Low-Income Community","2011-2015"]
["Oklahoma","Muskogee","40101000600","Low-Income Community","2011-2015"]
["Oklahoma","Okfuskee","40107080900","Low-Income Community","2011-2015"]
["Oklahoma","Oklahoma","40109100400","Low-Income Community","2011-2015"]
["Oklahoma","Oklahoma","40109101300","Low-Income Community","2011-2015"]
["Oklahoma","Oklahoma","40109101500","Low-Income Community","2011-2015"]
["Oklahoma","Oklahoma","40109102500","Low-Income Community","2011-2015"]
["Oklahoma","Oklahoma","40109102600","Low-Income Community","2011-2015"]
["Oklahoma","Oklahoma","40109102700","Low-Income Community","2011-2015"]
["Oklahoma","Oklahoma","40109103000","Low-Income Community","2011-2015"]
["Oklahoma","Oklahoma","40109103200","Low-Income Community","2011-2015"]
["Oklahoma","Oklahoma","40109103601","Low-Income Community","2011-2015"]
["Oklahoma","Oklahoma","40109103602","Low-Income Community","2011-2015"]
["Oklahoma","Oklahoma","40109103700","Low-Income Community","2011-2015"]
["Oklahoma","Oklahoma","40109103800","Low-Income Community","2011-2015"]
["Oklahoma","Oklahoma","40109105100","Low-Income Community","2011-2015"]
["Oklahoma","Oklahoma","40109105300","Low-Income Community","2011-2015"]
["Oklahoma","Oklahoma","40109106100","Low-Income Community","2011-2015"]
["Oklahoma","Oklahoma","40109106912","Low-Income Community","2011-2015"]
["Oklahoma","Oklahoma","40109106913","Low-Income Community","2011-2015"]
["Oklahoma","Oklahoma","40109107303","Low-Income Community","2011-2015"]
["Oklahoma","Oklahoma","40109108003","Low-Income Community","2011-2015"]
["Oklahoma","Oklahoma","40109108207","Low-Income Community","2011-2015"]
["Oklahoma","Oklahoma","40109109100","Low-Income Community","2011-2015"]
["Oklahoma","Okmulgee","40111000100","Low-Income Community","2011-2015"]
["Oklahoma","Okmulgee","40111000200","Low-Income Community","2011-2015"]
["Oklahoma","Osage","40113940002","Low-Income Community","2011-2015"]
["Oklahoma","Ottawa","40115574100","Low-Income Community","2011-2015"]
["Oklahoma","Ottawa","40115574600","Low-Income Community","2011-2015"]
["Oklahoma","Ottawa","40115574900","Low-Income Community","2011-2015"]
["Oklahoma","Pawnee","40117957500","Low-Income Community","2011-2015"]
["Oklahoma","Payne","40119010200","Low-Income Community","2011-2015"]
["Oklahoma","Payne","40119010700","Low-Income Community","2011-2015"]
["Oklahoma","Payne","40119011301","Low-Income Community","2012-2016"]
["Oklahoma","Payne","40119011302","Low-Income Community","2011-2015"]
["Oklahoma","Pittsburg","40121486400","Low-Income Community","2011-2015"]
["Oklahoma","Pontotoc","40123089000","Low-Income Community","2011-2015"]
["Oklahoma","Pontotoc","40123089100","Low-Income Community","2011-2015"]
["Oklahoma","Pottawatomie","40125500200","Low-Income Community","2011-2015"]
["Oklahoma","Pottawatomie","40125501001","Low-Income Community","2011-2015"]
["Oklahoma","Pottawatomie","40125501300","Low-Income Community","2011-2015"]
["Oklahoma","Rogers","40131050101","Low-Income Community","2011-2015"]
["Oklahoma","Seminole","40133583300","Low-Income Community","2011-2015"]
["Oklahoma","Seminole","40133583400","Low-Income Community","2011-2015"]
["Oklahoma","Seminole","40133583500","Low-Income Community","2011-2015"]
["Oklahoma","Seminole","40133583600","Low-Income Community","2011-2015"]
["Oklahoma","Sequoyah","40135030302","Low-Income Community","2011-2015"]
["Oklahoma","Stephens","40137000600","Low-Income Community","2011-2015"]
["Oklahoma","Tillman","40141070400","Low-Income Community","2011-2015"]
["Oklahoma","Tulsa","40143000100","Low-Income Community","2011-2015"]
["Oklahoma","Tulsa","40143000200","Low-Income Community","2011-2015"]
["Oklahoma","Tulsa","40143000900","Low-Income Community","2011-2015"]
["Oklahoma","Tulsa","40143001000","Low-Income Community","2011-2015"]
["Oklahoma","Tulsa","40143001200","Low-Income Community","2011-2015"]
["Oklahoma","Tulsa","40143002100","Low-Income Community","2011-2015"]
["Oklahoma","Tulsa","40143002301","Low-Income Community","2011-2015"]
["Oklahoma","Tulsa","40143002500","Low-Income Community","2011-2015"]
["Oklahoma","Tulsa","40143003400","Low-Income Community","2011-2015"]
["Oklahoma","Tulsa","40143004600","Low-Income Community","2011-2015"]
["Oklahoma","Tulsa","40143004900","Low-Income Community","2011-2015"]
["Oklahoma","Tulsa","40143005900","Low-Income Community","2011-2015"]
["Oklahoma","Tulsa","40143006200","Low-Income Community","2011-2015"]
["Oklahoma","Tulsa","40143006600","Low-Income Community","2011-2015"]
["Oklahoma","Tulsa","40143006801","Low-Income Community","2011-2015"]
["Oklahoma","Tulsa","40143007402","Low-Income Community","2011-2015"]
["Oklahoma","Tulsa","40143007608","Low-Income Community","2011-2015"]
["Oklahoma","Tulsa","40143008001","Low-Income Community","2011-2015"]
["Oklahoma","Tulsa","40143008002","Low-Income Community","2011-2015"]
["Oklahoma","Tulsa","40143009300","Low-Income Community","2011-2015"]
["Oklahoma","Tulsa","40143011100","Low-Income Community","2011-2015"]
["Oklahoma","Wagoner","40145030102","Low-Income Community","2011-2015"]
["Oklahoma","Washington","40147000300","Low-Income Community","2011-2015"]
["Oregon","Baker","41001950500","Low-Income Community","2011-2015"]
["Oregon","Benton","41003000100","Low-Income Community","2011-2015"]
["Oregon","Benton","41003010600","Low-Income Community","2011-2015"]
["Oregon","Clackamas","41005022107","Low-Income Community","2011-2015"]
["Oregon","Clackamas","41005022108","Low-Income Community","2011-2015"]
["Oregon","Clackamas","41005022201","Low-Income Community","2011-2015"]
["Oregon","Clackamas","41005022400","Non-LIC Contiguous","2011-2015"]
["Oregon","Clackamas","41005022500","Low-Income Community","2011-2015"]
["Oregon","Clackamas","41005024400","Low-Income Community","2012-2016"]
["Oregon","Clatsop","41007950300","Low-Income Community","2011-2015"]
["Oregon","Columbia","41009970700","Low-Income Community","2011-2015"]
["Oregon","Coos","41011000300","Low-Income Community","2011-2015"]
["Oregon","Coos","41011000504","Low-Income Community","2011-2015"]
["Oregon","Crook","41013950300","Low-Income Community","2011-2015"]
["Oregon","Curry","41015950100","Low-Income Community","2011-2015"]
["Oregon","Deschutes","41017000900","Low-Income Community","2011-2015"]
["Oregon","Deschutes","41017001500","Low-Income Community","2011-2015"]
["Oregon","Deschutes","41017001600","Low-Income Community","2011-2015"]
["Oregon","Deschutes","41017001800","Low-Income Community","2011-2015"]
["Oregon","Douglas","41019010000","Low-Income Community","2011-2015"]
["Oregon","Douglas","41019130000","Low-Income Community","2011-2015"]
["Oregon","Harney","41025960100","Low-Income Community","2011-2015"]
["Oregon","Hood River","41027950100","Non-LIC Contiguous","2011-2015"]
["Oregon","Hood River","41027950300","Low-Income Community","2011-2015"]
["Oregon","Jackson","41029000100","Low-Income Community","2011-2015"]
["Oregon","Jackson","41029001200","Low-Income Community","2011-2015"]
["Oregon","Jackson","41029001301","Low-Income Community","2011-2015"]
["Oregon","Jefferson","41031940000","Low-Income Community","2011-2015"]
["Oregon","Jefferson","41031960202","Low-Income Community","2011-2015"]
["Oregon","Josephine","41033360500","Low-Income Community","2011-2015"]
["Oregon","Klamath","41035970200","Low-Income Community","2011-2015"]
["Oregon","Klamath","41035971800","Low-Income Community","2011-2015"]
["Oregon","Lake","41037960200","Low-Income Community","2011-2015"]
["Oregon","Lane","41039003302","Low-Income Community","2011-2015"]
["Oregon","Lane","41039003600","Non-LIC Contiguous","2011-2015"]
["Oregon","Lane","41039003700","Low-Income Community","2011-2015"]
["Oregon","Lane","41039003900","Low-Income Community","2011-2015"]
["Oregon","Lane","41039004300","Low-Income Community","2011-2015"]
["Oregon","Lincoln","41041950304","Low-Income Community","2012-2016"]
["Oregon","Linn","41043020100","Low-Income Community","2011-2015"]
["Oregon","Linn","41043020400","Low-Income Community","2011-2015"]
["Oregon","Malheur","41045970300","Low-Income Community","2011-2015"]
["Oregon","Malheur","41045970500","Low-Income Community","2011-2015"]
["Oregon","Marion","41047000200","Low-Income Community","2011-2015"]
["Oregon","Marion","41047000300","Low-Income Community","2011-2015"]
["Oregon","Marion","41047001000","Low-Income Community","2011-2015"]
["Oregon","Marion","41047010303","Non-LIC Contiguous","2011-2015"]
["Oregon","Marion","41047010305","Low-Income Community","2011-2015"]
["Oregon","Multnomah","41051001101","Low-Income Community","2011-2015"]
["Oregon","Multnomah","41051002100","Low-Income Community","2011-2015"]
["Oregon","Multnomah","41051002303","Low-Income Community","2011-2015"]
["Oregon","Multnomah","41051005100","Low-Income Community","2011-2015"]
["Oregon","Multnomah","41051005600","Low-Income Community","2011-2015"]
["Oregon","Multnomah","41051005700","Non-LIC Contiguous","2011-2015"]
["Oregon","Multnomah","41051007300","Low-Income Community","2011-2015"]
["Oregon","Multnomah","41051008100","Low-Income Community","2011-2015"]
["Oregon","Multnomah","41051008201","Low-Income Community","2011-2015"]
["Oregon","Multnomah","41051009603","Low-Income Community","2011-2015"]
["Oregon","Multnomah","41051009604","Low-Income Community","2011-2015"]
["Oregon","Multnomah","41051009701","Low-Income Community","2011-2015"]
["Oregon","Multnomah","41051009801","Low-Income Community","2011-2015"]
["Oregon","Multnomah","41051010001","Low-Income Community","2011-2015"]
["Oregon","Multnomah","41051010100","Low-Income Community","2011-2015"]
["Oregon","Multnomah","41051010304","Low-Income Community","2011-2015"]
["Oregon","Multnomah","41051010600","Low-Income Community","2011-2015"]
["Oregon","Polk","41053005100","Low-Income Community","2011-2015"]
["Oregon","Polk","41053020202","Low-Income Community","2011-2015"]
["Oregon","Sherman","41055950100","Low-Income Community","2011-2015"]
["Oregon","Tillamook","41057960200","Low-Income Community","2011-2015"]
["Oregon","Umatilla","41059940000","Low-Income Community","2011-2015"]
["Oregon","Umatilla","41059950200","Low-Income Community","2011-2015"]
["Oregon","Umatilla","41059951000","Low-Income Community","2011-2015"]
["Oregon","Union","41061970800","Low-Income Community","2011-2015"]
["Oregon","Wasco","41065970400","Low-Income Community","2011-2015"]
["Oregon","Wasco","41065970500","Low-Income Community","2011-2015"]
["Oregon","Washington","41067030700","Low-Income Community","2011-2015"]
["Oregon","Washington","41067030900","Low-Income Community","2011-2015"]
["Oregon","Washington","41067031300","Low-Income Community","2011-2015"]
["Oregon","Washington","41067031402","Low-Income Community","2011-2015"]
["Oregon","Washington","41067032003","Low-Income Community","2011-2015"]
["Oregon","Washington","41067032005","Low-Income Community","2011-2015"]
["Oregon","Washington","41067032501","Low-Income Community","2011-2015"]
["Oregon","Washington","41067033200","Low-Income Community","2011-2015"]
["Oregon","Yamhill","41071030202","Low-Income Community","2011-2015"]
["Oregon","Yamhill","41071030502","Low-Income Community","2011-2015"]
["Oregon","Yamhill","41071030601","Low-Income Community","2011-2015"]
["Pennsylvania","Allegheny","42003010300","Low-Income Community","2011-2015"]
["Pennsylvania","Allegheny","42003030500","Low-Income Community","2011-2015"]
["Pennsylvania","Allegheny","42003050100","Low-Income Community","2011-2015"]
["Pennsylvania","Allegheny","42003050900","Low-Income Community","2011-2015"]
["Pennsylvania","Allegheny","42003051100","Low-Income Community","2011-2015"]
["Pennsylvania","Allegheny","42003120700","Low-Income Community","2011-2015"]
["Pennsylvania","Allegheny","42003130100","Low-Income Community","2011-2015"]
["Pennsylvania","Allegheny","42003130200","Low-Income Community","2011-2015"]
["Pennsylvania","Allegheny","42003130300","Low-Income Community","2011-2015"]
["Pennsylvania","Allegheny","42003130400","Low-Income Community","2011-2015"]
["Pennsylvania","Allegheny","42003130600","Low-Income Community","2011-2015"]
["Pennsylvania","Allegheny","42003202200","Low-Income Community","2011-2015"]
["Pennsylvania","Allegheny","42003250700","Low-Income Community","2011-2015"]
["Pennsylvania","Allegheny","42003250900","Low-Income Community","2011-2015"]
["Pennsylvania","Allegheny","42003261400","Low-Income Community","2011-2015"]
["Pennsylvania","Allegheny","42003261500","Low-Income Community","2011-2015"]
["Pennsylvania","Allegheny","42003270400","Low-Income Community","2011-2015"]
["Pennsylvania","Allegheny","42003271500","Low-Income Community","2011-2015"]
["Pennsylvania","Allegheny","42003290100","Low-Income Community","2011-2015"]
["Pennsylvania","Allegheny","42003290200","Low-Income Community","2011-2015"]
["Pennsylvania","Allegheny","42003300100","Low-Income Community","2011-2015"]
["Pennsylvania","Allegheny","42003401200","Low-Income Community","2011-2015"]
["Pennsylvania","Allegheny","42003403500","Low-Income Community","2011-2015"]
["Pennsylvania","Allegheny","42003424000","Low-Income Community","2011-2015"]
["Pennsylvania","Allegheny","42003425000","Non-LIC Contiguous","2011-2015"]
["Pennsylvania","Allegheny","42003461000","Non-LIC Contiguous","2011-2015"]
["Pennsylvania","Allegheny","42003462100","Low-Income Community","2011-2015"]
["Pennsylvania","Allegheny","42003462600","Low-Income Community","2011-2015"]
["Pennsylvania","Allegheny","42003463900","Low-Income Community","2011-2015"]
["Pennsylvania","Allegheny","42003464400","Low-Income Community","2011-2015"]
["Pennsylvania","Allegheny","42003481000","Low-Income Community","2011-2015"]
["Pennsylvania","Allegheny","42003486700","Low-Income Community","2011-2015"]
["Pennsylvania","Allegheny","42003486800","Low-Income Community","2011-2015"]
["Pennsylvania","Allegheny","42003486900","Low-Income Community","2011-2015"]
["Pennsylvania","Allegheny","42003492700","Low-Income Community","2011-2015"]
["Pennsylvania","Allegheny","42003492800","Low-Income Community","2011-2015"]
["Pennsylvania","Allegheny","42003492900","Low-Income Community","2011-2015"]
["Pennsylvania","Allegheny","42003499300","Low-Income Community","2011-2015"]
["Pennsylvania","Allegheny","42003499400","Low-Income Community","2011-2015"]
["Pennsylvania","Allegheny","42003504100","Low-Income Community","2011-2015"]
["Pennsylvania","Allegheny","42003508000","Low-Income Community","2011-2015"]
["Pennsylvania","Allegheny","42003509400","Low-Income Community","2011-2015"]
["Pennsylvania","Allegheny","42003512000","Low-Income Community","2011-2015"]
["Pennsylvania","Allegheny","42003512800","Low-Income Community","2011-2015"]
["Pennsylvania","Allegheny","42003512900","Low-Income Community","2011-2015"]
["Pennsylvania","Allegheny","42003513800","Low-Income Community","2011-2015"]
["Pennsylvania","Allegheny","42003514000","Low-Income Community","2011-2015"]
["Pennsylvania","Allegheny","42003515200","Low-Income Community","2011-2015"]
["Pennsylvania","Allegheny","42003515300","Low-Income Community","2011-2015"]
["Pennsylvania","Allegheny","42003523100","Low-Income Community","2011-2015"]
["Pennsylvania","Allegheny","42003523200","Low-Income Community","2011-2015"]
["Pennsylvania","Allegheny","42003524000","Low-Income Community","2011-2015"]
["Pennsylvania","Allegheny","42003551900","Low-Income Community","2011-2015"]
["Pennsylvania","Allegheny","42003552100","Low-Income Community","2011-2015"]
["Pennsylvania","Allegheny","42003552200","Low-Income Community","2011-2015"]
["Pennsylvania","Allegheny","42003560600","Low-Income Community","2011-2015"]
["Pennsylvania","Allegheny","42003561000","Low-Income Community","2011-2015"]
["Pennsylvania","Allegheny","42003561100","Low-Income Community","2011-2015"]
["Pennsylvania","Allegheny","42003561200","Low-Income Community","2011-2015"]
["Pennsylvania","Allegheny","42003561400","Low-Income Community","2011-2015"]
["Pennsylvania","Allegheny","42003561500","Low-Income Community","2011-2015"]
["Pennsylvania","Allegheny","42003561700","Low-Income Community","2011-2015"]
["Pennsylvania","Allegheny","42003562300","Low-Income Community","2011-2015"]
["Pennsylvania","Allegheny","42003562400","Low-Income Community","2011-2015"]
["Pennsylvania","Allegheny","42003562500","Low-Income Community","2011-2015"]
["Pennsylvania","Allegheny","42003562600","Low-Income Community","2011-2015"]
["Pennsylvania","Allegheny","42003562900","Low-Income Community","2011-2015"]
["Pennsylvania","Allegheny","42003564400","Non-LIC Contiguous","2011-2015"]
["Pennsylvania","Beaver","42007601200","Low-Income Community","2011-2015"]
["Pennsylvania","Beaver","42007601300","Low-Income Community","2011-2015"]
["Pennsylvania","Beaver","42007602800","Low-Income Community","2011-2015"]
["Pennsylvania","Beaver","42007605700","Low-Income Community","2011-2015"]
["Pennsylvania","Berks","42011000100","Low-Income Community","2011-2015"]
["Pennsylvania","Berks","42011000400","Low-Income Community","2011-2015"]
["Pennsylvania","Berks","42011000900","Low-Income Community","2011-2015"]
["Pennsylvania","Berks","42011001300","Low-Income Community","2011-2015"]
["Pennsylvania","Berks","42011002500","Low-Income Community","2011-2015"]
["Pennsylvania","Berks","42011011200","Low-Income Community","2011-2015"]
["Pennsylvania","Blair","42013100300","Low-Income Community","2011-2015"]
["Pennsylvania","Blair","42013100700","Low-Income Community","2011-2015"]
["Pennsylvania","Blair","42013101700","Low-Income Community","2011-2015"]
["Pennsylvania","Blair","42013101800","Low-Income Community","2011-2015"]
["Pennsylvania","Blair","42013101900","Low-Income Community","2011-2015"]
["Pennsylvania","Bradford","42015951000","Low-Income Community","2011-2015"]
["Pennsylvania","Bucks","42017100302","Low-Income Community","2011-2015"]
["Pennsylvania","Bucks","42017100600","Low-Income Community","2011-2015"]
["Pennsylvania","Butler","42019902400","Low-Income Community","2011-2015"]
["Pennsylvania","Cambria","42021000100","Low-Income Community","2011-2015"]
["Pennsylvania","Cambria","42021000200","Low-Income Community","2011-2015"]
["Pennsylvania","Cambria","42021000300","Low-Income Community","2011-2015"]
["Pennsylvania","Cambria","42021013400","Low-Income Community","2011-2015"]
["Pennsylvania","Cambria","42021013500","Low-Income Community","2011-2015"]
["Pennsylvania","Cameron","42023960100","Low-Income Community","2011-2015"]
["Pennsylvania","Centre","42027010300","Low-Income Community","2011-2015"]
["Pennsylvania","Centre","42027010400","Non-LIC Contiguous","2011-2015"]
["Pennsylvania","Centre","42027011100","Low-Income Community","2011-2015"]
["Pennsylvania","Centre","42027012500","Low-Income Community","2011-2015"]
["Pennsylvania","Chester","42029305400","Low-Income Community","2011-2015"]
["Pennsylvania","Chester","42029305500","Low-Income Community","2011-2015"]
["Pennsylvania","Chester","42029305600","Low-Income Community","2011-2015"]
["Pennsylvania","Chester","42029305700","Low-Income Community","2011-2015"]
["Pennsylvania","Clarion","42031160102","Low-Income Community","2011-2015"]
["Pennsylvania","Clarion","42031160600","Low-Income Community","2011-2015"]
["Pennsylvania","Clearfield","42033330100","Non-LIC Contiguous","2011-2015"]
["Pennsylvania","Clearfield","42033330200","Low-Income Community","2011-2015"]
["Pennsylvania","Clearfield","42033330300","Low-Income Community","2011-2015"]
["Pennsylvania","Clearfield","42033330400","Non-LIC Contiguous","2011-2015"]
["Pennsylvania","Clearfield","42033331100","Low-Income Community","2011-2015"]
["Pennsylvania","Clearfield","42033331200","Low-Income Community","2011-2015"]
["Pennsylvania","Clinton","42035030100","Low-Income Community","2011-2015"]
["Pennsylvania","Clinton","42035030600","Low-Income Community","2011-2015"]
["Pennsylvania","Clinton","42035030700","Low-Income Community","2011-2015"]
["Pennsylvania","Columbia","42037050600","Low-Income Community","2011-2015"]
["Pennsylvania","Columbia","42037051200","Low-Income Community","2011-2015"]
["Pennsylvania","Cumberland","42041012000","Low-Income Community","2011-2015"]
["Pennsylvania","Dauphin","42043020100","Low-Income Community","2011-2015"]
["Pennsylvania","Dauphin","42043020300","Low-Income Community","2011-2015"]
["Pennsylvania","Dauphin","42043020600","Low-Income Community","2011-2015"]
["Pennsylvania","Dauphin","42043021100","Low-Income Community","2011-2015"]
["Pennsylvania","Dauphin","42043021300","Low-Income Community","2011-2015"]
["Pennsylvania","Dauphin","42043021400","Low-Income Community","2011-2015"]
["Pennsylvania","Delaware","42045402000","Low-Income Community","2011-2015"]
["Pennsylvania","Delaware","42045403300","Low-Income Community","2011-2015"]
["Pennsylvania","Delaware","42045405000","Low-Income Community","2011-2015"]
["Pennsylvania","Delaware","42045406500","Low-Income Community","2011-2015"]
["Pennsylvania","Delaware","42045406600","Low-Income Community","2011-2015"]
["Pennsylvania","Delaware","42045410700","Low-Income Community","2011-2015"]
["Pennsylvania","Erie","42049000100","Low-Income Community","2011-2015"]
["Pennsylvania","Erie","42049000300","Low-Income Community","2011-2015"]
["Pennsylvania","Erie","42049000400","Low-Income Community","2011-2015"]
["Pennsylvania","Erie","42049000600","Low-Income Community","2011-2015"]
["Pennsylvania","Erie","42049000800","Low-Income Community","2011-2015"]
["Pennsylvania","Erie","42049001000","Low-Income Community","2011-2015"]
["Pennsylvania","Erie","42049001200","Low-Income Community","2011-2015"]
["Pennsylvania","Erie","42049001500","Low-Income Community","2011-2015"]
["Pennsylvania","Fayette","42051260700","Low-Income Community","2011-2015"]
["Pennsylvania","Fayette","42051260800","Low-Income Community","2011-2015"]
["Pennsylvania","Greene","42059970100","Low-Income Community","2011-2015"]
["Pennsylvania","Indiana","42063961000","Low-Income Community","2011-2015"]
["Pennsylvania","Indiana","42063961101","Low-Income Community","2011-2015"]
["Pennsylvania","Indiana","42063961102","Low-Income Community","2011-2015"]
["Pennsylvania","Jefferson","42065950100","Non-LIC Contiguous","2011-2015"]
["Pennsylvania","Jefferson","42065950200","Low-Income Community","2011-2015"]
["Pennsylvania","Lackawanna","42069100200","Low-Income Community","2011-2015"]
["Pennsylvania","Lackawanna","42069100300","Low-Income Community","2011-2015"]
["Pennsylvania","Lackawanna","42069100400","Low-Income Community","2011-2015"]
["Pennsylvania","Lackawanna","42069100600","Low-Income Community","2011-2015"]
["Pennsylvania","Lackawanna","42069102500","Low-Income Community","2011-2015"]
["Pennsylvania","Lackawanna","42069102600","Low-Income Community","2011-2015"]
["Pennsylvania","Lackawanna","42069111200","Low-Income Community","2011-2015"]
["Pennsylvania","Lackawanna","42069111300","Non-LIC Contiguous","2011-2015"]
["Pennsylvania","Lancaster","42071000800","Low-Income Community","2011-2015"]
["Pennsylvania","Lancaster","42071000900","Low-Income Community","2011-2015"]
["Pennsylvania","Lancaster","42071001000","Low-Income Community","2011-2015"]
["Pennsylvania","Lancaster","42071001400","Low-Income Community","2011-2015"]
["Pennsylvania","Lancaster","42071011200","Low-Income Community","2011-2015"]
["Pennsylvania","Lancaster","42071011300","Low-Income Community","2011-2015"]
["Pennsylvania","Lawrence","42073000400","Low-Income Community","2011-2015"]
["Pennsylvania","Lawrence","42073000700","Low-Income Community","2011-2015"]
["Pennsylvania","Lawrence","42073000800","Low-Income Community","2011-2015"]
["Pennsylvania","Lawrence","42073000900","Low-Income Community","2011-2015"]
["Pennsylvania","Lebanon","42075000100","Low-Income Community","2011-2015"]
["Pennsylvania","Lebanon","42075000200","Low-Income Community","2011-2015"]
["Pennsylvania","Lehigh","42077001000","Low-Income Community","2011-2015"]
["Pennsylvania","Lehigh","42077001401","Low-Income Community","2011-2015"]
["Pennsylvania","Lehigh","42077001501","Low-Income Community","2011-2015"]
["Pennsylvania","Lehigh","42077001800","Low-Income Community","2011-2015"]
["Pennsylvania","Lehigh","42077009100","Non-LIC Contiguous","2011-2015"]
["Pennsylvania","Lehigh","42077009700","Low-Income Community","2011-2015"]
["Pennsylvania","Luzerne","42079200100","Low-Income Community","2011-2015"]
["Pennsylvania","Luzerne","42079215200","Low-Income Community","2011-2015"]
["Pennsylvania","Luzerne","42079217001","Low-Income Community","2011-2015"]
["Pennsylvania","Luzerne","42079217300","Non-LIC Contiguous","2011-2015"]
["Pennsylvania","Luzerne","42079217400","Low-Income Community","2011-2015"]
["Pennsylvania","Luzerne","42079217500","Low-Income Community","2011-2015"]
["Pennsylvania","Lycoming","42081000400","Low-Income Community","2011-2015"]
["Pennsylvania","Lycoming","42081000600","Low-Income Community","2011-2015"]
["Pennsylvania","Lycoming","42081000900","Low-Income Community","2011-2015"]
["Pennsylvania","McKean","42083420200","Low-Income Community","2011-2015"]
["Pennsylvania","McKean","42083420300","Low-Income Community","2011-2015"]
["Pennsylvania","Mercer","42085030300","Low-Income Community","2011-2015"]
["Pennsylvania","Mercer","42085033200","Low-Income Community","2011-2015"]
["Pennsylvania","Monroe","42089300800","Low-Income Community","2011-2015"]
["Pennsylvania","Montgomery","42091203902","Low-Income Community","2011-2015"]
["Pennsylvania","Montgomery","42091208801","Low-Income Community","2011-2015"]
["Pennsylvania","Montgomery","42091208904","Low-Income Community","2011-2015"]
["Pennsylvania","Montgomery","42091209000","Low-Income Community","2011-2015"]
["Pennsylvania","Montour","42093050300","Low-Income Community","2011-2015"]
["Pennsylvania","Northampton","42095010700","Low-Income Community","2011-2015"]
["Pennsylvania","Northampton","42095010800","Low-Income Community","2011-2015"]
["Pennsylvania","Northampton","42095011000","Low-Income Community","2011-2015"]
["Pennsylvania","Northampton","42095011300","Low-Income Community","2011-2015"]
["Pennsylvania","Northampton","42095014200","Low-Income Community","2011-2015"]
["Pennsylvania","Northampton","42095014300","Low-Income Community","2011-2015"]
["Pennsylvania","Northampton","42095014400","Low-Income Community","2011-2015"]
["Pennsylvania","Northampton","42095014600","Low-Income Community","2011-2015"]
["Pennsylvania","Northumberland","42097081500","Low-Income Community","2011-2015"]
["Pennsylvania","Northumberland","42097082000","Low-Income Community","2011-2015"]
["Pennsylvania","Philadelphia","42101000200","Low-Income Community","2011-2015"]
["Pennsylvania","Philadelphia","42101002000","Low-Income Community","2011-2015"]
["Pennsylvania","Philadelphia","42101002100","Low-Income Community","2011-2015"]
["Pennsylvania","Philadelphia","42101002200","Low-Income Community","2011-2015"]
["Pennsylvania","Philadelphia","42101003001","Low-Income Community","2011-2015"]
["Pennsylvania","Philadelphia","42101003300","Low-Income Community","2011-2015"]
["Pennsylvania","Philadelphia","42101003901","Low-Income Community","2011-2015"]
["Pennsylvania","Philadelphia","42101005600","Low-Income Community","2011-2015"]
["Pennsylvania","Philadelphia","42101006900","Low-Income Community","2011-2015"]
["Pennsylvania","Philadelphia","42101008302","Low-Income Community","2011-2015"]
["Pennsylvania","Philadelphia","42101008400","Low-Income Community","2011-2015"]
["Pennsylvania","Philadelphia","42101008500","Low-Income Community","2011-2015"]
["Pennsylvania","Philadelphia","42101008602","Low-Income Community","2011-2015"]
["Pennsylvania","Philadelphia","42101009000","Low-Income Community","2011-2015"]
["Pennsylvania","Philadelphia","42101009100","Low-Income Community","2011-2015"]
["Pennsylvania","Philadelphia","42101009200","Low-Income Community","2011-2015"]
["Pennsylvania","Philadelphia","42101009300","Low-Income Community","2011-2015"]
["Pennsylvania","Philadelphia","42101009400","Low-Income Community","2011-2015"]
["Pennsylvania","Philadelphia","42101009500","Low-Income Community","2011-2015"]
["Pennsylvania","Philadelphia","42101009600","Low-Income Community","2011-2015"]
["Pennsylvania","Philadelphia","42101010400","Low-Income Community","2011-2015"]
["Pennsylvania","Philadelphia","42101010500","Low-Income Community","2011-2015"]
["Pennsylvania","Philadelphia","42101010600","Low-Income Community","2011-2015"]
["Pennsylvania","Philadelphia","42101010700","Low-Income Community","2011-2015"]
["Pennsylvania","Philadelphia","42101010800","Low-Income Community","2011-2015"]
["Pennsylvania","Philadelphia","42101010900","Low-Income Community","2011-2015"]
["Pennsylvania","Philadelphia","42101011100","Low-Income Community","2011-2015"]
["Pennsylvania","Philadelphia","42101013200","Low-Income Community","2011-2015"]
["Pennsylvania","Philadelphia","42101013300","Low-Income Community","2011-2015"]
["Pennsylvania","Philadelphia","42101013700","Low-Income Community","2011-2015"]
["Pennsylvania","Philadelphia","42101013800","Low-Income Community","2011-2015"]
["Pennsylvania","Philadelphia","42101013900","Low-Income Community","2011-2015"]
["Pennsylvania","Philadelphia","42101014000","Low-Income Community","2011-2015"]
["Pennsylvania","Philadelphia","42101014100","Low-Income Community","2011-2015"]
["Pennsylvania","Philadelphia","42101014300","Non-LIC Contiguous","2011-2015"]
["Pennsylvania","Philadelphia","42101014500","Low-Income Community","2011-2015"]
["Pennsylvania","Philadelphia","42101014600","Low-Income Community","2011-2015"]
["Pennsylvania","Philadelphia","42101014900","Low-Income Community","2011-2015"]
["Pennsylvania","Philadelphia","42101015600","Low-Income Community","2011-2015"]
["Pennsylvania","Philadelphia","42101015700","Low-Income Community","2011-2015"]
["Pennsylvania","Philadelphia","42101015800","Low-Income Community","2011-2015"]
["Pennsylvania","Philadelphia","42101016100","Low-Income Community","2011-2015"]
["Pennsylvania","Philadelphia","42101016200","Low-Income Community","2011-2015"]
["Pennsylvania","Philadelphia","42101016300","Low-Income Community","2011-2015"]
["Pennsylvania","Philadelphia","42101016600","Low-Income Community","2011-2015"]
["Pennsylvania","Philadelphia","42101016701","Low-Income Community","2011-2015"]
["Pennsylvania","Philadelphia","42101016702","Low-Income Community","2011-2015"]
["Pennsylvania","Philadelphia","42101017000","Low-Income Community","2011-2015"]
["Pennsylvania","Philadelphia","42101017100","Low-Income Community","2011-2015"]
["Pennsylvania","Philadelphia","42101017300","Low-Income Community","2011-2015"]
["Pennsylvania","Philadelphia","42101017400","Low-Income Community","2011-2015"]
["Pennsylvania","Philadelphia","42101017601","Low-Income Community","2011-2015"]
["Pennsylvania","Philadelphia","42101017602","Low-Income Community","2011-2015"]
["Pennsylvania","Philadelphia","42101017701","Low-Income Community","2011-2015"]
["Pennsylvania","Philadelphia","42101017702","Low-Income Community","2011-2015"]
["Pennsylvania","Philadelphia","42101018300","Low-Income Community","2011-2015"]
["Pennsylvania","Philadelphia","42101018400","Low-Income Community","2011-2015"]
["Pennsylvania","Philadelphia","42101020000","Low-Income Community","2011-2015"]
["Pennsylvania","Philadelphia","42101020101","Low-Income Community","2011-2015"]
["Pennsylvania","Philadelphia","42101020102","Low-Income Community","2011-2015"]
["Pennsylvania","Philadelphia","42101020300","Low-Income Community","2011-2015"]
["Pennsylvania","Philadelphia","42101020500","Low-Income Community","2011-2015"]
["Pennsylvania","Philadelphia","42101024100","Low-Income Community","2011-2015"]
["Pennsylvania","Philadelphia","42101024400","Low-Income Community","2011-2015"]
["Pennsylvania","Philadelphia","42101024600","Low-Income Community","2011-2015"]
["Pennsylvania","Philadelphia","42101026302","Low-Income Community","2011-2015"]
["Pennsylvania","Philadelphia","42101026500","Low-Income Community","2011-2015"]
["Pennsylvania","Philadelphia","42101026800","Low-Income Community","2011-2015"]
["Pennsylvania","Philadelphia","42101028200","Low-Income Community","2011-2015"]
["Pennsylvania","Philadelphia","42101028300","Low-Income Community","2011-2015"]
["Pennsylvania","Philadelphia","42101028400","Low-Income Community","2011-2015"]
["Pennsylvania","Philadelphia","42101029100","Low-Income Community","2011-2015"]
["Pennsylvania","Philadelphia","42101030000","Low-Income Community","2011-2015"]
["Pennsylvania","Philadelphia","42101030200","Low-Income Community","2011-2015"]
["Pennsylvania","Philadelphia","42101030900","Low-Income Community","2011-2015"]
["Pennsylvania","Philadelphia","42101033400","Low-Income Community","2011-2015"]
["Pennsylvania","Philadelphia","42101036900","Low-Income Community","2011-2015"]
["Pennsylvania","Philadelphia","42101037600","Low-Income Community","2011-2015"]
["Pennsylvania","Philadelphia","42101037700","Low-Income Community","2011-2015"]
["Pennsylvania","Philadelphia","42101037800","Low-Income Community","2011-2015"]
["Pennsylvania","Philadelphia","42101038100","Low-Income Community","2011-2015"]
["Pennsylvania","Philadelphia","42101980000","Low-Income Community","2011-2015"]
["Pennsylvania","Schuylkill","42107001300","Low-Income Community","2011-2015"]
["Pennsylvania","Schuylkill","42107002600","Low-Income Community","2011-2015"]
["Pennsylvania","Schuylkill","42107002700","Low-Income Community","2011-2015"]
["Pennsylvania","Somerset","42111021100","Low-Income Community","2011-2015"]
["Pennsylvania","Venango","42121200500","Low-Income Community","2011-2015"]
["Pennsylvania","Venango","42121200700","Low-Income Community","2011-2015"]
["Pennsylvania","Venango","42121200900","Low-Income Community","2011-2015"]
["Pennsylvania","Warren","42123970800","Low-Income Community","2011-2015"]
["Pennsylvania","Warren","42123970900","Low-Income Community","2011-2015"]
["Pennsylvania","Washington","42125783200","Low-Income Community","2011-2015"]
["Pennsylvania","Washington","42125783300","Low-Income Community","2011-2015"]
["Pennsylvania","Westmoreland","42129800100","Low-Income Community","2011-2015"]
["Pennsylvania","Westmoreland","42129800700","Low-Income Community","2011-2015"]
["Pennsylvania","Westmoreland","42129802800","Low-Income Community","2011-2015"]
["Pennsylvania","Westmoreland","42129803600","Low-Income Community","2011-2015"]
["Pennsylvania","York","42133000300","Low-Income Community","2011-2015"]
["Pennsylvania","York","42133000600","Low-Income Community","2011-2015"]
["Pennsylvania","York","42133001000","Low-Income Community","2011-2015"]
["Pennsylvania","York","42133001200","Low-Income Community","2011-2015"]
["Pennsylvania","York","42133001600","Low-Income Community","2011-2015"]
["Puerto Rico","Adjuntas","72001956300","Low-Income Community","2011-2015"]
["Puerto Rico","Adjuntas","72001956400","Low-Income Community","2011-2015"]
["Puerto Rico","Adjuntas","72001956500","Low-Income Community","2011-2015"]
["Puerto Rico","Adjuntas","72001956600","Low-Income Community","2011-2015"]
["Puerto Rico","Adjuntas","72001956700","Low-Income Community","2011-2015"]
["Puerto Rico","Adjuntas","72001956800","Low-Income Community","2011-2015"]
["Puerto Rico","Aguada","72003430100","Low-Income Community","2011-2015"]
["Puerto Rico","Aguada","72003430200","Low-Income Community","2011-2015"]
["Puerto Rico","Aguada","72003430300","Low-Income Community","2011-2015"]
["Puerto Rico","Aguada","72003430401","Low-Income Community","2011-2015"]
["Puerto Rico","Aguada","72003430402","Low-Income Community","2011-2015"]
["Puerto Rico","Aguada","72003430501","Low-Income Community","2011-2015"]
["Puerto Rico","Aguada","72003430502","Low-Income Community","2011-2015"]
["Puerto Rico","Aguada","72003430601","Low-Income Community","2011-2015"]
["Puerto Rico","Aguada","72003430602","Low-Income Community","2011-2015"]
["Puerto Rico","Aguadilla","72005400100","Low-Income Community","2011-2015"]
["Puerto Rico","Aguadilla","72005400300","Low-Income Community","2011-2015"]
["Puerto Rico","Aguadilla","72005400400","Low-Income Community","2011-2015"]
["Puerto Rico","Aguadilla","72005400501","Low-Income Community","2011-2015"]
["Puerto Rico","Aguadilla","72005400502","Low-Income Community","2011-2015"]
["Puerto Rico","Aguadilla","72005400600","Low-Income Community","2011-2015"]
["Puerto Rico","Aguadilla","72005400700","Low-Income Community","2011-2015"]
["Puerto Rico","Aguadilla","72005400800","Low-Income Community","2011-2015"]
["Puerto Rico","Aguadilla","72005400900","Low-Income Community","2011-2015"]
["Puerto Rico","Aguadilla","72005401000","Low-Income Community","2011-2015"]
["Puerto Rico","Aguadilla","72005401100","Low-Income Community","2011-2015"]
["Puerto Rico","Aguadilla","72005401200","Low-Income Community","2011-2015"]
["Puerto Rico","Aguadilla","72005401301","Low-Income Community","2011-2015"]
["Puerto Rico","Aguadilla","72005401302","Low-Income Community","2011-2015"]
["Puerto Rico","Aguadilla","72005401401","Low-Income Community","2011-2015"]
["Puerto Rico","Aguadilla","72005401402","Low-Income Community","2011-2015"]
["Puerto Rico","Aguas Buenas","72007230100","Low-Income Community","2011-2015"]
["Puerto Rico","Aguas Buenas","72007230200","Low-Income Community","2011-2015"]
["Puerto Rico","Aguas Buenas","72007230300","Low-Income Community","2011-2015"]
["Puerto Rico","Aguas Buenas","72007230400","Low-Income Community","2011-2015"]
["Puerto Rico","Aguas Buenas","72007230501","Low-Income Community","2011-2015"]
["Puerto Rico","Aguas Buenas","72007230502","Low-Income Community","2011-2015"]
["Puerto Rico","Aibonito","72009250100","Low-Income Community","2011-2015"]
["Puerto Rico","Aibonito","72009250200","Low-Income Community","2011-2015"]
["Puerto Rico","Aibonito","72009250300","Low-Income Community","2011-2015"]
["Puerto Rico","Aibonito","72009250400","Low-Income Community","2011-2015"]
["Puerto Rico","Aibonito","72009250500","Low-Income Community","2011-2015"]
["Puerto Rico","Aibonito","72009250600","Low-Income Community","2011-2015"]
["Puerto Rico","Añasco","72011810100","Low-Income Community","2011-2015"]
["Puerto Rico","Añasco","72011810200","Low-Income Community","2011-2015"]
["Puerto Rico","Añasco","72011810300","Low-Income Community","2011-2015"]
["Puerto Rico","Añasco","72011810400","Low-Income Community","2011-2015"]
["Puerto Rico","Añasco","72011810500","Low-Income Community","2011-2015"]
["Puerto Rico","Añasco","72011810600","Low-Income Community","2011-2015"]
["Puerto Rico","Añasco","72011810700","Low-Income Community","2011-2015"]
["Puerto Rico","Arecibo","72013300101","Low-Income Community","2011-2015"]
["Puerto Rico","Arecibo","72013300102","Low-Income Community","2011-2015"]
["Puerto Rico","Arecibo","72013300200","Low-Income Community","2011-2015"]
["Puerto Rico","Arecibo","72013300301","Low-Income Community","2011-2015"]
["Puerto Rico","Arecibo","72013300302","Low-Income Community","2011-2015"]
["Puerto Rico","Arecibo","72013300400","Low-Income Community","2011-2015"]
["Puerto Rico","Arecibo","72013300500","Low-Income Community","2011-2015"]
["Puerto Rico","Arecibo","72013300700","Low-Income Community","2011-2015"]
["Puerto Rico","Arecibo","72013300800","Low-Income Community","2011-2015"]
["Puerto Rico","Arecibo","72013301000","Low-Income Community","2011-2015"]
["Puerto Rico","Arecibo","72013301100","Low-Income Community","2011-2015"]
["Puerto Rico","Arecibo","72013301200","Low-Income Community","2011-2015"]
["Puerto Rico","Arecibo","72013301300","Low-Income Community","2011-2015"]
["Puerto Rico","Arecibo","72013301400","Low-Income Community","2011-2015"]
["Puerto Rico","Arecibo","72013301500","Low-Income Community","2011-2015"]
["Puerto Rico","Arecibo","72013301600","Low-Income Community","2011-2015"]
["Puerto Rico","Arecibo","72013301700","Low-Income Community","2011-2015"]
["Puerto Rico","Arecibo","72013301800","Low-Income Community","2011-2015"]
["Puerto Rico","Arecibo","72013301900","Low-Income Community","2011-2015"]
["Puerto Rico","Arecibo","72013302000","Low-Income Community","2011-2015"]
["Puerto Rico","Arecibo","72013302100","Low-Income Community","2011-2015"]
["Puerto Rico","Arecibo","72013302201","Low-Income Community","2011-2015"]
["Puerto Rico","Arecibo","72013302202","Low-Income Community","2011-2015"]
["Puerto Rico","Arecibo","72013302300","Low-Income Community","2011-2015"]
["Puerto Rico","Arroyo","72015280101","Low-Income Community","2011-2015"]
["Puerto Rico","Arroyo","72015280102","Low-Income Community","2011-2015"]
["Puerto Rico","Arroyo","72015280201","Low-Income Community","2011-2015"]
["Puerto Rico","Arroyo","72015280202","Low-Income Community","2011-2015"]
["Puerto Rico","Barceloneta","72017590100","Low-Income Community","2011-2015"]
["Puerto Rico","Barceloneta","72017590200","Low-Income Community","2011-2015"]
["Puerto Rico","Barceloneta","72017590300","Low-Income Community","2011-2015"]
["Puerto Rico","Barceloneta","72017590400","Low-Income Community","2011-2015"]
["Puerto Rico","Barranquitas","72019952201","Low-Income Community","2011-2015"]
["Puerto Rico","Barranquitas","72019952202","Low-Income Community","2011-2015"]
["Puerto Rico","Barranquitas","72019952301","Low-Income Community","2011-2015"]
["Puerto Rico","Barranquitas","72019952302","Low-Income Community","2011-2015"]
["Puerto Rico","Barranquitas","72019952400","Low-Income Community","2011-2015"]
["Puerto Rico","Barranquitas","72019952500","Low-Income Community","2011-2015"]
["Puerto Rico","Bayamón","72021030101","Low-Income Community","2011-2015"]
["Puerto Rico","Bayamón","72021030103","Low-Income Community","2011-2015"]
["Puerto Rico","Bayamón","72021030104","Non-LIC Contiguous","2011-2015"]
["Puerto Rico","Bayamón","72021030105","Low-Income Community","2011-2015"]
["Puerto Rico","Bayamón","72021030200","Low-Income Community","2011-2015"]
["Puerto Rico","Bayamón","72021030300","Low-Income Community","2011-2015"]
["Puerto Rico","Bayamón","72021030700","Low-Income Community","2011-2015"]
["Puerto Rico","Bayamón","72021030800","Low-Income Community","2011-2015"]
["Puerto Rico","Bayamón","72021030901","Low-Income Community","2011-2015"]
["Puerto Rico","Bayamón","72021030902","Low-Income Community","2011-2015"]
["Puerto Rico","Bayamón","72021030903","Low-Income Community","2011-2015"]
["Puerto Rico","Bayamón","72021030904","Low-Income Community","2011-2015"]
["Puerto Rico","Bayamón","72021031004","Non-LIC Contiguous","2011-2015"]
["Puerto Rico","Bayamón","72021031005","Low-Income Community","2011-2015"]
["Puerto Rico","Bayamón","72021031013","Low-Income Community","2011-2015"]
["Puerto Rico","Bayamón","72021031021","Low-Income Community","2011-2015"]
["Puerto Rico","Bayamón","72021031023","Low-Income Community","2011-2015"]
["Puerto Rico","Bayamón","72021031031","Low-Income Community","2011-2015"]
["Puerto Rico","Bayamón","72021031033","Low-Income Community","2011-2015"]
["Puerto Rico","Bayamón","72021031101","Low-Income Community","2011-2015"]
["Puerto Rico","Bayamón","72021031113","Low-Income Community","2011-2015"]
["Puerto Rico","Bayamón","72021031114","Low-Income Community","2011-2015"]
["Puerto Rico","Bayamón","72021031121","Low-Income Community","2011-2015"]
["Puerto Rico","Bayamón","72021031122","Low-Income Community","2011-2015"]
["Puerto Rico","Bayamón","72021031123","Low-Income Community","2011-2015"]
["Puerto Rico","Bayamón","72021031124","Low-Income Community","2011-2015"]
["Puerto Rico","Bayamón","72021031125","Low-Income Community","2011-2015"]
["Puerto Rico","Bayamón","72021031201","Low-Income Community","2011-2015"]
["Puerto Rico","Bayamón","72021031202","Low-Income Community","2011-2015"]
["Puerto Rico","Bayamón","72021031203","Low-Income Community","2011-2015"]
["Puerto Rico","Bayamón","72021031301","Low-Income Community","2011-2015"]
["Puerto Rico","Bayamón","72021031304","Low-Income Community","2011-2015"]
["Puerto Rico","Bayamón","72021031305","Low-Income Community","2011-2015"]
["Puerto Rico","Bayamón","72021031306","Low-Income Community","2011-2015"]
["Puerto Rico","Bayamón","72021031307","Low-Income Community","2011-2015"]
["Puerto Rico","Bayamón","72021031401","Low-Income Community","2011-2015"]
["Puerto Rico","Bayamón","72021031402","Low-Income Community","2011-2015"]
["Puerto Rico","Bayamón","72021031403","Low-Income Community","2011-2015"]
["Puerto Rico","Bayamón","72021031501","Low-Income Community","2011-2015"]
["Puerto Rico","Bayamón","72021031502","Low-Income Community","2011-2015"]
["Puerto Rico","Bayamón","72021031503","Low-Income Community","2011-2015"]
["Puerto Rico","Bayamón","72021031611","Low-Income Community","2011-2015"]
["Puerto Rico","Bayamón","72021031612","Low-Income Community","2011-2015"]
["Puerto Rico","Bayamón","72021031621","Low-Income Community","2011-2015"]
["Puerto Rico","Bayamón","72021031622","Low-Income Community","2011-2015"]
["Puerto Rico","Bayamón","72021031631","Low-Income Community","2011-2015"]
["Puerto Rico","Bayamón","72021031632","Low-Income Community","2011-2015"]
["Puerto Rico","Bayamón","72021031641","Low-Income Community","2011-2015"]
["Puerto Rico","Bayamón","72021031651","Low-Income Community","2011-2015"]
["Puerto Rico","Bayamón","72021031701","Low-Income Community","2011-2015"]
["Puerto Rico","Bayamón","72021031702","Low-Income Community","2011-2015"]
["Puerto Rico","Bayamón","72021031703","Low-Income Community","2011-2015"]
["Puerto Rico","Bayamón","72021031704","Low-Income Community","2011-2015"]
["Puerto Rico","Bayamón","72021031800","Low-Income Community","2011-2015"]
["Puerto Rico","Bayamón","72021031900","Low-Income Community","2011-2015"]
["Puerto Rico","Bayamón","72021032000","Low-Income Community","2011-2015"]
["Puerto Rico","Bayamón","72021032100","Low-Income Community","2011-2015"]
["Puerto Rico","Bayamón","72021032200","Low-Income Community","2011-2015"]
["Puerto Rico","Bayamón","72021032301","Low-Income Community","2011-2015"]
["Puerto Rico","Bayamón","72021032302","Low-Income Community","2011-2015"]
["Puerto Rico","Cabo Rojo","72023830101","Low-Income Community","2011-2015"]
["Puerto Rico","Cabo Rojo","72023830102","Low-Income Community","2011-2015"]
["Puerto Rico","Cabo Rojo","72023830200","Low-Income Community","2011-2015"]
["Puerto Rico","Cabo Rojo","72023830300","Low-Income Community","2011-2015"]
["Puerto Rico","Cabo Rojo","72023830400","Low-Income Community","2011-2015"]
["Puerto Rico","Cabo Rojo","72023830502","Low-Income Community","2011-2015"]
["Puerto Rico","Cabo Rojo","72023830503","Low-Income Community","2011-2015"]
["Puerto Rico","Cabo Rojo","72023830504","Low-Income Community","2011-2015"]
["Puerto Rico","Cabo Rojo","72023830603","Low-Income Community","2011-2015"]
["Puerto Rico","Cabo Rojo","72023830604","Low-Income Community","2011-2015"]
["Puerto Rico","Caguas","72025200100","Low-Income Community","2011-2015"]
["Puerto Rico","Caguas","72025200200","Low-Income Community","2011-2015"]
["Puerto Rico","Caguas","72025200302","Non-LIC Contiguous","2011-2015"]
["Puerto Rico","Caguas","72025200304","Low-Income Community","2011-2015"]
["Puerto Rico","Caguas","72025200400","Low-Income Community","2011-2015"]
["Puerto Rico","Caguas","72025200500","Low-Income Community","2011-2015"]
["Puerto Rico","Caguas","72025200600","Low-Income Community","2011-2015"]
["Puerto Rico","Caguas","72025200700","Low-Income Community","2011-2015"]
["Puerto Rico","Caguas","72025200800","Low-Income Community","2011-2015"]
["Puerto Rico","Caguas","72025200900","Low-Income Community","2011-2015"]
["Puerto Rico","Caguas","72025201000","Low-Income Community","2011-2015"]
["Puerto Rico","Caguas","72025201200","Low-Income Community","2011-2015"]
["Puerto Rico","Caguas","72025201300","Low-Income Community","2011-2015"]
["Puerto Rico","Caguas","72025201400","Low-Income Community","2011-2015"]
["Puerto Rico","Caguas","72025201500","Low-Income Community","2011-2015"]
["Puerto Rico","Caguas","72025201600","Low-Income Community","2011-2015"]
["Puerto Rico","Caguas","72025201700","Low-Income Community","2011-2015"]
["Puerto Rico","Caguas","72025201800","Low-Income Community","2011-2015"]
["Puerto Rico","Caguas","72025201900","Low-Income Community","2011-2015"]
["Puerto Rico","Caguas","72025202000","Low-Income Community","2011-2015"]
["Puerto Rico","Caguas","72025202100","Low-Income Community","2011-2015"]
["Puerto Rico","Caguas","72025202200","Low-Income Community","2011-2015"]
["Puerto Rico","Caguas","72025202300","Low-Income Community","2011-2015"]
["Puerto Rico","Caguas","72025202402","Low-Income Community","2011-2015"]
["Puerto Rico","Caguas","72025202403","Low-Income Community","2011-2015"]
["Puerto Rico","Caguas","72025202404","Low-Income Community","2011-2015"]
["Puerto Rico","Caguas","72025202500","Low-Income Community","2011-2015"]
["Puerto Rico","Caguas","72025202601","Low-Income Community","2011-2015"]
["Puerto Rico","Caguas","72025202602","Low-Income Community","2011-2015"]
["Puerto Rico","Caguas","72025202701","Low-Income Community","2011-2015"]
["Puerto Rico","Caguas","72025202702","Low-Income Community","2011-2015"]
["Puerto Rico","Caguas","72025202800","Low-Income Community","2011-2015"]
["Puerto Rico","Camuy","72027320100","Low-Income Community","2011-2015"]
["Puerto Rico","Camuy","72027320200","Low-Income Community","2011-2015"]
["Puerto Rico","Camuy","72027320300","Low-Income Community","2011-2015"]
["Puerto Rico","Camuy","72027320401","Low-Income Community","2011-2015"]
["Puerto Rico","Camuy","72027320402","Low-Income Community","2011-2015"]
["Puerto Rico","Camuy","72027320500","Low-Income Community","2011-2015"]
["Puerto Rico","Camuy","72027320600","Low-Income Community","2011-2015"]
["Puerto Rico","Canóvanas","72029100101","Low-Income Community","2011-2015"]
["Puerto Rico","Canóvanas","72029100103","Low-Income Community","2011-2015"]
["Puerto Rico","Canóvanas","72029100104","Low-Income Community","2011-2015"]
["Puerto Rico","Canóvanas","72029100200","Low-Income Community","2011-2015"]
["Puerto Rico","Canóvanas","72029100400","Low-Income Community","2011-2015"]
["Puerto Rico","Canóvanas","72029100502","Low-Income Community","2011-2015"]
["Puerto Rico","Canóvanas","72029100503","Low-Income Community","2011-2015"]
["Puerto Rico","Canóvanas","72029100504","Non-LIC Contiguous","2011-2015"]
["Puerto Rico","Canóvanas","72029100601","Low-Income Community","2011-2015"]
["Puerto Rico","Canóvanas","72029100602","Low-Income Community","2011-2015"]
["Puerto Rico","Canóvanas","72029100700","Low-Income Community","2011-2015"]
["Puerto Rico","Canóvanas","72029100800","Low-Income Community","2011-2015"]
["Puerto Rico","Carolina","72031050105","Low-Income Community","2011-2015"]
["Puerto Rico","Carolina","72031050110","Low-Income Community","2011-2015"]
["Puerto Rico","Carolina","72031050211","Low-Income Community","2011-2015"]
["Puerto Rico","Carolina","72031050212","Low-Income Community","2011-2015"]
["Puerto Rico","Carolina","72031050221","Low-Income Community","2011-2015"]
["Puerto Rico","Carolina","72031050222","Low-Income Community","2011-2015"]
["Puerto Rico","Carolina","72031050231","Low-Income Community","2011-2015"]
["Puerto Rico","Carolina","72031050232","Non-LIC Contiguous","2011-2015"]
["Puerto Rico","Carolina","72031050241","Low-Income Community","2011-2015"]
["Puerto Rico","Carolina","72031050242","Low-Income Community","2011-2015"]
["Puerto Rico","Carolina","72031050302","Low-Income Community","2011-2015"]
["Puerto Rico","Carolina","72031050311","Low-Income Community","2011-2015"]
["Puerto Rico","Carolina","72031050321","Low-Income Community","2011-2015"]
["Puerto Rico","Carolina","72031050331","Low-Income Community","2011-2015"]
["Puerto Rico","Carolina","72031050341","Low-Income Community","2011-2015"]
["Puerto Rico","Carolina","72031050401","Low-Income Community","2011-2015"]
["Puerto Rico","Carolina","72031050402","Low-Income Community","2011-2015"]
["Puerto Rico","Carolina","72031050501","Non-LIC Contiguous","2011-2015"]
["Puerto Rico","Carolina","72031050503","Low-Income Community","2011-2015"]
["Puerto Rico","Carolina","72031050504","Low-Income Community","2011-2015"]
["Puerto Rico","Carolina","72031050600","Low-Income Community","2011-2015"]
["Puerto Rico","Carolina","72031050700","Low-Income Community","2011-2015"]
["Puerto Rico","Carolina","72031050803","Low-Income Community","2011-2015"]
["Puerto Rico","Carolina","72031050811","Low-Income Community","2011-2015"]
["Puerto Rico","Carolina","72031050812","Low-Income Community","2011-2015"]
["Puerto Rico","Carolina","72031050821","Low-Income Community","2011-2015"]
["Puerto Rico","Carolina","72031050822","Low-Income Community","2011-2015"]
["Puerto Rico","Carolina","72031050831","Low-Income Community","2011-2015"]
["Puerto Rico","Carolina","72031050841","Low-Income Community","2011-2015"]
["Puerto Rico","Carolina","72031050901","Low-Income Community","2011-2015"]
["Puerto Rico","Carolina","72031050902","Low-Income Community","2011-2015"]
["Puerto Rico","Carolina","72031051001","Low-Income Community","2011-2015"]
["Puerto Rico","Carolina","72031051002","Low-Income Community","2011-2015"]
["Puerto Rico","Carolina","72031051102","Low-Income Community","2011-2015"]
["Puerto Rico","Cataño","72033020200","Low-Income Community","2011-2015"]
["Puerto Rico","Cataño","72033020302","Low-Income Community","2011-2015"]
["Puerto Rico","Cataño","72033020403","Low-Income Community","2011-2015"]
["Puerto Rico","Cataño","72033020422","Low-Income Community","2011-2015"]
["Puerto Rico","Cataño","72033020423","Low-Income Community","2011-2015"]
["Puerto Rico","Cataño","72033020425","Low-Income Community","2011-2015"]
["Puerto Rico","Cataño","72033020426","Low-Income Community","2011-2015"]
["Puerto Rico","Cataño","72033020427","Low-Income Community","2011-2015"]
["Puerto Rico","Cataño","72033980003","Low-Income Community","2011-2015"]
["Puerto Rico","Cayey","72035260100","Low-Income Community","2011-2015"]
["Puerto Rico","Cayey","72035260201","Low-Income Community","2011-2015"]
["Puerto Rico","Cayey","72035260202","Low-Income Community","2011-2015"]
["Puerto Rico","Cayey","72035260300","Low-Income Community","2011-2015"]
["Puerto Rico","Cayey","72035260400","Low-Income Community","2011-2015"]
["Puerto Rico","Cayey","72035260500","Low-Income Community","2011-2015"]
["Puerto Rico","Cayey","72035260600","Low-Income Community","2011-2015"]
["Puerto Rico","Cayey","72035260700","Low-Income Community","2011-2015"]
["Puerto Rico","Cayey","72035260800","Low-Income Community","2011-2015"]
["Puerto Rico","Cayey","72035260901","Low-Income Community","2011-2015"]
["Puerto Rico","Cayey","72035260902","Low-Income Community","2011-2015"]
["Puerto Rico","Ceiba","72037160201","Low-Income Community","2011-2015"]
["Puerto Rico","Ceiba","72037160202","Low-Income Community","2011-2015"]
["Puerto Rico","Ceiba","72037160300","Low-Income Community","2011-2015"]
["Puerto Rico","Ciales","72039955600","Low-Income Community","2011-2015"]
["Puerto Rico","Ciales","72039955700","Low-Income Community","2011-2015"]
["Puerto Rico","Ciales","72039955800","Low-Income Community","2011-2015"]
["Puerto Rico","Ciales","72039955900","Low-Income Community","2011-2015"]
["Puerto Rico","Cidra","72041240101","Low-Income Community","2011-2015"]
["Puerto Rico","Cidra","72041240102","Low-Income Community","2011-2015"]
["Puerto Rico","Cidra","72041240201","Low-Income Community","2011-2015"]
["Puerto Rico","Cidra","72041240202","Low-Income Community","2011-2015"]
["Puerto Rico","Cidra","72041240300","Low-Income Community","2011-2015"]
["Puerto Rico","Cidra","72041240401","Low-Income Community","2011-2015"]
["Puerto Rico","Cidra","72041240402","Low-Income Community","2011-2015"]
["Puerto Rico","Cidra","72041240500","Low-Income Community","2011-2015"]
["Puerto Rico","Cidra","72041240601","Low-Income Community","2011-2015"]
["Puerto Rico","Cidra","72041240602","Low-Income Community","2011-2015"]
["Puerto Rico","Coamo","72043953900","Low-Income Community","2011-2015"]
["Puerto Rico","Coamo","72043954000","Low-Income Community","2011-2015"]
["Puerto Rico","Coamo","72043954100","Low-Income Community","2011-2015"]
["Puerto Rico","Coamo","72043954200","Low-Income Community","2011-2015"]
["Puerto Rico","Coamo","72043954300","Low-Income Community","2011-2015"]
["Puerto Rico","Coamo","72043954400","Low-Income Community","2011-2015"]
["Puerto Rico","Coamo","72043954500","Low-Income Community","2011-2015"]
["Puerto Rico","Coamo","72043954600","Low-Income Community","2011-2015"]
["Puerto Rico","Coamo","72043954700","Low-Income Community","2011-2015"]
["Puerto Rico","Comerío","72045951700","Low-Income Community","2011-2015"]
["Puerto Rico","Comerío","72045951800","Low-Income Community","2011-2015"]
["Puerto Rico","Comerío","72045951900","Low-Income Community","2011-2015"]
["Puerto Rico","Comerío","72045952000","Low-Income Community","2011-2015"]
["Puerto Rico","Comerío","72045952100","Low-Income Community","2011-2015"]
["Puerto Rico","Corozal","72047530100","Low-Income Community","2011-2015"]
["Puerto Rico","Corozal","72047530200","Low-Income Community","2011-2015"]
["Puerto Rico","Corozal","72047530300","Low-Income Community","2011-2015"]
["Puerto Rico","Corozal","72047530400","Low-Income Community","2011-2015"]
["Puerto Rico","Corozal","72047530500","Low-Income Community","2011-2015"]
["Puerto Rico","Corozal","72047530600","Low-Income Community","2011-2015"]
["Puerto Rico","Culebra","72049950500","Low-Income Community","2011-2015"]
["Puerto Rico","Dorado","72051540100","Low-Income Community","2011-2015"]
["Puerto Rico","Dorado","72051540200","Low-Income Community","2011-2015"]
["Puerto Rico","Dorado","72051540300","Low-Income Community","2011-2015"]
["Puerto Rico","Dorado","72051540400","Low-Income Community","2011-2015"]
["Puerto Rico","Dorado","72051540500","Low-Income Community","2011-2015"]
["Puerto Rico","Dorado","72051540600","Low-Income Community","2011-2015"]
["Puerto Rico","Dorado","72051540700","Low-Income Community","2011-2015"]
["Puerto Rico","Fajardo","72053150102","Low-Income Community","2011-2015"]
["Puerto Rico","Fajardo","72053150104","Low-Income Community","2011-2015"]
["Puerto Rico","Fajardo","72053150200","Low-Income Community","2011-2015"]
["Puerto Rico","Fajardo","72053150301","Low-Income Community","2011-2015"]
["Puerto Rico","Fajardo","72053150302","Low-Income Community","2011-2015"]
["Puerto Rico","Fajardo","72053150400","Low-Income Community","2011-2015"]
["Puerto Rico","Fajardo","72053150500","Low-Income Community","2011-2015"]
["Puerto Rico","Fajardo","72053150601","Low-Income Community","2011-2015"]
["Puerto Rico","Fajardo","72053150602","Low-Income Community","2011-2015"]
["Puerto Rico","Florida","72054580100","Low-Income Community","2011-2015"]
["Puerto Rico","Florida","72054580200","Low-Income Community","2011-2015"]
["Puerto Rico","Guánica","72055960900","Low-Income Community","2011-2015"]
["Puerto Rico","Guánica","72055961000","Low-Income Community","2011-2015"]
["Puerto Rico","Guánica","72055961100","Low-Income Community","2011-2015"]
["Puerto Rico","Guánica","72055961200","Low-Income Community","2011-2015"]
["Puerto Rico","Guánica","72055961300","Low-Income Community","2011-2015"]
["Puerto Rico","Guánica","72055961400","Low-Income Community","2011-2015"]
["Puerto Rico","Guánica","72055961500","Low-Income Community","2011-2015"]
["Puerto Rico","Guayama","72057270100","Low-Income Community","2011-2015"]
["Puerto Rico","Guayama","72057270201","Low-Income Community","2011-2015"]
["Puerto Rico","Guayama","72057270202","Low-Income Community","2011-2015"]
["Puerto Rico","Guayama","72057270300","Low-Income Community","2011-2015"]
["Puerto Rico","Guayama","72057270400","Low-Income Community","2011-2015"]
["Puerto Rico","Guayama","72057270500","Low-Income Community","2011-2015"]
["Puerto Rico","Guayama","72057270600","Low-Income Community","2011-2015"]
["Puerto Rico","Guayama","72057270700","Low-Income Community","2011-2015"]
["Puerto Rico","Guayama","72057270800","Low-Income Community","2011-2015"]
["Puerto Rico","Guayanilla","72059740101","Low-Income Community","2011-2015"]
["Puerto Rico","Guayanilla","72059740102","Low-Income Community","2011-2015"]
["Puerto Rico","Guayanilla","72059740200","Low-Income Community","2011-2015"]
["Puerto Rico","Guayanilla","72059740300","Low-Income Community","2011-2015"]
["Puerto Rico","Guayanilla","72059740400","Low-Income Community","2011-2015"]
["Puerto Rico","Guaynabo","72061040101","Low-Income Community","2011-2015"]
["Puerto Rico","Guaynabo","72061040102","Low-Income Community","2011-2015"]
["Puerto Rico","Guaynabo","72061040103","Low-Income Community","2011-2015"]
["Puerto Rico","Guaynabo","72061040200","Low-Income Community","2011-2015"]
["Puerto Rico","Guaynabo","72061040302","Non-LIC Contiguous","2011-2015"]
["Puerto Rico","Guaynabo","72061040303","Non-LIC Contiguous","2011-2015"]
["Puerto Rico","Guaynabo","72061040304","Non-LIC Contiguous","2011-2015"]
["Puerto Rico","Guaynabo","72061040403","Low-Income Community","2011-2015"]
["Puerto Rico","Guaynabo","72061040411","Low-Income Community","2011-2015"]
["Puerto Rico","Guaynabo","72061040421","Non-LIC Contiguous","2011-2015"]
["Puerto Rico","Guaynabo","72061040422","Low-Income Community","2011-2015"]
["Puerto Rico","Guaynabo","72061040432","Low-Income Community","2011-2015"]
["Puerto Rico","Guaynabo","72061040442","Non-LIC Contiguous","2011-2015"]
["Puerto Rico","Guaynabo","72061040500","Low-Income Community","2011-2015"]
["Puerto Rico","Guaynabo","72061040601","Low-Income Community","2011-2015"]
["Puerto Rico","Guaynabo","72061040700","Low-Income Community","2011-2015"]
["Puerto Rico","Guaynabo","72061040800","Low-Income Community","2011-2015"]
["Puerto Rico","Guaynabo","72061040900","Low-Income Community","2011-2015"]
["Puerto Rico","Guaynabo","72061041000","Low-Income Community","2011-2015"]
["Puerto Rico","Guaynabo","72061041100","Low-Income Community","2011-2015"]
["Puerto Rico","Gurabo","72063210100","Low-Income Community","2011-2015"]
["Puerto Rico","Gurabo","72063210201","Low-Income Community","2011-2015"]
["Puerto Rico","Gurabo","72063210202","Low-Income Community","2011-2015"]
["Puerto Rico","Gurabo","72063210300","Low-Income Community","2011-2015"]
["Puerto Rico","Gurabo","72063210400","Low-Income Community","2011-2015"]
["Puerto Rico","Gurabo","72063210502","Non-LIC Contiguous","2011-2015"]
["Puerto Rico","Gurabo","72063210503","Low-Income Community","2011-2015"]
["Puerto Rico","Gurabo","72063210504","Low-Income Community","2011-2015"]
["Puerto Rico","Hatillo","72065310100","Low-Income Community","2011-2015"]
["Puerto Rico","Hatillo","72065310200","Low-Income Community","2011-2015"]
["Puerto Rico","Hatillo","72065310300","Low-Income Community","2011-2015"]
["Puerto Rico","Hatillo","72065310400","Low-Income Community","2011-2015"]
["Puerto Rico","Hatillo","72065310500","Low-Income Community","2011-2015"]
["Puerto Rico","Hatillo","72065310600","Low-Income Community","2011-2015"]
["Puerto Rico","Hormigueros","72067820100","Low-Income Community","2011-2015"]
["Puerto Rico","Hormigueros","72067820300","Low-Income Community","2011-2015"]
["Puerto Rico","Hormigueros","72067820400","Low-Income Community","2011-2015"]
["Puerto Rico","Hormigueros","72067820500","Low-Income Community","2011-2015"]
["Puerto Rico","Humacao","72069180100","Low-Income Community","2011-2015"]
["Puerto Rico","Humacao","72069180201","Low-Income Community","2011-2015"]
["Puerto Rico","Humacao","72069180202","Low-Income Community","2011-2015"]
["Puerto Rico","Humacao","72069180301","Low-Income Community","2011-2015"]
["Puerto Rico","Humacao","72069180302","Low-Income Community","2011-2015"]
["Puerto Rico","Humacao","72069180400","Low-Income Community","2011-2015"]
["Puerto Rico","Humacao","72069180500","Low-Income Community","2011-2015"]
["Puerto Rico","Humacao","72069180600","Low-Income Community","2011-2015"]
["Puerto Rico","Humacao","72069180700","Low-Income Community","2011-2015"]
["Puerto Rico","Humacao","72069180800","Low-Income Community","2011-2015"]
["Puerto Rico","Humacao","72069180901","Low-Income Community","2011-2015"]
["Puerto Rico","Humacao","72069180902","Low-Income Community","2011-2015"]
["Puerto Rico","Isabela","72071410100","Low-Income Community","2011-2015"]
["Puerto Rico","Isabela","72071410200","Low-Income Community","2011-2015"]
["Puerto Rico","Isabela","72071410300","Low-Income Community","2011-2015"]
["Puerto Rico","Isabela","72071410401","Low-Income Community","2011-2015"]
["Puerto Rico","Isabela","72071410402","Low-Income Community","2011-2015"]
["Puerto Rico","Isabela","72071410500","Low-Income Community","2011-2015"]
["Puerto Rico","Isabela","72071410600","Low-Income Community","2011-2015"]
["Puerto Rico","Isabela","72071410701","Low-Income Community","2011-2015"]
["Puerto Rico","Isabela","72071410702","Low-Income Community","2011-2015"]
["Puerto Rico","Jayuya","72073956000","Low-Income Community","2011-2015"]
["Puerto Rico","Jayuya","72073956100","Low-Income Community","2011-2015"]
["Puerto Rico","Jayuya","72073956200","Low-Income Community","2011-2015"]
["Puerto Rico","Juana Díaz","72075710102","Low-Income Community","2011-2015"]
["Puerto Rico","Juana Díaz","72075710200","Low-Income Community","2011-2015"]
["Puerto Rico","Juana Díaz","72075710301","Low-Income Community","2011-2015"]
["Puerto Rico","Juana Díaz","72075710302","Low-Income Community","2011-2015"]
["Puerto Rico","Juana Díaz","72075710400","Low-Income Community","2011-2015"]
["Puerto Rico","Juana Díaz","72075710500","Low-Income Community","2011-2015"]
["Puerto Rico","Juana Díaz","72075710600","Low-Income Community","2011-2015"]
["Puerto Rico","Juana Díaz","72075710700","Low-Income Community","2011-2015"]
["Puerto Rico","Juana Díaz","72075710800","Low-Income Community","2011-2015"]
["Puerto Rico","Juana Díaz","72075710901","Low-Income Community","2011-2015"]
["Puerto Rico","Juana Díaz","72075710902","Low-Income Community","2011-2015"]
["Puerto Rico","Juana Díaz","72075711002","Low-Income Community","2011-2015"]
["Puerto Rico","Juncos","72077500100","Low-Income Community","2011-2015"]
["Puerto Rico","Juncos","72077500200","Low-Income Community","2011-2015"]
["Puerto Rico","Juncos","72077500301","Low-Income Community","2011-2015"]
["Puerto Rico","Juncos","72077500302","Low-Income Community","2011-2015"]
["Puerto Rico","Juncos","72077500401","Low-Income Community","2011-2015"]
["Puerto Rico","Juncos","72077500402","Low-Income Community","2011-2015"]
["Puerto Rico","Lajas","72079850101","Low-Income Community","2011-2015"]
["Puerto Rico","Lajas","72079850102","Low-Income Community","2011-2015"]
["Puerto Rico","Lajas","72079850200","Low-Income Community","2011-2015"]
["Puerto Rico","Lajas","72079850300","Low-Income Community","2011-2015"]
["Puerto Rico","Lajas","72079850400","Low-Income Community","2011-2015"]
["Puerto Rico","Lares","72081957700","Low-Income Community","2011-2015"]
["Puerto Rico","Lares","72081957800","Low-Income Community","2011-2015"]
["Puerto Rico","Lares","72081957900","Low-Income Community","2011-2015"]
["Puerto Rico","Lares","72081958000","Low-Income Community","2011-2015"]
["Puerto Rico","Lares","72081958100","Low-Income Community","2011-2015"]
["Puerto Rico","Lares","72081958200","Low-Income Community","2011-2015"]
["Puerto Rico","Lares","72081958300","Low-Income Community","2011-2015"]
["Puerto Rico","Lares","72081958400","Low-Income Community","2011-2015"]
["Puerto Rico","Las Marías","72083959700","Low-Income Community","2011-2015"]
["Puerto Rico","Las Marías","72083959800","Low-Income Community","2011-2015"]
["Puerto Rico","Las Marías","72083959900","Low-Income Community","2011-2015"]
["Puerto Rico","Las Piedras","72085190101","Low-Income Community","2011-2015"]
["Puerto Rico","Las Piedras","72085190102","Low-Income Community","2011-2015"]
["Puerto Rico","Las Piedras","72085190201","Low-Income Community","2011-2015"]
["Puerto Rico","Las Piedras","72085190202","Low-Income Community","2011-2015"]
["Puerto Rico","Las Piedras","72085190301","Low-Income Community","2011-2015"]
["Puerto Rico","Las Piedras","72085190302","Low-Income Community","2011-2015"]
["Puerto Rico","Loíza","72087110101","Low-Income Community","2011-2015"]
["Puerto Rico","Loíza","72087110102","Low-Income Community","2011-2015"]
["Puerto Rico","Loíza","72087110200","Low-Income Community","2011-2015"]
["Puerto Rico","Loíza","72087110301","Low-Income Community","2011-2015"]
["Puerto Rico","Loíza","72087110302","Low-Income Community","2011-2015"]
["Puerto Rico","Loíza","72087110303","Low-Income Community","2011-2015"]
["Puerto Rico","Loíza","72087110304","Low-Income Community","2011-2015"]
["Puerto Rico","Loíza","72087110400","Low-Income Community","2011-2015"]
["Puerto Rico","Loíza","72087110500","Low-Income Community","2011-2015"]
["Puerto Rico","Loíza","72087110600","Low-Income Community","2011-2015"]
["Puerto Rico","Luquillo","72089140101","Low-Income Community","2011-2015"]
["Puerto Rico","Luquillo","72089140102","Low-Income Community","2011-2015"]
["Puerto Rico","Luquillo","72089140201","Low-Income Community","2011-2015"]
["Puerto Rico","Luquillo","72089140202","Low-Income Community","2011-2015"]
["Puerto Rico","Luquillo","72089140300","Low-Income Community","2011-2015"]
["Puerto Rico","Manatí","72091570100","Low-Income Community","2011-2015"]
["Puerto Rico","Manatí","72091570201","Low-Income Community","2011-2015"]
["Puerto Rico","Manatí","72091570202","Low-Income Community","2011-2015"]
["Puerto Rico","Manatí","72091570300","Low-Income Community","2011-2015"]
["Puerto Rico","Manatí","72091570400","Low-Income Community","2011-2015"]
["Puerto Rico","Manatí","72091570500","Low-Income Community","2011-2015"]
["Puerto Rico","Manatí","72091570600","Low-Income Community","2011-2015"]
["Puerto Rico","Manatí","72091570700","Low-Income Community","2011-2015"]
["Puerto Rico","Manatí","72091570800","Low-Income Community","2011-2015"]
["Puerto Rico","Maricao","72093960100","Low-Income Community","2011-2015"]
["Puerto Rico","Maricao","72093960200","Low-Income Community","2011-2015"]
["Puerto Rico","Maunabo","72095951400","Low-Income Community","2011-2015"]
["Puerto Rico","Maunabo","72095951500","Low-Income Community","2011-2015"]
["Puerto Rico","Maunabo","72095951600","Low-Income Community","2011-2015"]
["Puerto Rico","Mayagüez","72097080100","Low-Income Community","2011-2015"]
["Puerto Rico","Mayagüez","72097080200","Low-Income Community","2011-2015"]
["Puerto Rico","Mayagüez","72097080300","Low-Income Community","2011-2015"]
["Puerto Rico","Mayagüez","72097080400","Low-Income Community","2011-2015"]
["Puerto Rico","Mayagüez","72097080500","Low-Income Community","2011-2015"]
["Puerto Rico","Mayagüez","72097080600","Low-Income Community","2011-2015"]
["Puerto Rico","Mayagüez","72097080800","Low-Income Community","2011-2015"]
["Puerto Rico","Mayagüez","72097080900","Low-Income Community","2011-2015"]
["Puerto Rico","Mayagüez","72097081000","Low-Income Community","2011-2015"]
["Puerto Rico","Mayagüez","72097081100","Low-Income Community","2011-2015"]
["Puerto Rico","Mayagüez","72097081200","Low-Income Community","2011-2015"]
["Puerto Rico","Mayagüez","72097081300","Low-Income Community","2011-2015"]
["Puerto Rico","Mayagüez","72097081501","Low-Income Community","2011-2015"]
["Puerto Rico","Mayagüez","72097081512","Low-Income Community","2011-2015"]
["Puerto Rico","Mayagüez","72097081522","Low-Income Community","2011-2015"]
["Puerto Rico","Mayagüez","72097081601","Low-Income Community","2011-2015"]
["Puerto Rico","Mayagüez","72097081602","Low-Income Community","2011-2015"]
["Puerto Rico","Mayagüez","72097081700","Low-Income Community","2011-2015"]
["Puerto Rico","Mayagüez","72097081800","Low-Income Community","2011-2015"]
["Puerto Rico","Mayagüez","72097081900","Low-Income Community","2011-2015"]
["Puerto Rico","Mayagüez","72097082001","Low-Income Community","2011-2015"]
["Puerto Rico","Mayagüez","72097082012","Low-Income Community","2011-2015"]
["Puerto Rico","Mayagüez","72097082022","Low-Income Community","2011-2015"]
["Puerto Rico","Mayagüez","72097082102","Low-Income Community","2011-2015"]
["Puerto Rico","Mayagüez","72097082103","Low-Income Community","2011-2015"]
["Puerto Rico","Mayagüez","72097082104","Low-Income Community","2011-2015"]
["Puerto Rico","Moca","72099420100","Low-Income Community","2011-2015"]
["Puerto Rico","Moca","72099420200","Low-Income Community","2011-2015"]
["Puerto Rico","Moca","72099420301","Low-Income Community","2011-2015"]
["Puerto Rico","Moca","72099420302","Low-Income Community","2011-2015"]
["Puerto Rico","Moca","72099420401","Low-Income Community","2011-2015"]
["Puerto Rico","Moca","72099420402","Low-Income Community","2011-2015"]
["Puerto Rico","Moca","72099420500","Low-Income Community","2011-2015"]
["Puerto Rico","Morovis","72101955201","Low-Income Community","2011-2015"]
["Puerto Rico","Morovis","72101955202","Low-Income Community","2011-2015"]
["Puerto Rico","Morovis","72101955300","Low-Income Community","2011-2015"]
["Puerto Rico","Morovis","72101955401","Low-Income Community","2011-2015"]
["Puerto Rico","Morovis","72101955402","Low-Income Community","2011-2015"]
["Puerto Rico","Morovis","72101955500","Low-Income Community","2011-2015"]
["Puerto Rico","Naguabo","72103170100","Low-Income Community","2011-2015"]
["Puerto Rico","Naguabo","72103170200","Low-Income Community","2011-2015"]
["Puerto Rico","Naguabo","72103170300","Low-Income Community","2011-2015"]
["Puerto Rico","Naguabo","72103170400","Low-Income Community","2011-2015"]
["Puerto Rico","Naranjito","72105520100","Low-Income Community","2011-2015"]
["Puerto Rico","Naranjito","72105520200","Low-Income Community","2011-2015"]
["Puerto Rico","Naranjito","72105520300","Low-Income Community","2011-2015"]
["Puerto Rico","Naranjito","72105520400","Low-Income Community","2011-2015"]
["Puerto Rico","Naranjito","72105520500","Low-Income Community","2011-2015"]
["Puerto Rico","Orocovis","72107954801","Low-Income Community","2011-2015"]
["Puerto Rico","Orocovis","72107954802","Low-Income Community","2011-2015"]
["Puerto Rico","Orocovis","72107954901","Low-Income Community","2011-2015"]
["Puerto Rico","Orocovis","72107954902","Low-Income Community","2011-2015"]
["Puerto Rico","Orocovis","72107955001","Low-Income Community","2011-2015"]
["Puerto Rico","Orocovis","72107955002","Low-Income Community","2011-2015"]
["Puerto Rico","Orocovis","72107955100","Low-Income Community","2011-2015"]
["Puerto Rico","Patillas","72109290100","Low-Income Community","2011-2015"]
["Puerto Rico","Patillas","72109290200","Low-Income Community","2011-2015"]
["Puerto Rico","Patillas","72109290300","Low-Income Community","2011-2015"]
["Puerto Rico","Patillas","72109290400","Low-Income Community","2011-2015"]
["Puerto Rico","Peñuelas","72111730100","Low-Income Community","2011-2015"]
["Puerto Rico","Peñuelas","72111730200","Low-Income Community","2011-2015"]
["Puerto Rico","Peñuelas","72111730300","Low-Income Community","2011-2015"]
["Puerto Rico","Peñuelas","72111730400","Low-Income Community","2011-2015"]
["Puerto Rico","Peñuelas","72111730700","Low-Income Community","2011-2015"]
["Puerto Rico","Peñuelas","72111730800","Low-Income Community","2011-2015"]
["Puerto Rico","Ponce","72113070100","Low-Income Community","2011-2015"]
["Puerto Rico","Ponce","72113070201","Low-Income Community","2011-2015"]
["Puerto Rico","Ponce","72113070202","Low-Income Community","2011-2015"]
["Puerto Rico","Ponce","72113070300","Low-Income Community","2011-2015"]
["Puerto Rico","Ponce","72113070400","Low-Income Community","2011-2015"]
["Puerto Rico","Ponce","72113070502","Low-Income Community","2011-2015"]
["Puerto Rico","Ponce","72113070503","Low-Income Community","2011-2015"]
["Puerto Rico","Ponce","72113070513","Low-Income Community","2011-2015"]
["Puerto Rico","Ponce","72113070514","Low-Income Community","2011-2015"]
["Puerto Rico","Ponce","72113070522","Low-Income Community","2011-2015"]
["Puerto Rico","Ponce","72113070800","Low-Income Community","2011-2015"]
["Puerto Rico","Ponce","72113070900","Low-Income Community","2011-2015"]
["Puerto Rico","Ponce","72113071000","Low-Income Community","2011-2015"]
["Puerto Rico","Ponce","72113071200","Low-Income Community","2011-2015"]
["Puerto Rico","Ponce","72113071300","Low-Income Community","2011-2015"]
["Puerto Rico","Ponce","72113071401","Low-Income Community","2011-2015"]
["Puerto Rico","Ponce","72113071402","Low-Income Community","2011-2015"]
["Puerto Rico","Ponce","72113071500","Low-Income Community","2011-2015"]
["Puerto Rico","Ponce","72113071601","Low-Income Community","2011-2015"]
["Puerto Rico","Ponce","72113071602","Low-Income Community","2011-2015"]
["Puerto Rico","Ponce","72113071700","Low-Income Community","2011-2015"]
["Puerto Rico","Ponce","72113071800","Low-Income Community","2011-2015"]
["Puerto Rico","Ponce","72113071900","Low-Income Community","2011-2015"]
["Puerto Rico","Ponce","72113072000","Low-Income Community","2011-2015"]
["Puerto Rico","Ponce","72113072101","Low-Income Community","2011-2015"]
["Puerto Rico","Ponce","72113072102","Low-Income Community","2011-2015"]
["Puerto Rico","Ponce","72113072201","Low-Income Community","2011-2015"]
["Puerto Rico","Ponce","72113072202","Low-Income Community","2011-2015"]
["Puerto Rico","Ponce","72113072300","Low-Income Community","2011-2015"]
["Puerto Rico","Ponce","72113072400","Low-Income Community","2011-2015"]
["Puerto Rico","Ponce","72113072500","Low-Income Community","2011-2015"]
["Puerto Rico","Ponce","72113072600","Low-Income Community","2011-2015"]
["Puerto Rico","Ponce","72113072701","Low-Income Community","2011-2015"]
["Puerto Rico","Ponce","72113072703","Low-Income Community","2011-2015"]
["Puerto Rico","Ponce","72113072704","Low-Income Community","2011-2015"]
["Puerto Rico","Ponce","72113072900","Low-Income Community","2011-2015"]
["Puerto Rico","Ponce","72113073001","Low-Income Community","2011-2015"]
["Puerto Rico","Ponce","72113073002","Low-Income Community","2011-2015"]
["Puerto Rico","Ponce","72113073003","Low-Income Community","2011-2015"]
["Puerto Rico","Ponce","72113073004","Low-Income Community","2011-2015"]
["Puerto Rico","Ponce","72113073005","Low-Income Community","2011-2015"]
["Puerto Rico","Ponce","72113073006","Low-Income Community","2011-2015"]
["Puerto Rico","Ponce","72113073009","Low-Income Community","2011-2015"]
["Puerto Rico","Ponce","72113073010","Low-Income Community","2011-2015"]
["Puerto Rico","Quebradillas","72115330100","Low-Income Community","2011-2015"]
["Puerto Rico","Quebradillas","72115330200","Low-Income Community","2011-2015"]
["Puerto Rico","Quebradillas","72115330300","Low-Income Community","2011-2015"]
["Puerto Rico","Quebradillas","72115330400","Low-Income Community","2011-2015"]
["Puerto Rico","Rincón","72117959400","Low-Income Community","2011-2015"]
["Puerto Rico","Rincón","72117959500","Low-Income Community","2011-2015"]
["Puerto Rico","Rincón","72117959600","Low-Income Community","2011-2015"]
["Puerto Rico","Río Grande","72119130101","Low-Income Community","2011-2015"]
["Puerto Rico","Río Grande","72119130102","Low-Income Community","2012-2016"]
["Puerto Rico","Río Grande","72119130200","Low-Income Community","2011-2015"]
["Puerto Rico","Río Grande","72119130300","Low-Income Community","2011-2015"]
["Puerto Rico","Río Grande","72119130401","Low-Income Community","2011-2015"]
["Puerto Rico","Río Grande","72119130402","Low-Income Community","2011-2015"]
["Puerto Rico","Río Grande","72119130500","Low-Income Community","2011-2015"]
["Puerto Rico","Río Grande","72119130601","Low-Income Community","2011-2015"]
["Puerto Rico","Río Grande","72119130602","Low-Income Community","2011-2015"]
["Puerto Rico","Río Grande","72119130701","Low-Income Community","2011-2015"]
["Puerto Rico","Río Grande","72119130702","Low-Income Community","2011-2015"]
["Puerto Rico","Sabana Grande","72121960300","Low-Income Community","2011-2015"]
["Puerto Rico","Sabana Grande","72121960400","Low-Income Community","2011-2015"]
["Puerto Rico","Sabana Grande","72121960500","Low-Income Community","2011-2015"]
["Puerto Rico","Sabana Grande","72121960600","Low-Income Community","2011-2015"]
["Puerto Rico","Sabana Grande","72121960700","Low-Income Community","2011-2015"]
["Puerto Rico","Sabana Grande","72121960800","Low-Income Community","2011-2015"]
["Puerto Rico","Salinas","72123952600","Low-Income Community","2011-2015"]
["Puerto Rico","Salinas","72123952700","Low-Income Community","2011-2015"]
["Puerto Rico","Salinas","72123952800","Low-Income Community","2011-2015"]
["Puerto Rico","Salinas","72123952900","Low-Income Community","2011-2015"]
["Puerto Rico","Salinas","72123953000","Low-Income Community","2011-2015"]
["Puerto Rico","Salinas","72123953100","Low-Income Community","2011-2015"]
["Puerto Rico","Salinas","72123953200","Low-Income Community","2011-2015"]
["Puerto Rico","San Germán","72125840100","Low-Income Community","2011-2015"]
["Puerto Rico","San Germán","72125840200","Low-Income Community","2011-2015"]
["Puerto Rico","San Germán","72125840300","Low-Income Community","2011-2015"]
["Puerto Rico","San Germán","72125840400","Low-Income Community","2011-2015"]
["Puerto Rico","San Germán","72125840500","Low-Income Community","2011-2015"]
["Puerto Rico","San Germán","72125840600","Low-Income Community","2011-2015"]
["Puerto Rico","San Germán","72125840700","Low-Income Community","2011-2015"]
["Puerto Rico","San Juan","72127000400","Low-Income Community","2011-2015"]
["Puerto Rico","San Juan","72127000506","Low-Income Community","2011-2015"]
["Puerto Rico","San Juan","72127000600","Low-Income Community","2011-2015"]
["Puerto Rico","San Juan","72127000700","Low-Income Community","2011-2015"]
["Puerto Rico","San Juan","72127001000","Non-LIC Contiguous","2011-2015"]
["Puerto Rico","San Juan","72127001100","Low-Income Community","2011-2015"]
["Puerto Rico","San Juan","72127001200","Non-LIC Contiguous","2011-2015"]
["Puerto Rico","San Juan","72127001301","Low-Income Community","2011-2015"]
["Puerto Rico","San Juan","72127001302","Low-Income Community","2011-2015"]
["Puerto Rico","San Juan","72127001400","Low-Income Community","2011-2015"]
["Puerto Rico","San Juan","72127001500","Low-Income Community","2011-2015"]
["Puerto Rico","San Juan","72127001600","Non-LIC Contiguous","2011-2015"]
["Puerto Rico","San Juan","72127001800","Low-Income Community","2011-2015"]
["Puerto Rico","San Juan","72127002002","Low-Income Community","2011-2015"]
["Puerto Rico","San Juan","72127002100","Low-Income Community","2011-2015"]
["Puerto Rico","San Juan","72127002200","Low-Income Community","2011-2015"]
["Puerto Rico","San Juan","72127002300","Low-Income Community","2011-2015"]
["Puerto Rico","San Juan","72127002400","Low-Income Community","2011-2015"]
["Puerto Rico","San Juan","72127002500","Low-Income Community","2011-2015"]
["Puerto Rico","San Juan","72127002600","Low-Income Community","2011-2015"]
["Puerto Rico","San Juan","72127002800","Low-Income Community","2011-2015"]
["Puerto Rico","San Juan","72127002900","Low-Income Community","2011-2015"]
["Puerto Rico","San Juan","72127003000","Low-Income Community","2011-2015"]
["Puerto Rico","San Juan","72127003100","Low-Income Community","2011-2015"]
["Puerto Rico","San Juan","72127003200","Low-Income Community","2011-2015"]
["Puerto Rico","San Juan","72127003300","Low-Income Community","2011-2015"]
["Puerto Rico","San Juan","72127003400","Low-Income Community","2011-2015"]
["Puerto Rico","San Juan","72127003501","Low-Income Community","2011-2015"]
["Puerto Rico","San Juan","72127003502","Low-Income Community","2011-2015"]
["Puerto Rico","San Juan","72127003600","Low-Income Community","2011-2015"]
["Puerto Rico","San Juan","72127003700","Low-Income Community","2011-2015"]
["Puerto Rico","San Juan","72127003800","Low-Income Community","2011-2015"]
["Puerto Rico","San Juan","72127003902","Low-Income Community","2011-2015"]
["Puerto Rico","San Juan","72127004200","Low-Income Community","2011-2015"]
["Puerto Rico","San Juan","72127004306","Low-Income Community","2011-2015"]
["Puerto Rico","San Juan","72127004400","Low-Income Community","2011-2015"]
["Puerto Rico","San Juan","72127004500","Low-Income Community","2011-2015"]
["Puerto Rico","San Juan","72127004600","Low-Income Community","2011-2015"]
["Puerto Rico","San Juan","72127004700","Low-Income Community","2011-2015"]
["Puerto Rico","San Juan","72127004800","Low-Income Community","2011-2015"]
["Puerto Rico","San Juan","72127004900","Low-Income Community","2011-2015"]
["Puerto Rico","San Juan","72127005000","Low-Income Community","2011-2015"]
["Puerto Rico","San Juan","72127005101","Low-Income Community","2011-2015"]
["Puerto Rico","San Juan","72127005102","Low-Income Community","2011-2015"]
["Puerto Rico","San Juan","72127005103","Low-Income Community","2011-2015"]
["Puerto Rico","San Juan","72127005201","Low-Income Community","2011-2015"]
["Puerto Rico","San Juan","72127005202","Low-Income Community","2011-2015"]
["Puerto Rico","San Juan","72127005204","Low-Income Community","2011-2015"]
["Puerto Rico","San Juan","72127005214","Low-Income Community","2011-2015"]
["Puerto Rico","San Juan","72127005215","Low-Income Community","2011-2015"]
["Puerto Rico","San Juan","72127005300","Low-Income Community","2011-2015"]
["Puerto Rico","San Juan","72127005401","Low-Income Community","2011-2015"]
["Puerto Rico","San Juan","72127005402","Low-Income Community","2011-2015"]
["Puerto Rico","San Juan","72127005403","Low-Income Community","2011-2015"]
["Puerto Rico","San Juan","72127005500","Low-Income Community","2011-2015"]
["Puerto Rico","San Juan","72127005601","Low-Income Community","2011-2015"]
["Puerto Rico","San Juan","72127005602","Low-Income Community","2011-2015"]
["Puerto Rico","San Juan","72127005800","Low-Income Community","2011-2015"]
["Puerto Rico","San Juan","72127005900","Low-Income Community","2011-2015"]
["Puerto Rico","San Juan","72127006000","Low-Income Community","2011-2015"]
["Puerto Rico","San Juan","72127006101","Low-Income Community","2011-2015"]
["Puerto Rico","San Juan","72127006102","Low-Income Community","2011-2015"]
["Puerto Rico","San Juan","72127006200","Low-Income Community","2011-2015"]
["Puerto Rico","San Juan","72127006300","Low-Income Community","2011-2015"]
["Puerto Rico","San Juan","72127006500","Low-Income Community","2011-2015"]
["Puerto Rico","San Juan","72127006600","Low-Income Community","2011-2015"]
["Puerto Rico","San Juan","72127006700","Low-Income Community","2011-2015"]
["Puerto Rico","San Juan","72127006800","Low-Income Community","2011-2015"]
["Puerto Rico","San Juan","72127006900","Low-Income Community","2011-2015"]
["Puerto Rico","San Juan","72127007004","Low-Income Community","2011-2015"]
["Puerto Rico","San Juan","72127007100","Low-Income Community","2011-2015"]
["Puerto Rico","San Juan","72127007300","Low-Income Community","2011-2015"]
["Puerto Rico","San Juan","72127007400","Low-Income Community","2011-2015"]
["Puerto Rico","San Juan","72127007500","Low-Income Community","2011-2015"]
["Puerto Rico","San Juan","72127007600","Low-Income Community","2011-2015"]
["Puerto Rico","San Juan","72127007700","Low-Income Community","2011-2015"]
["Puerto Rico","San Juan","72127007800","Low-Income Community","2011-2015"]
["Puerto Rico","San Juan","72127007900","Low-Income Community","2011-2015"]
["Puerto Rico","San Juan","72127008001","Low-Income Community","2011-2015"]
["Puerto Rico","San Juan","72127008002","Low-Income Community","2011-2015"]
["Puerto Rico","San Juan","72127008100","Non-LIC Contiguous","2011-2015"]
["Puerto Rico","San Juan","72127008201","Low-Income Community","2011-2015"]
["Puerto Rico","San Juan","72127008202","Low-Income Community","2011-2015"]
["Puerto Rico","San Juan","72127008300","Low-Income Community","2011-2015"]
["Puerto Rico","San Juan","72127008400","Low-Income Community","2011-2015"]
["Puerto Rico","San Juan","72127008500","Low-Income Community","2011-2015"]
["Puerto Rico","San Juan","72127008601","Non-LIC Contiguous","2011-2015"]
["Puerto Rico","San Juan","72127008602","Low-Income Community","2011-2015"]
["Puerto Rico","San Juan","72127008603","Low-Income Community","2011-2015"]
["Puerto Rico","San Juan","72127008700","Low-Income Community","2011-2015"]
["Puerto Rico","San Juan","72127008900","Low-Income Community","2011-2015"]
["Puerto Rico","San Juan","72127009000","Low-Income Community","2011-2015"]
["Puerto Rico","San Juan","72127009111","Low-Income Community","2011-2015"]
["Puerto Rico","San Juan","72127009112","Low-Income Community","2011-2015"]
["Puerto Rico","San Juan","72127009121","Low-Income Community","2011-2015"]
["Puerto Rico","San Juan","72127009122","Low-Income Community","2011-2015"]
["Puerto Rico","San Juan","72127009123","Non-LIC Contiguous","2011-2015"]
["Puerto Rico","San Juan","72127009300","Low-Income Community","2011-2015"]
["Puerto Rico","San Juan","72127009400","Low-Income Community","2011-2015"]
["Puerto Rico","San Juan","72127009601","Non-LIC Contiguous","2011-2015"]
["Puerto Rico","San Juan","72127009602","Low-Income Community","2011-2015"]
["Puerto Rico","San Juan","72127009603","Low-Income Community","2011-2015"]
["Puerto Rico","San Juan","72127009624","Low-Income Community","2011-2015"]
["Puerto Rico","San Juan","72127009800","Low-Income Community","2011-2015"]
["Puerto Rico","San Juan","72127009901","Non-LIC Contiguous","2011-2015"]
["Puerto Rico","San Juan","72127009902","Low-Income Community","2011-2015"]
["Puerto Rico","San Juan","72127009903","Non-LIC Contiguous","2011-2015"]
["Puerto Rico","San Juan","72127010001","Low-Income Community","2011-2015"]
["Puerto Rico","San Juan","72127010012","Low-Income Community","2011-2015"]
["Puerto Rico","San Juan","72127010022","Non-LIC Contiguous","2011-2015"]
["Puerto Rico","San Juan","72127010032","Low-Income Community","2011-2015"]
["Puerto Rico","San Juan","72127010042","Low-Income Community","2011-2015"]
["Puerto Rico","San Juan","72127010100","Low-Income Community","2011-2015"]
["Puerto Rico","San Juan","72127010200","Low-Income Community","2011-2015"]
["Puerto Rico","San Juan","72127010500","Low-Income Community","2011-2015"]
["Puerto Rico","San Juan","72127980000","Low-Income Community","2011-2015"]
["Puerto Rico","San Juan","72127980103","Low-Income Community","2011-2015"]
["Puerto Rico","San Juan","72127980200","Low-Income Community","2011-2015"]
["Puerto Rico","San Lorenzo","72129220100","Low-Income Community","2011-2015"]
["Puerto Rico","San Lorenzo","72129220200","Low-Income Community","2011-2015"]
["Puerto Rico","San Lorenzo","72129220300","Low-Income Community","2011-2015"]
["Puerto Rico","San Lorenzo","72129220401","Low-Income Community","2011-2015"]
["Puerto Rico","San Lorenzo","72129220402","Low-Income Community","2011-2015"]
["Puerto Rico","San Lorenzo","72129220501","Low-Income Community","2011-2015"]
["Puerto Rico","San Lorenzo","72129220502","Low-Income Community","2011-2015"]
["Puerto Rico","San Lorenzo","72129220600","Low-Income Community","2011-2015"]
["Puerto Rico","San Lorenzo","72129220700","Low-Income Community","2011-2015"]
["Puerto Rico","San Sebastián","72131009200","Low-Income Community","2011-2015"]
["Puerto Rico","San Sebastián","72131958500","Low-Income Community","2011-2015"]
["Puerto Rico","San Sebastián","72131958700","Low-Income Community","2011-2015"]
["Puerto Rico","San Sebastián","72131958800","Low-Income Community","2011-2015"]
["Puerto Rico","San Sebastián","72131958900","Low-Income Community","2011-2015"]
["Puerto Rico","San Sebastián","72131959000","Low-Income Community","2011-2015"]
["Puerto Rico","San Sebastián","72131959200","Low-Income Community","2011-2015"]
["Puerto Rico","San Sebastián","72131959300","Low-Income Community","2011-2015"]
["Puerto Rico","San Sebastián","72131959500","Low-Income Community","2011-2015"]
["Puerto Rico","Santa Isabel","72133953300","Low-Income Community","2011-2015"]
["Puerto Rico","Santa Isabel","72133953500","Low-Income Community","2011-2015"]
["Puerto Rico","Santa Isabel","72133953600","Low-Income Community","2011-2015"]
["Puerto Rico","Santa Isabel","72133953700","Low-Income Community","2011-2015"]
["Puerto Rico","Santa Isabel","72133953800","Low-Income Community","2011-2015"]
["Puerto Rico","Toa Alta","72135510102","Low-Income Community","2011-2015"]
["Puerto Rico","Toa Alta","72135510200","Low-Income Community","2011-2015"]
["Puerto Rico","Toa Alta","72135510300","Low-Income Community","2011-2015"]
["Puerto Rico","Toa Alta","72135510400","Low-Income Community","2011-2015"]
["Puerto Rico","Toa Alta","72135510502","Low-Income Community","2011-2015"]
["Puerto Rico","Toa Alta","72135510503","Low-Income Community","2011-2015"]
["Puerto Rico","Toa Alta","72135510504","Low-Income Community","2011-2015"]
["Puerto Rico","Toa Alta","72135510601","Low-Income Community","2011-2015"]
["Puerto Rico","Toa Alta","72135510602","Low-Income Community","2011-2015"]
["Puerto Rico","Toa Alta","72135510701","Low-Income Community","2011-2015"]
["Puerto Rico","Toa Alta","72135510702","Low-Income Community","2011-2015"]
["Puerto Rico","Toa Baja","72137120200","Low-Income Community","2011-2015"]
["Puerto Rico","Toa Baja","72137120300","Low-Income Community","2011-2015"]
["Puerto Rico","Toa Baja","72137120400","Non-LIC Contiguous","2011-2015"]
["Puerto Rico","Toa Baja","72137120500","Low-Income Community","2011-2015"]
["Puerto Rico","Toa Baja","72137120600","Low-Income Community","2011-2015"]
["Puerto Rico","Toa Baja","72137120700","Low-Income Community","2011-2015"]
["Puerto Rico","Toa Baja","72137120800","Low-Income Community","2011-2015"]
["Puerto Rico","Toa Baja","72137120900","Low-Income Community","2011-2015"]
["Puerto Rico","Toa Baja","72137121001","Low-Income Community","2011-2015"]
["Puerto Rico","Toa Baja","72137121002","Low-Income Community","2011-2015"]
["Puerto Rico","Toa Baja","72137121100","Low-Income Community","2011-2015"]
["Puerto Rico","Toa Baja","72137121200","Low-Income Community","2011-2015"]
["Puerto Rico","Toa Baja","72137121300","Low-Income Community","2011-2015"]
["Puerto Rico","Toa Baja","72137121400","Non-LIC Contiguous","2011-2015"]
["Puerto Rico","Toa Baja","72137121701","Low-Income Community","2011-2015"]
["Puerto Rico","Toa Baja","72137121702","Low-Income Community","2011-2015"]
["Puerto Rico","Toa Baja","72137121801","Low-Income Community","2011-2015"]
["Puerto Rico","Toa Baja","72137121802","Low-Income Community","2011-2015"]
["Puerto Rico","Toa Baja","72137121900","Low-Income Community","2011-2015"]
["Puerto Rico","Toa Baja","72137122001","Low-Income Community","2011-2015"]
["Puerto Rico","Toa Baja","72137122002","Low-Income Community","2012-2016"]
["Puerto Rico","Toa Baja","72137122100","Low-Income Community","2011-2015"]
["Puerto Rico","Toa Baja","72137122201","Low-Income Community","2011-2015"]
["Puerto Rico","Toa Baja","72137122202","Low-Income Community","2011-2015"]
["Puerto Rico","Toa Baja","72137122400","Low-Income Community","2011-2015"]
["Puerto Rico","Trujillo Alto","72139060102","Low-Income Community","2011-2015"]
["Puerto Rico","Trujillo Alto","72139060103","Low-Income Community","2011-2015"]
["Puerto Rico","Trujillo Alto","72139060104","Non-LIC Contiguous","2011-2015"]
["Puerto Rico","Trujillo Alto","72139060211","Low-Income Community","2011-2015"]
["Puerto Rico","Trujillo Alto","72139060212","Low-Income Community","2011-2015"]
["Puerto Rico","Trujillo Alto","72139060222","Low-Income Community","2011-2015"]
["Puerto Rico","Trujillo Alto","72139060223","Low-Income Community","2011-2015"]
["Puerto Rico","Trujillo Alto","72139060301","Non-LIC Contiguous","2011-2015"]
["Puerto Rico","Trujillo Alto","72139060302","Low-Income Community","2011-2015"]
["Puerto Rico","Trujillo Alto","72139060401","Low-Income Community","2011-2015"]
["Puerto Rico","Trujillo Alto","72139060403","Low-Income Community","2011-2015"]
["Puerto Rico","Trujillo Alto","72139060501","Low-Income Community","2011-2015"]
["Puerto Rico","Trujillo Alto","72139060502","Low-Income Community","2011-2015"]
["Puerto Rico","Utuado","72141956900","Low-Income Community","2011-2015"]
["Puerto Rico","Utuado","72141957000","Low-Income Community","2011-2015"]
["Puerto Rico","Utuado","72141957100","Low-Income Community","2011-2015"]
["Puerto Rico","Utuado","72141957200","Low-Income Community","2011-2015"]
["Puerto Rico","Utuado","72141957300","Low-Income Community","2011-2015"]
["Puerto Rico","Utuado","72141957400","Low-Income Community","2011-2015"]
["Puerto Rico","Utuado","72141957500","Low-Income Community","2011-2015"]
["Puerto Rico","Utuado","72141957600","Low-Income Community","2011-2015"]
["Puerto Rico","Vega Alta","72143550100","Low-Income Community","2011-2015"]
["Puerto Rico","Vega Alta","72143550200","Low-Income Community","2011-2015"]
["Puerto Rico","Vega Alta","72143550300","Low-Income Community","2011-2015"]
["Puerto Rico","Vega Alta","72143550400","Low-Income Community","2011-2015"]
["Puerto Rico","Vega Alta","72143550500","Low-Income Community","2011-2015"]
["Puerto Rico","Vega Alta","72143550601","Low-Income Community","2011-2015"]
["Puerto Rico","Vega Alta","72143550602","Low-Income Community","2011-2015"]
["Puerto Rico","Vega Baja","72145560100","Low-Income Community","2011-2015"]
["Puerto Rico","Vega Baja","72145560201","Low-Income Community","2011-2015"]
["Puerto Rico","Vega Baja","72145560204","Low-Income Community","2011-2015"]
["Puerto Rico","Vega Baja","72145560300","Low-Income Community","2011-2015"]
["Puerto Rico","Vega Baja","72145560401","Low-Income Community","2011-2015"]
["Puerto Rico","Vega Baja","72145560402","Low-Income Community","2011-2015"]
["Puerto Rico","Vega Baja","72145560500","Low-Income Community","2011-2015"]
["Puerto Rico","Vega Baja","72145560600","Low-Income Community","2011-2015"]
["Puerto Rico","Vega Baja","72145560701","Low-Income Community","2011-2015"]
["Puerto Rico","Vega Baja","72145560702","Low-Income Community","2011-2015"]
["Puerto Rico","Vega Baja","72145560801","Low-Income Community","2011-2015"]
["Puerto Rico","Vega Baja","72145560802","Low-Income Community","2011-2015"]
["Puerto Rico","Vega Baja","72145560900","Low-Income Community","2011-2015"]
["Puerto Rico","Vieques","72147950500","Low-Income Community","2011-2015"]
["Puerto Rico","Vieques","72147950600","Low-Income Community","2011-2015"]
["Puerto Rico","Villalba","72149720100","Low-Income Community","2011-2015"]
["Puerto Rico","Villalba","72149720300","Low-Income Community","2011-2015"]
["Puerto Rico","Villalba","72149720400","Low-Income Community","2011-2015"]
["Puerto Rico","Villalba","72149720502","Low-Income Community","2011-2015"]
["Puerto Rico","Villalba","72149720503","Low-Income Community","2011-2015"]
["Puerto Rico","Villalba","72149720504","Low-Income Community","2011-2015"]
["Puerto Rico","Yabucoa","72151950600","Low-Income Community","2011-2015"]
["Puerto Rico","Yabucoa","72151950700","Low-Income Community","2011-2015"]
["Puerto Rico","Yabucoa","72151950800","Low-Income Community","2011-2015"]
["Puerto Rico","Yabucoa","72151950900","Low-Income Community","2011-2015"]
["Puerto Rico","Yabucoa","72151951000","Low-Income Community","2011-2015"]
["Puerto Rico","Yabucoa","72151951100","Low-Income Community","2011-2015"]
["Puerto Rico","Yabucoa","72151951200","Low-Income Community","2011-2015"]
["Puerto Rico","Yabucoa","72151951300","Low-Income Community","2011-2015"]
["Puerto Rico","Yauco","72153750101","Low-Income Community","2011-2015"]
["Puerto Rico","Yauco","72153750102","Low-Income Community","2011-2015"]
["Puerto Rico","Yauco","72153750201","Low-Income Community","2011-2015"]
["Puerto Rico","Yauco","72153750202","Low-Income Community","2011-2015"]
["Puerto Rico","Yauco","72153750300","Low-Income Community","2011-2015"]
["Puerto Rico","Yauco","72153750400","Low-Income Community","2011-2015"]
["Puerto Rico","Yauco","72153750501","Low-Income Community","2011-2015"]
["Puerto Rico","Yauco","72153750502","Low-Income Community","2011-2015"]
["Puerto Rico","Yauco","72153750503","Low-Income Community","2011-2015"]
["Puerto Rico","Yauco","72153750601","Low-Income Community","2011-2015"]
["Puerto Rico","Yauco","72153750602","Low-Income Community","2011-2015"]
["Rhode Island","Bristol","44001030500","Low-Income Community","2011-2015"]
["Rhode Island","Bristol","44001030700","Low-Income Community","2011-2015"]
["Rhode Island","Kent","44003020200","Low-Income Community","2011-2015"]
["Rhode Island","Newport","44005040500","Low-Income Community","2011-2015"]
["Rhode Island","Providence","44007000101","Low-Income Community","2011-2015"]
["Rhode Island","Providence","44007000200","Low-Income Community","2011-2015"]
["Rhode Island","Providence","44007000600","Low-Income Community","2011-2015"]
["Rhode Island","Providence","44007000800","Low-Income Community","2011-2015"]
["Rhode Island","Providence","44007001900","Low-Income Community","2011-2015"]
["Rhode Island","Providence","44007002500","Low-Income Community","2011-2015"]
["Rhode Island","Providence","44007010400","Low-Income Community","2011-2015"]
["Rhode Island","Providence","44007011100","Low-Income Community","2011-2015"]
["Rhode Island","Providence","44007011200","Low-Income Community","2011-2015"]
["Rhode Island","Providence","44007011800","Low-Income Community","2012-2016"]
["Rhode Island","Providence","44007014700","Low-Income Community","2011-2015"]
["Rhode Island","Providence","44007015100","Low-Income Community","2011-2015"]
["Rhode Island","Providence","44007015200","Low-Income Community","2011-2015"]
["Rhode Island","Providence","44007016100","Low-Income Community","2011-2015"]
["Rhode Island","Providence","44007016700","Low-Income Community","2011-2015"]
["Rhode Island","Providence","44007017900","Low-Income Community","2011-2015"]
["Rhode Island","Providence","44007018000","Low-Income Community","2011-2015"]
["Rhode Island","Providence","44007018500","Low-Income Community","2011-2015"]
["Rhode Island","Washington","44009050801","Low-Income Community","2011-2015"]
["Rhode Island","Washington","44009051400","Low-Income Community","2011-2015"]
["Rhode Island","Washington","44009051504","Low-Income Community","2011-2015"]
["South Carolina","Abbeville","45001950400","Low-Income Community","2011-2015"]
["South Carolina","Aiken","45003020802","Non-LIC Contiguous","2011-2015"]
["South Carolina","Aiken","45003020902","Low-Income Community","2011-2015"]
["South Carolina","Aiken","45003021400","Low-Income Community","2011-2015"]
["South Carolina","Allendale","45005970200","Low-Income Community","2011-2015"]
["South Carolina","Anderson","45007000800","Low-Income Community","2011-2015"]
["South Carolina","Anderson","45007011901","Low-Income Community","2011-2015"]
["South Carolina","Anderson","45007012002","Low-Income Community","2011-2015"]
["South Carolina","Anderson","45007012300","Low-Income Community","2011-2015"]
["South Carolina","Bamberg","45009960100","Low-Income Community","2011-2015"]
["South Carolina","Bamberg","45009960200","Low-Income Community","2011-2015"]
["South Carolina","Barnwell","45011970500","Low-Income Community","2011-2015"]
["South Carolina","Beaufort","45013000200","Low-Income Community","2011-2015"]
["South Carolina","Beaufort","45013000600","Low-Income Community","2011-2015"]
["South Carolina","Beaufort","45013010800","Low-Income Community","2011-2015"]
["South Carolina","Berkeley","45015020102","Low-Income Community","2011-2015"]
["South Carolina","Berkeley","45015020201","Low-Income Community","2011-2015"]
["South Carolina","Berkeley","45015020302","Low-Income Community","2011-2015"]
["South Carolina","Berkeley","45015020506","Non-LIC Contiguous","2011-2015"]
["South Carolina","Calhoun","45017950200","Low-Income Community","2011-2015"]
["South Carolina","Charleston","45019000700","Low-Income Community","2011-2015"]
["South Carolina","Charleston","45019002400","Low-Income Community","2011-2015"]
["South Carolina","Charleston","45019004000","Low-Income Community","2011-2015"]
["South Carolina","Charleston","45019004300","Low-Income Community","2011-2015"]
["South Carolina","Charleston","45019004400","Low-Income Community","2011-2015"]
["South Carolina","Charleston","45019005300","Low-Income Community","2011-2015"]
["South Carolina","Charleston","45019005400","Low-Income Community","2011-2015"]
["South Carolina","Charleston","45019005500","Low-Income Community","2011-2015"]
["South Carolina","Cherokee","45021970201","Low-Income Community","2011-2015"]
["South Carolina","Cherokee","45021970401","Low-Income Community","2011-2015"]
["South Carolina","Chester","45023020200","Low-Income Community","2011-2015"]
["South Carolina","Chester","45023020300","Low-Income Community","2011-2015"]
["South Carolina","Chesterfield","45025950101","Low-Income Community","2011-2015"]
["South Carolina","Chesterfield","45025950502","Low-Income Community","2011-2015"]
["South Carolina","Clarendon","45027960300","Low-Income Community","2011-2015"]
["South Carolina","Clarendon","45027960500","Low-Income Community","2011-2015"]
["South Carolina","Colleton","45029970401","Low-Income Community","2011-2015"]
["South Carolina","Colleton","45029970402","Non-LIC Contiguous","2011-2015"]
["South Carolina","Darlington","45031010600","Low-Income Community","2011-2015"]
["South Carolina","Darlington","45031011500","Low-Income Community","2011-2015"]
["South Carolina","Dillon","45033970300","Low-Income Community","2011-2015"]
["South Carolina","Dillon","45033970400","Low-Income Community","2011-2015"]
["South Carolina","Dillon","45033970600","Low-Income Community","2011-2015"]
["South Carolina","Dorchester","45035010200","Low-Income Community","2011-2015"]
["South Carolina","Dorchester","45035010400","Low-Income Community","2011-2015"]
["South Carolina","Dorchester","45035010700","Low-Income Community","2011-2015"]
["South Carolina","Edgefield","45037970400","Low-Income Community","2011-2015"]
["South Carolina","Fairfield","45039960100","Low-Income Community","2011-2015"]
["South Carolina","Fairfield","45039960300","Low-Income Community","2011-2015"]
["South Carolina","Fairfield","45039960400","Low-Income Community","2011-2015"]
["South Carolina","Fairfield","45039960500","Low-Income Community","2011-2015"]
["South Carolina","Florence","45041000700","Low-Income Community","2011-2015"]
["South Carolina","Florence","45041001000","Low-Income Community","2011-2015"]
["South Carolina","Florence","45041002000","Low-Income Community","2011-2015"]
["South Carolina","Florence","45041002201","Low-Income Community","2011-2015"]
["South Carolina","Florence","45041002500","Low-Income Community","2011-2015"]
["South Carolina","Georgetown","45043920201","Low-Income Community","2011-2015"]
["South Carolina","Georgetown","45043920302","Non-LIC Contiguous","2011-2015"]
["South Carolina","Georgetown","45043920700","Low-Income Community","2011-2015"]
["South Carolina","Greenville","45045000500","Low-Income Community","2011-2015"]
["South Carolina","Greenville","45045000700","Low-Income Community","2011-2015"]
["South Carolina","Greenville","45045000800","Low-Income Community","2011-2015"]
["South Carolina","Greenville","45045002005","Low-Income Community","2011-2015"]
["South Carolina","Greenville","45045002303","Low-Income Community","2011-2015"]
["South Carolina","Greenville","45045002505","Low-Income Community","2011-2015"]
["South Carolina","Greenville","45045003401","Low-Income Community","2011-2015"]
["South Carolina","Greenville","45045003904","Low-Income Community","2011-2015"]
["South Carolina","Greenville","45045004300","Low-Income Community","2011-2015"]
["South Carolina","Greenwood","45047970600","Low-Income Community","2011-2015"]
["South Carolina","Greenwood","45047970702","Low-Income Community","2011-2015"]
["South Carolina","Hampton","45049920300","Low-Income Community","2011-2015"]
["South Carolina","Horry","45051020200","Low-Income Community","2011-2015"]
["South Carolina","Horry","45051050600","Low-Income Community","2011-2015"]
["South Carolina","Horry","45051050700","Low-Income Community","2011-2015"]
["South Carolina","Horry","45051070200","Low-Income Community","2011-2015"]
["South Carolina","Horry","45051070300","Low-Income Community","2011-2015"]
["South Carolina","Horry","45051080102","Low-Income Community","2011-2015"]
["South Carolina","Jasper","45053950300","Low-Income Community","2011-2015"]
["South Carolina","Kershaw","45055970601","Low-Income Community","2011-2015"]
["South Carolina","Kershaw","45055970800","Low-Income Community","2011-2015"]
["South Carolina","Lancaster","45057010700","Low-Income Community","2011-2015"]
["South Carolina","Lancaster","45057010800","Low-Income Community","2011-2015"]
["South Carolina","Laurens","45059920301","Non-LIC Contiguous","2011-2015"]
["South Carolina","Laurens","45059920400","Low-Income Community","2011-2015"]
["South Carolina","Laurens","45059920700","Low-Income Community","2011-2015"]
["South Carolina","Lee","45061920200","Low-Income Community","2011-2015"]
["South Carolina","Lee","45061920302","Low-Income Community","2011-2015"]
["South Carolina","Lexington","45063020201","Low-Income Community","2011-2015"]
["South Carolina","Lexington","45063020300","Low-Income Community","2011-2015"]
["South Carolina","Lexington","45063020505","Low-Income Community","2011-2015"]
["South Carolina","Lexington","45063020509","Low-Income Community","2011-2015"]
["South Carolina","Lexington","45063020706","Low-Income Community","2011-2015"]
["South Carolina","Lexington","45063021402","Low-Income Community","2011-2015"]
["South Carolina","McCormick","45065920200","Low-Income Community","2011-2015"]
["South Carolina","Marion","45067950300","Low-Income Community","2011-2015"]
["South Carolina","Marion","45067950600","Low-Income Community","2011-2015"]
["South Carolina","Marlboro","45069960100","Low-Income Community","2011-2015"]
["South Carolina","Marlboro","45069960302","Low-Income Community","2011-2015"]
["South Carolina","Newberry","45071950502","Low-Income Community","2011-2015"]
["South Carolina","Oconee","45073030602","Low-Income Community","2011-2015"]
["South Carolina","Oconee","45073030701","Low-Income Community","2011-2015"]
["South Carolina","Orangeburg","45075010200","Low-Income Community","2011-2015"]
["South Carolina","Orangeburg","45075010600","Low-Income Community","2011-2015"]
["South Carolina","Orangeburg","45075011300","Low-Income Community","2011-2015"]
["South Carolina","Orangeburg","45075011400","Low-Income Community","2011-2015"]
["South Carolina","Pickens","45077010700","Non-LIC Contiguous","2011-2015"]
["South Carolina","Pickens","45077010801","Low-Income Community","2011-2015"]
["South Carolina","Pickens","45077011001","Low-Income Community","2011-2015"]
["South Carolina","Richland","45079000100","Low-Income Community","2011-2015"]
["South Carolina","Richland","45079000200","Low-Income Community","2011-2015"]
["South Carolina","Richland","45079000500","Low-Income Community","2011-2015"]
["South Carolina","Richland","45079000700","Low-Income Community","2011-2015"]
["South Carolina","Richland","45079010600","Low-Income Community","2011-2015"]
["South Carolina","Richland","45079010703","Low-Income Community","2011-2015"]
["South Carolina","Richland","45079010803","Low-Income Community","2011-2015"]
["South Carolina","Richland","45079010900","Low-Income Community","2011-2015"]
["South Carolina","Richland","45079011800","Low-Income Community","2011-2015"]
["South Carolina","Saluda","45081960400","Low-Income Community","2011-2015"]
["South Carolina","Spartanburg","45083020301","Low-Income Community","2011-2015"]
["South Carolina","Spartanburg","45083020400","Low-Income Community","2011-2015"]
["South Carolina","Spartanburg","45083020500","Low-Income Community","2011-2015"]
["South Carolina","Spartanburg","45083020702","Low-Income Community","2011-2015"]
["South Carolina","Spartanburg","45083020800","Low-Income Community","2011-2015"]
["South Carolina","Spartanburg","45083023202","Non-LIC Contiguous","2011-2015"]
["South Carolina","Sumter","45085000600","Low-Income Community","2011-2015"]
["South Carolina","Sumter","45085001100","Low-Income Community","2011-2015"]
["South Carolina","Sumter","45085001300","Low-Income Community","2011-2015"]
["South Carolina","Union","45087030100","Low-Income Community","2011-2015"]
["South Carolina","Williamsburg","45089970501","Low-Income Community","2011-2015"]
["South Carolina","Williamsburg","45089970502","Low-Income Community","2011-2015"]
["South Carolina","Williamsburg","45089970600","Low-Income Community","2011-2015"]
["South Carolina","York","45091060200","Low-Income Community","2011-2015"]
["South Carolina","York","45091060300","Low-Income Community","2011-2015"]
["South Carolina","York","45091060401","Low-Income Community","2011-2015"]
["South Carolina","York","45091060501","Low-Income Community","2011-2015"]
["South Dakota","Beadle","46005956900","Low-Income Community","2011-2015"]
["South Dakota","Beadle","46005957000","Low-Income Community","2011-2015"]
["South Dakota","Brookings","46011958900","Low-Income Community","2011-2015"]
["South Dakota","Brown","46013951500","Low-Income Community","2011-2015"]
["South Dakota","Brule","46015973100","Low-Income Community","2011-2015"]
["South Dakota","Charles Mix","46023940300","Low-Income Community","2011-2015"]
["South Dakota","Clay","46027965700","Low-Income Community","2011-2015"]
["South Dakota","Codington","46029954400","Low-Income Community","2011-2015"]
["South Dakota","Dewey","46041941500","Low-Income Community","2011-2015"]
["South Dakota","Lake","46079960200","Low-Income Community","2011-2015"]
["South Dakota","Lyman","46085940100","Low-Income Community","2011-2015"]
["South Dakota","Minnehaha","46099000500","Low-Income Community","2011-2015"]
["South Dakota","Minnehaha","46099000700","Low-Income Community","2011-2015"]
["South Dakota","Minnehaha","46099001001","Low-Income Community","2011-2015"]
["South Dakota","Minnehaha","46099010405","Non-LIC Contiguous","2011-2015"]
["South Dakota","Pennington","46103010200","Low-Income Community","2011-2015"]
["South Dakota","Pennington","46103010400","Low-Income Community","2011-2015"]
["South Dakota","Pennington","46103010500","Low-Income Community","2011-2015"]
["South Dakota","Pennington","46103011500","Low-Income Community","2011-2015"]
["South Dakota","Roberts","46109940400","Low-Income Community","2011-2015"]
["South Dakota","Oglala Lakota County/Shannon","46113940500","Low-Income Community","2011-2015"]
["South Dakota","Todd","46121940200","Low-Income Community","2011-2015"]
["South Dakota","Tripp","46123971700","Low-Income Community","2011-2015"]
["South Dakota","Yankton","46135966301","Non-LIC Contiguous","2011-2015"]
["South Dakota","Yankton","46135966302","Low-Income Community","2011-2015"]
["Tennessee","Anderson","47001020500","Low-Income Community","2011-2015"]
["Tennessee","Anderson","47001021000","Low-Income Community","2011-2015"]
["Tennessee","Bedford","47003950500","Low-Income Community","2011-2015"]
["Tennessee","Benton","47005963200","Low-Income Community","2011-2015"]
["Tennessee","Bledsoe","47007953100","Low-Income Community","2011-2015"]
["Tennessee","Blount","47009010100","Low-Income Community","2011-2015"]
["Tennessee","Blount","47009010200","Low-Income Community","2011-2015"]
["Tennessee","Blount","47009010301","Low-Income Community","2012-2016"]
["Tennessee","Blount","47009010302","Low-Income Community","2011-2015"]
["Tennessee","Bradley","47011010700","Low-Income Community","2011-2015"]
["Tennessee","Cannon","47015960200","Low-Income Community","2011-2015"]
["Tennessee","Carroll","47017962100","Low-Income Community","2011-2015"]
["Tennessee","Carter","47019071200","Low-Income Community","2011-2015"]
["Tennessee","Cheatham","47021070104","Low-Income Community","2012-2016"]
["Tennessee","Claiborne","47025970300","Low-Income Community","2011-2015"]
["Tennessee","Clay","47027955000","Low-Income Community","2011-2015"]
["Tennessee","Cocke","47029920200","Low-Income Community","2011-2015"]
["Tennessee","Cocke","47029920700","Low-Income Community","2011-2015"]
["Tennessee","Crockett","47033961100","Low-Income Community","2011-2015"]
["Tennessee","Cumberland","47035970400","Low-Income Community","2011-2015"]
["Tennessee","Cumberland","47035970800","Low-Income Community","2011-2015"]
["Tennessee","Davidson","47037010401","Low-Income Community","2011-2015"]
["Tennessee","Davidson","47037012600","Low-Income Community","2011-2015"]
["Tennessee","Davidson","47037013601","Low-Income Community","2011-2015"]
["Tennessee","Davidson","47037013602","Low-Income Community","2011-2015"]
["Tennessee","Davidson","47037013700","Low-Income Community","2011-2015"]
["Tennessee","Davidson","47037013800","Low-Income Community","2011-2015"]
["Tennessee","Davidson","47037013900","Low-Income Community","2011-2015"]
["Tennessee","Davidson","47037014200","Low-Income Community","2011-2015"]
["Tennessee","Davidson","47037014800","Low-Income Community","2011-2015"]
["Tennessee","Davidson","47037015628","Low-Income Community","2011-2015"]
["Tennessee","Davidson","47037015900","Low-Income Community","2011-2015"]
["Tennessee","Davidson","47037016000","Low-Income Community","2011-2015"]
["Tennessee","Davidson","47037016100","Low-Income Community","2011-2015"]
["Tennessee","Davidson","47037016200","Low-Income Community","2011-2015"]
["Tennessee","Davidson","47037016300","Low-Income Community","2011-2015"]
["Tennessee","Davidson","47037017300","Low-Income Community","2011-2015"]
["Tennessee","Davidson","47037019200","Low-Income Community","2011-2015"]
["Tennessee","Davidson","47037019300","Low-Income Community","2011-2015"]
["Tennessee","DeKalb","47041920200","Low-Income Community","2011-2015"]
["Tennessee","Dickson","47043060602","Low-Income Community","2011-2015"]
["Tennessee","Dyer","47045964300","Low-Income Community","2011-2015"]
["Tennessee","Fayette","47047060300","Low-Income Community","2011-2015"]
["Tennessee","Fentress","47049965300","Low-Income Community","2011-2015"]
["Tennessee","Gibson","47053966900","Low-Income Community","2011-2015"]
["Tennessee","Gibson","47053967000","Low-Income Community","2011-2015"]
["Tennessee","Greene","47059090100","Low-Income Community","2011-2015"]
["Tennessee","Greene","47059091200","Low-Income Community","2011-2015"]
["Tennessee","Grundy","47061955300","Low-Income Community","2011-2015"]
["Tennessee","Hamblen","47063100300","Low-Income Community","2011-2015"]
["Tennessee","Hamblen","47063100800","Low-Income Community","2011-2015"]
["Tennessee","Hamilton","47065000400","Low-Income Community","2011-2015"]
["Tennessee","Hamilton","47065001600","Low-Income Community","2011-2015"]
["Tennessee","Hamilton","47065001900","Low-Income Community","2011-2015"]
["Tennessee","Hamilton","47065002000","Low-Income Community","2011-2015"]
["Tennessee","Hamilton","47065003100","Low-Income Community","2011-2015"]
["Tennessee","Hamilton","47065012300","Low-Income Community","2011-2015"]
["Tennessee","Hamilton","47065012400","Low-Income Community","2011-2015"]
["Tennessee","Hancock","47067960600","Low-Income Community","2011-2015"]
["Tennessee","Hardeman","47069950300","Low-Income Community","2011-2015"]
["Tennessee","Hawkins","47073050400","Low-Income Community","2012-2016"]
["Tennessee","Hawkins","47073050601","Low-Income Community","2011-2015"]
["Tennessee","Haywood","47075930500","Non-LIC Contiguous","2011-2015"]
["Tennessee","Henderson","47077975400","Low-Income Community","2011-2015"]
["Tennessee","Henry","47079969000","Low-Income Community","2012-2016"]
["Tennessee","Hickman","47081950302","Low-Income Community","2011-2015"]
["Tennessee","Houston","47083120200","Low-Income Community","2011-2015"]
["Tennessee","Jackson","47087960400","Low-Income Community","2011-2015"]
["Tennessee","Johnson","47091956300","Low-Income Community","2011-2015"]
["Tennessee","Knox","47093000100","Low-Income Community","2011-2015"]
["Tennessee","Knox","47093000800","Low-Income Community","2011-2015"]
["Tennessee","Knox","47093001900","Low-Income Community","2011-2015"]
["Tennessee","Knox","47093002400","Low-Income Community","2011-2015"]
["Tennessee","Knox","47093003500","Low-Income Community","2011-2015"]
["Tennessee","Knox","47093006502","Low-Income Community","2011-2015"]
["Tennessee","Knox","47093006700","Low-Income Community","2011-2015"]
["Tennessee","Knox","47093006800","Low-Income Community","2011-2015"]
["Tennessee","Lake","47095960100","Low-Income Community","2011-2015"]
["Tennessee","Lauderdale","47097050504","Low-Income Community","2011-2015"]
["Tennessee","Lauderdale","47097050505","Low-Income Community","2011-2015"]
["Tennessee","Lawrence","47099960300","Low-Income Community","2011-2015"]
["Tennessee","Lawrence","47099960501","Low-Income Community","2011-2015"]
["Tennessee","Lincoln","47103975300","Low-Income Community","2011-2015"]
["Tennessee","Lincoln","47103975400","Low-Income Community","2012-2016"]
["Tennessee","Loudon","47105060202","Low-Income Community","2011-2015"]
["Tennessee","Loudon","47105060600","Low-Income Community","2011-2015"]
["Tennessee","McMinn","47107970101","Non-LIC Contiguous","2011-2015"]
["Tennessee","McMinn","47107970600","Low-Income Community","2011-2015"]
["Tennessee","Macon","47111970300","Low-Income Community","2011-2015"]
["Tennessee","Madison","47113000200","Low-Income Community","2011-2015"]
["Tennessee","Madison","47113000500","Low-Income Community","2011-2015"]
["Tennessee","Madison","47113000600","Low-Income Community","2011-2015"]
["Tennessee","Madison","47113000700","Low-Income Community","2011-2015"]
["Tennessee","Madison","47113000800","Low-Income Community","2011-2015"]
["Tennessee","Madison","47113000900","Low-Income Community","2011-2015"]
["Tennessee","Marion","47115050301","Low-Income Community","2011-2015"]
["Tennessee","Marshall","47117955300","Low-Income Community","2011-2015"]
["Tennessee","Meigs","47121960200","Low-Income Community","2011-2015"]
["Tennessee","Monroe","47123925000","Non-LIC Contiguous","2011-2015"]
["Tennessee","Monroe","47123925501","Low-Income Community","2011-2015"]
["Tennessee","Montgomery","47125100100","Low-Income Community","2011-2015"]
["Tennessee","Montgomery","47125100200","Low-Income Community","2011-2015"]
["Tennessee","Montgomery","47125100800","Low-Income Community","2011-2015"]
["Tennessee","Montgomery","47125100900","Low-Income Community","2011-2015"]
["Tennessee","Obion","47131965400","Low-Income Community","2012-2016"]
["Tennessee","Obion","47131965500","Low-Income Community","2011-2015"]
["Tennessee","Overton","47133950302","Low-Income Community","2011-2015"]
["Tennessee","Pickett","47137925100","Low-Income Community","2011-2015"]
["Tennessee","Polk","47139950400","Low-Income Community","2011-2015"]
["Tennessee","Putnam","47141000600","Low-Income Community","2011-2015"]
["Tennessee","Putnam","47141000800","Low-Income Community","2011-2015"]
["Tennessee","Putnam","47141001100","Low-Income Community","2011-2015"]
["Tennessee","Rhea","47143975401","Low-Income Community","2011-2015"]
["Tennessee","Roane","47145030600","Low-Income Community","2011-2015"]
["Tennessee","Rutherford","47149041800","Low-Income Community","2011-2015"]
["Tennessee","Rutherford","47149041900","Low-Income Community","2011-2015"]
["Tennessee","Rutherford","47149042100","Low-Income Community","2011-2015"]
["Tennessee","Scott","47151975200","Low-Income Community","2011-2015"]
["Tennessee","Sequatchie","47153060101","Non-LIC Contiguous","2011-2015"]
["Tennessee","Sevier","47155080101","Low-Income Community","2011-2015"]
["Tennessee","Sevier","47155080400","Low-Income Community","2011-2015"]
["Tennessee","Shelby","47157000200","Low-Income Community","2011-2015"]
["Tennessee","Shelby","47157000300","Low-Income Community","2011-2015"]
["Tennessee","Shelby","47157000400","Low-Income Community","2011-2015"]
["Tennessee","Shelby","47157001900","Low-Income Community","2011-2015"]
["Tennessee","Shelby","47157002000","Low-Income Community","2011-2015"]
["Tennessee","Shelby","47157002100","Low-Income Community","2011-2015"]
["Tennessee","Shelby","47157002400","Low-Income Community","2011-2015"]
["Tennessee","Shelby","47157002500","Low-Income Community","2011-2015"]
["Tennessee","Shelby","47157002700","Low-Income Community","2011-2015"]
["Tennessee","Shelby","47157002800","Low-Income Community","2011-2015"]
["Tennessee","Shelby","47157003000","Low-Income Community","2011-2015"]
["Tennessee","Shelby","47157003600","Low-Income Community","2011-2015"]
["Tennessee","Shelby","47157003700","Low-Income Community","2011-2015"]
["Tennessee","Shelby","47157003800","Low-Income Community","2011-2015"]
["Tennessee","Shelby","47157003900","Low-Income Community","2011-2015"]
["Tennessee","Shelby","47157004500","Low-Income Community","2011-2015"]
["Tennessee","Shelby","47157004600","Low-Income Community","2011-2015"]
["Tennessee","Shelby","47157005000","Low-Income Community","2011-2015"]
["Tennessee","Shelby","47157005900","Low-Income Community","2011-2015"]
["Tennessee","Shelby","47157006600","Low-Income Community","2011-2015"]
["Tennessee","Shelby","47157006700","Low-Income Community","2011-2015"]
["Tennessee","Shelby","47157007000","Low-Income Community","2011-2015"]
["Tennessee","Shelby","47157007300","Low-Income Community","2011-2015"]
["Tennessee","Shelby","47157007400","Low-Income Community","2011-2015"]
["Tennessee","Shelby","47157011200","Low-Income Community","2011-2015"]
["Tennessee","Shelby","47157011300","Low-Income Community","2011-2015"]
["Tennessee","Shelby","47157011400","Low-Income Community","2011-2015"]
["Tennessee","Shelby","47157011600","Low-Income Community","2011-2015"]
["Tennessee","Shelby","47157020210","Non-LIC Contiguous","2011-2015"]
["Tennessee","Shelby","47157020300","Low-Income Community","2011-2015"]
["Tennessee","Shelby","47157022111","Low-Income Community","2011-2015"]
["Tennessee","Shelby","47157022500","Low-Income Community","2011-2015"]
["Tennessee","Smith","47159975300","Low-Income Community","2011-2015"]
["Tennessee","Smith","47159975400","Non-LIC Contiguous","2011-2015"]
["Tennessee","Stewart","47161110600","Low-Income Community","2011-2015"]
["Tennessee","Sullivan","47163040200","Low-Income Community","2011-2015"]
["Tennessee","Sullivan","47163042701","Low-Income Community","2011-2015"]
["Tennessee","Sullivan","47163043000","Low-Income Community","2011-2015"]
["Tennessee","Sullivan","47163043302","Low-Income Community","2011-2015"]
["Tennessee","Sumner","47165020300","Low-Income Community","2011-2015"]
["Tennessee","Sumner","47165020700","Low-Income Community","2011-2015"]
["Tennessee","Tipton","47167040700","Low-Income Community","2011-2015"]
["Tennessee","Tipton","47167041000","Low-Income Community","2011-2015"]
["Tennessee","Unicoi","47171080100","Low-Income Community","2011-2015"]
["Tennessee","Unicoi","47171080200","Low-Income Community","2011-2015"]
["Tennessee","Union","47173040201","Low-Income Community","2011-2015"]
["Tennessee","Van Buren","47175925200","Low-Income Community","2011-2015"]
["Tennessee","Warren","47177930800","Low-Income Community","2011-2015"]
["Tennessee","Washington","47179060100","Low-Income Community","2011-2015"]
["Tennessee","Washington","47179060800","Low-Income Community","2011-2015"]
["Tennessee","Washington","47179060900","Low-Income Community","2011-2015"]
["Tennessee","Washington","47179062000","Low-Income Community","2011-2015"]
["Tennessee","Wayne","47181950200","Low-Income Community","2011-2015"]
["Tennessee","Weakley","47183968101","Low-Income Community","2011-2015"]
["Tennessee","White","47185935300","Low-Income Community","2012-2016"]
["Texas","Anderson","48001950401","Low-Income Community","2011-2015"]
["Texas","Anderson","48001950901","Low-Income Community","2011-2015"]
["Texas","Angelina","48005000200","Low-Income Community","2011-2015"]
["Texas","Angelina","48005000500","Low-Income Community","2011-2015"]
["Texas","Angelina","48005000600","Low-Income Community","2011-2015"]
["Texas","Angelina","48005000700","Low-Income Community","2011-2015"]
["Texas","Angelina","48005001001","Low-Income Community","2011-2015"]
["Texas","Angelina","48005001300","Low-Income Community","2011-2015"]
["Texas","Aransas","48007950100","Low-Income Community","2011-2015"]
["Texas","Aransas","48007950400","Low-Income Community","2011-2015"]
["Texas","Aransas","48007950500","Low-Income Community","2011-2015"]
["Texas","Atascosa","48013960300","Low-Income Community","2011-2015"]
["Texas","Atascosa","48013960401","Low-Income Community","2011-2015"]
["Texas","Bastrop","48021950200","Low-Income Community","2011-2015"]
["Texas","Bastrop","48021950600","Low-Income Community","2011-2015"]
["Texas","Bastrop","48021950801","Low-Income Community","2011-2015"]
["Texas","Bee","48025950600","Low-Income Community","2011-2015"]
["Texas","Bell","48027020800","Low-Income Community","2011-2015"]
["Texas","Bell","48027020900","Low-Income Community","2011-2015"]
["Texas","Bell","48027021601","Low-Income Community","2011-2015"]
["Texas","Bell","48027021602","Low-Income Community","2011-2015"]
["Texas","Bell","48027022000","Low-Income Community","2011-2015"]
["Texas","Bell","48027023204","Low-Income Community","2011-2015"]
["Texas","Bexar","48029110100","Low-Income Community","2011-2015"]
["Texas","Bexar","48029110500","Low-Income Community","2011-2015"]
["Texas","Bexar","48029110600","Low-Income Community","2011-2015"]
["Texas","Bexar","48029121203","Low-Income Community","2011-2015"]
["Texas","Bexar","48029121204","Low-Income Community","2011-2015"]
["Texas","Bexar","48029121205","Low-Income Community","2011-2015"]
["Texas","Bexar","48029130600","Low-Income Community","2011-2015"]
["Texas","Bexar","48029130700","Low-Income Community","2011-2015"]
["Texas","Bexar","48029130800","Low-Income Community","2011-2015"]
["Texas","Bexar","48029141800","Low-Income Community","2011-2015"]
["Texas","Bexar","48029150600","Low-Income Community","2011-2015"]
["Texas","Bexar","48029150800","Low-Income Community","2011-2015"]
["Texas","Bexar","48029152000","Low-Income Community","2011-2015"]
["Texas","Bexar","48029152100","Low-Income Community","2011-2015"]
["Texas","Bexar","48029160901","Low-Income Community","2011-2015"]
["Texas","Bexar","48029160902","Low-Income Community","2011-2015"]
["Texas","Bexar","48029161100","Low-Income Community","2011-2015"]
["Texas","Bexar","48029161200","Low-Income Community","2011-2015"]
["Texas","Bexar","48029162001","Low-Income Community","2011-2015"]
["Texas","Bexar","48029170102","Low-Income Community","2011-2015"]
["Texas","Bexar","48029171802","Low-Income Community","2011-2015"]
["Texas","Bexar","48029192200","Low-Income Community","2011-2015"]
["Texas","Bexar","48029980002","Low-Income Community","2011-2015"]
["Texas","Bexar","48029980100","Low-Income Community","2011-2015"]
["Texas","Bosque","48035950200","Low-Income Community","2011-2015"]
["Texas","Bowie","48037010400","Low-Income Community","2011-2015"]
["Texas","Bowie","48037010500","Low-Income Community","2011-2015"]
["Texas","Bowie","48037010800","Low-Income Community","2011-2015"]
["Texas","Bowie","48037011300","Low-Income Community","2011-2015"]
["Texas","Bowie","48037011401","Low-Income Community","2011-2015"]
["Texas","Bowie","48037011402","Low-Income Community","2011-2015"]
["Texas","Bowie","48037011502","Low-Income Community","2011-2015"]
["Texas","Brazoria","48039661200","Low-Income Community","2011-2015"]
["Texas","Brazoria","48039661400","Low-Income Community","2011-2015"]
["Texas","Brazoria","48039662800","Low-Income Community","2011-2015"]
["Texas","Brazoria","48039664100","Low-Income Community","2011-2015"]
["Texas","Brazoria","48039664200","Low-Income Community","2011-2015"]
["Texas","Brazoria","48039664300","Low-Income Community","2011-2015"]
["Texas","Brazos","48041000201","Low-Income Community","2011-2015"]
["Texas","Brazos","48041000202","Low-Income Community","2011-2015"]
["Texas","Brazos","48041000400","Low-Income Community","2011-2015"]
["Texas","Brazos","48041000500","Low-Income Community","2011-2015"]
["Texas","Brazos","48041000603","Low-Income Community","2011-2015"]
["Texas","Brazos","48041001301","Low-Income Community","2011-2015"]
["Texas","Brazos","48041001303","Low-Income Community","2011-2015"]
["Texas","Brazos","48041001702","Low-Income Community","2011-2015"]
["Texas","Brazos","48041002012","Low-Income Community","2011-2015"]
["Texas","Brazos","48041002014","Low-Income Community","2011-2015"]
["Texas","Brewster","48043950400","Low-Income Community","2011-2015"]
["Texas","Brooks","48047950200","Low-Income Community","2011-2015"]
["Texas","Brown","48049950700","Low-Income Community","2011-2015"]
["Texas","Burleson","48051970500","Low-Income Community","2011-2015"]
["Texas","Burnet","48053960300","Low-Income Community","2011-2015"]
["Texas","Caldwell","48055960200","Low-Income Community","2011-2015"]
["Texas","Caldwell","48055960400","Low-Income Community","2011-2015"]
["Texas","Caldwell","48055960500","Low-Income Community","2011-2015"]
["Texas","Calhoun","48057000500","Low-Income Community","2011-2015"]
["Texas","Cameron","48061010100","Low-Income Community","2011-2015"]
["Texas","Cameron","48061010201","Low-Income Community","2011-2015"]
["Texas","Cameron","48061010203","Low-Income Community","2011-2015"]
["Texas","Cameron","48061010301","Low-Income Community","2011-2015"]
["Texas","Cameron","48061010402","Low-Income Community","2011-2015"]
["Texas","Cameron","48061010800","Low-Income Community","2011-2015"]
["Texas","Cameron","48061011700","Low-Income Community","2011-2015"]
["Texas","Cameron","48061012102","Low-Income Community","2011-2015"]
["Texas","Cameron","48061012301","Low-Income Community","2011-2015"]
["Texas","Cameron","48061012304","Low-Income Community","2011-2015"]
["Texas","Cameron","48061012305","Low-Income Community","2011-2015"]
["Texas","Cameron","48061012700","Low-Income Community","2011-2015"]
["Texas","Cameron","48061013307","Low-Income Community","2011-2015"]
["Texas","Cameron","48061013802","Low-Income Community","2011-2015"]
["Texas","Cameron","48061014001","Low-Income Community","2011-2015"]
["Texas","Cameron","48061014200","Low-Income Community","2011-2015"]
["Texas","Camp","48063950101","Low-Income Community","2011-2015"]
["Texas","Camp","48063950102","Low-Income Community","2011-2015"]
["Texas","Cass","48067950200","Low-Income Community","2011-2015"]
["Texas","Cass","48067950400","Low-Income Community","2011-2015"]
["Texas","Cass","48067950600","Low-Income Community","2011-2015"]
["Texas","Cass","48067950700","Low-Income Community","2011-2015"]
["Texas","Castro","48069950200","Low-Income Community","2011-2015"]
["Texas","Chambers","48071710300","Low-Income Community","2011-2015"]
["Texas","Chambers","48071710401","Low-Income Community","2011-2015"]
["Texas","Chambers","48071710500","Low-Income Community","2011-2015"]
["Texas","Cherokee","48073950300","Low-Income Community","2011-2015"]
["Texas","Cherokee","48073950400","Low-Income Community","2011-2015"]
["Texas","Cherokee","48073951100","Low-Income Community","2011-2015"]
["Texas","Coleman","48083950300","Low-Income Community","2011-2015"]
["Texas","Collin","48085032013","Low-Income Community","2011-2015"]
["Texas","Comal","48091310608","Low-Income Community","2011-2015"]
["Texas","Cooke","48097000400","Low-Income Community","2011-2015"]
["Texas","Cooke","48097001100","Low-Income Community","2011-2015"]
["Texas","Coryell","48099010300","Low-Income Community","2011-2015"]
["Texas","Coryell","48099010501","Low-Income Community","2011-2015"]
["Texas","Coryell","48099010502","Low-Income Community","2011-2015"]
["Texas","Coryell","48099010504","Low-Income Community","2011-2015"]
["Texas","Coryell","48099010601","Low-Income Community","2011-2015"]
["Texas","Cottle","48101950100","Low-Income Community","2011-2015"]
["Texas","Crosby","48107950100","Low-Income Community","2011-2015"]
["Texas","Crosby","48107950200","Low-Income Community","2011-2015"]
["Texas","Dallas","48113002000","Low-Income Community","2011-2015"]
["Texas","Dallas","48113004100","Low-Income Community","2011-2015"]
["Texas","Dallas","48113005400","Low-Income Community","2011-2015"]
["Texas","Dallas","48113005700","Low-Income Community","2011-2015"]
["Texas","Dallas","48113008704","Low-Income Community","2011-2015"]
["Texas","Dallas","48113009301","Low-Income Community","2011-2015"]
["Texas","Dallas","48113010101","Low-Income Community","2011-2015"]
["Texas","Dallas","48113012207","Low-Income Community","2011-2015"]
["Texas","Dallas","48113012302","Low-Income Community","2011-2015"]
["Texas","Dallas","48113012701","Low-Income Community","2011-2015"]
["Texas","Dallas","48113015304","Low-Income Community","2011-2015"]
["Texas","Dallas","48113015900","Low-Income Community","2011-2015"]
["Texas","Dallas","48113016621","Low-Income Community","2011-2015"]
["Texas","Dallas","48113018111","Low-Income Community","2011-2015"]
["Texas","Dallas","48113018505","Low-Income Community","2011-2015"]
["Texas","Dallas","48113020300","Low-Income Community","2011-2015"]
["Texas","Dallas","48113020400","Low-Income Community","2011-2015"]
["Texas","Dallas","48113020500","Low-Income Community","2011-2015"]
["Texas","Dawson","48115950402","Low-Income Community","2011-2015"]
["Texas","Delta","48119950200","Low-Income Community","2011-2015"]
["Texas","Denton","48121020602","Low-Income Community","2011-2015"]
["Texas","Denton","48121021618","Low-Income Community","2011-2015"]
["Texas","Denton","48121021739","Low-Income Community","2011-2015"]
["Texas","DeWitt","48123970200","Low-Income Community","2011-2015"]
["Texas","Dickens","48125950300","Low-Income Community","2011-2015"]
["Texas","Donley","48129950200","Low-Income Community","2011-2015"]
["Texas","Eastland","48133950100","Low-Income Community","2011-2015"]
["Texas","Eastland","48133950200","Low-Income Community","2011-2015"]
["Texas","Ector","48135002700","Low-Income Community","2011-2015"]
["Texas","Ellis","48139060400","Low-Income Community","2011-2015"]
["Texas","Ellis","48139061000","Low-Income Community","2011-2015"]
["Texas","Ellis","48139061200","Low-Income Community","2011-2015"]
["Texas","Ellis","48139061300","Low-Income Community","2011-2015"]
["Texas","Ellis","48139061600","Low-Income Community","2011-2015"]
["Texas","El Paso","48141001203","Low-Income Community","2011-2015"]
["Texas","El Paso","48141001900","Low-Income Community","2011-2015"]
["Texas","El Paso","48141003000","Low-Income Community","2011-2015"]
["Texas","El Paso","48141003200","Low-Income Community","2011-2015"]
["Texas","El Paso","48141003501","Low-Income Community","2011-2015"]
["Texas","El Paso","48141003804","Low-Income Community","2011-2015"]
["Texas","El Paso","48141010102","Low-Income Community","2011-2015"]
["Texas","El Paso","48141010220","Low-Income Community","2011-2015"]
["Texas","El Paso","48141010334","Low-Income Community","2011-2015"]
["Texas","El Paso","48141010335","Low-Income Community","2011-2015"]
["Texas","El Paso","48141010340","Low-Income Community","2011-2015"]
["Texas","El Paso","48141010344","Low-Income Community","2011-2015"]
["Texas","El Paso","48141010347","Low-Income Community","2011-2015"]
["Texas","El Paso","48141010501","Low-Income Community","2011-2015"]
["Texas","El Paso","48141010504","Low-Income Community","2011-2015"]
["Texas","El Paso","48141010506","Low-Income Community","2011-2015"]
["Texas","Erath","48143950201","Low-Income Community","2011-2015"]
["Texas","Erath","48143950202","Low-Income Community","2011-2015"]
["Texas","Erath","48143950300","Low-Income Community","2011-2015"]
["Texas","Falls","48145000400","Low-Income Community","2011-2015"]
["Texas","Fannin","48147950402","Low-Income Community","2011-2015"]
["Texas","Fisher","48151950400","Low-Income Community","2011-2015"]
["Texas","Fort Bend","48157670200","Low-Income Community","2011-2015"]
["Texas","Fort Bend","48157670400","Low-Income Community","2011-2015"]
["Texas","Fort Bend","48157673700","Low-Income Community","2011-2015"]
["Texas","Fort Bend","48157674900","Low-Income Community","2011-2015"]
["Texas","Fort Bend","48157675400","Low-Income Community","2011-2015"]
["Texas","Franklin","48159950300","Low-Income Community","2011-2015"]
["Texas","Galveston","48167722200","Low-Income Community","2011-2015"]
["Texas","Galveston","48167722800","Low-Income Community","2011-2015"]
["Texas","Galveston","48167722900","Low-Income Community","2011-2015"]
["Texas","Galveston","48167723000","Low-Income Community","2011-2015"]
["Texas","Galveston","48167723700","Low-Income Community","2011-2015"]
["Texas","Galveston","48167724101","Low-Income Community","2011-2015"]
["Texas","Galveston","48167724800","Low-Income Community","2011-2015"]
["Texas","Galveston","48167726200","Low-Income Community","2011-2015"]
["Texas","Gonzales","48177000300","Low-Income Community","2011-2015"]
["Texas","Gonzales","48177000500","Low-Income Community","2011-2015"]
["Texas","Gray","48179950600","Low-Income Community","2011-2015"]
["Texas","Grayson","48181000200","Low-Income Community","2011-2015"]
["Texas","Grayson","48181000502","Low-Income Community","2011-2015"]
["Texas","Grayson","48181000902","Low-Income Community","2011-2015"]
["Texas","Grayson","48181002000","Low-Income Community","2011-2015"]
["Texas","Gregg","48183000800","Low-Income Community","2011-2015"]
["Texas","Gregg","48183001100","Low-Income Community","2011-2015"]
["Texas","Gregg","48183001400","Low-Income Community","2011-2015"]
["Texas","Gregg","48183010200","Low-Income Community","2011-2015"]
["Texas","Gregg","48183010500","Low-Income Community","2011-2015"]
["Texas","Gregg","48183010700","Low-Income Community","2011-2015"]
["Texas","Grimes","48185180101","Low-Income Community","2011-2015"]
["Texas","Grimes","48185180102","Low-Income Community","2011-2015"]
["Texas","Grimes","48185180200","Low-Income Community","2011-2015"]
["Texas","Hale","48189950100","Low-Income Community","2011-2015"]
["Texas","Hall","48191950500","Low-Income Community","2011-2015"]
["Texas","Hardin","48199030100","Low-Income Community","2011-2015"]
["Texas","Hardin","48199030700","Low-Income Community","2011-2015"]
["Texas","Hardin","48199030800","Low-Income Community","2011-2015"]
["Texas","Harris","48201100000","Low-Income Community","2011-2015"]
["Texas","Harris","48201210400","Low-Income Community","2011-2015"]
["Texas","Harris","48201210500","Low-Income Community","2011-2015"]
["Texas","Harris","48201210600","Low-Income Community","2011-2015"]
["Texas","Harris","48201210700","Low-Income Community","2011-2015"]
["Texas","Harris","48201210800","Low-Income Community","2011-2015"]
["Texas","Harris","48201211000","Low-Income Community","2011-2015"]
["Texas","Harris","48201211300","Low-Income Community","2011-2015"]
["Texas","Harris","48201211400","Low-Income Community","2011-2015"]
["Texas","Harris","48201211500","Low-Income Community","2011-2015"]
["Texas","Harris","48201211600","Low-Income Community","2011-2015"]
["Texas","Harris","48201212300","Low-Income Community","2011-2015"]
["Texas","Harris","48201220100","Low-Income Community","2011-2015"]
["Texas","Harris","48201220200","Low-Income Community","2011-2015"]
["Texas","Harris","48201220800","Low-Income Community","2011-2015"]
["Texas","Harris","48201222501","Low-Income Community","2011-2015"]
["Texas","Harris","48201222503","Low-Income Community","2011-2015"]
["Texas","Harris","48201222600","Low-Income Community","2011-2015"]
["Texas","Harris","48201222700","Low-Income Community","2011-2015"]
["Texas","Harris","48201230200","Low-Income Community","2011-2015"]
["Texas","Harris","48201230600","Low-Income Community","2011-2015"]
["Texas","Harris","48201230700","Low-Income Community","2011-2015"]
["Texas","Harris","48201231000","Low-Income Community","2011-2015"]
["Texas","Harris","48201231100","Low-Income Community","2011-2015"]
["Texas","Harris","48201231200","Low-Income Community","2011-2015"]
["Texas","Harris","48201231400","Low-Income Community","2011-2015"]
["Texas","Harris","48201231500","Low-Income Community","2011-2015"]
["Texas","Harris","48201233500","Low-Income Community","2011-2015"]
["Texas","Harris","48201240100","Low-Income Community","2011-2015"]
["Texas","Harris","48201240501","Low-Income Community","2011-2015"]
["Texas","Harris","48201240502","Low-Income Community","2011-2015"]
["Texas","Harris","48201240600","Low-Income Community","2011-2015"]
["Texas","Harris","48201253800","Low-Income Community","2011-2015"]
["Texas","Harris","48201254300","Low-Income Community","2011-2015"]
["Texas","Harris","48201254600","Low-Income Community","2011-2015"]
["Texas","Harris","48201310100","Low-Income Community","2011-2015"]
["Texas","Harris","48201310300","Low-Income Community","2011-2015"]
["Texas","Harris","48201310400","Low-Income Community","2011-2015"]
["Texas","Harris","48201310500","Low-Income Community","2011-2015"]
["Texas","Harris","48201310600","Low-Income Community","2011-2015"]
["Texas","Harris","48201310800","Low-Income Community","2011-2015"]
["Texas","Harris","48201310900","Low-Income Community","2011-2015"]
["Texas","Harris","48201311000","Low-Income Community","2011-2015"]
["Texas","Harris","48201311600","Low-Income Community","2011-2015"]
["Texas","Harris","48201311700","Low-Income Community","2011-2015"]
["Texas","Harris","48201312000","Low-Income Community","2011-2015"]
["Texas","Harris","48201312200","Low-Income Community","2011-2015"]
["Texas","Harris","48201312300","Low-Income Community","2011-2015"]
["Texas","Harris","48201312400","Low-Income Community","2011-2015"]
["Texas","Harris","48201312500","Low-Income Community","2011-2015"]
["Texas","Harris","48201312700","Low-Income Community","2011-2015"]
["Texas","Harris","48201312800","Low-Income Community","2011-2015"]
["Texas","Harris","48201312900","Low-Income Community","2011-2015"]
["Texas","Harris","48201313000","Low-Income Community","2011-2015"]
["Texas","Harris","48201313200","Low-Income Community","2011-2015"]
["Texas","Harris","48201313300","Low-Income Community","2011-2015"]
["Texas","Harris","48201313400","Low-Income Community","2011-2015"]
["Texas","Harris","48201313500","Low-Income Community","2011-2015"]
["Texas","Harris","48201313600","Low-Income Community","2011-2015"]
["Texas","Harris","48201313700","Low-Income Community","2011-2015"]
["Texas","Harris","48201313800","Low-Income Community","2011-2015"]
["Texas","Harris","48201314001","Low-Income Community","2011-2015"]
["Texas","Harris","48201314002","Low-Income Community","2011-2015"]
["Texas","Harris","48201314300","Low-Income Community","2011-2015"]
["Texas","Harris","48201314400","Low-Income Community","2011-2015"]
["Texas","Harris","48201321900","Low-Income Community","2011-2015"]
["Texas","Harris","48201322100","Low-Income Community","2011-2015"]
["Texas","Harris","48201322200","Low-Income Community","2011-2015"]
["Texas","Harris","48201323702","Low-Income Community","2011-2015"]
["Texas","Harris","48201324100","Low-Income Community","2011-2015"]
["Texas","Harris","48201331100","Low-Income Community","2011-2015"]
["Texas","Harris","48201331200","Low-Income Community","2011-2015"]
["Texas","Harris","48201331300","Low-Income Community","2011-2015"]
["Texas","Harris","48201331400","Low-Income Community","2011-2015"]
["Texas","Harris","48201331700","Low-Income Community","2011-2015"]
["Texas","Harris","48201331800","Low-Income Community","2011-2015"]
["Texas","Harris","48201332000","Low-Income Community","2011-2015"]
["Texas","Harris","48201342300","Low-Income Community","2011-2015"]
["Texas","Harris","48201421101","Low-Income Community","2011-2015"]
["Texas","Harris","48201421102","Low-Income Community","2011-2015"]
["Texas","Harris","48201421201","Low-Income Community","2011-2015"]
["Texas","Harris","48201421202","Low-Income Community","2011-2015"]
["Texas","Harris","48201421300","Low-Income Community","2011-2015"]
["Texas","Harris","48201421401","Low-Income Community","2011-2015"]
["Texas","Harris","48201421402","Low-Income Community","2011-2015"]
["Texas","Harris","48201421403","Low-Income Community","2011-2015"]
["Texas","Harris","48201421500","Low-Income Community","2011-2015"]
["Texas","Harris","48201421600","Low-Income Community","2011-2015"]
["Texas","Harris","48201422302","Low-Income Community","2011-2015"]
["Texas","Harris","48201422701","Low-Income Community","2011-2015"]
["Texas","Harris","48201433600","Low-Income Community","2011-2015"]
["Texas","Harris","48201452500","Low-Income Community","2011-2015"]
["Texas","Harris","48201453200","Low-Income Community","2011-2015"]
["Texas","Harris","48201453300","Low-Income Community","2011-2015"]
["Texas","Harris","48201453401","Low-Income Community","2011-2015"]
["Texas","Harris","48201530800","Low-Income Community","2011-2015"]
["Texas","Harris","48201531800","Low-Income Community","2011-2015"]
["Texas","Harris","48201531900","Low-Income Community","2011-2015"]
["Texas","Harris","48201532001","Low-Income Community","2011-2015"]
["Texas","Harris","48201532700","Low-Income Community","2011-2015"]
["Texas","Harris","48201532800","Low-Income Community","2011-2015"]
["Texas","Harris","48201533000","Low-Income Community","2011-2015"]
["Texas","Harris","48201533300","Low-Income Community","2011-2015"]
["Texas","Harris","48201533400","Low-Income Community","2011-2015"]
["Texas","Harris","48201533702","Low-Income Community","2011-2015"]
["Texas","Harrison","48203020102","Low-Income Community","2011-2015"]
["Texas","Harrison","48203020103","Low-Income Community","2011-2015"]
["Texas","Harrison","48203020302","Low-Income Community","2011-2015"]
["Texas","Harrison","48203020401","Low-Income Community","2011-2015"]
["Texas","Harrison","48203020402","Low-Income Community","2011-2015"]
["Texas","Haskell","48207950300","Low-Income Community","2011-2015"]
["Texas","Hays","48209010200","Low-Income Community","2011-2015"]
["Texas","Hays","48209010303","Low-Income Community","2011-2015"]
["Texas","Hays","48209010701","Low-Income Community","2011-2015"]
["Texas","Hays","48209010702","Low-Income Community","2011-2015"]
["Texas","Henderson","48213950602","Low-Income Community","2011-2015"]
["Texas","Henderson","48213950700","Low-Income Community","2011-2015"]
["Texas","Henderson","48213950901","Low-Income Community","2011-2015"]
["Texas","Henderson","48213950902","Low-Income Community","2011-2015"]
["Texas","Henderson","48213951000","Low-Income Community","2011-2015"]
["Texas","Henderson","48213951200","Low-Income Community","2011-2015"]
["Texas","Hidalgo","48215020102","Low-Income Community","2011-2015"]
["Texas","Hidalgo","48215020201","Low-Income Community","2011-2015"]
["Texas","Hidalgo","48215020503","Low-Income Community","2011-2015"]
["Texas","Hidalgo","48215021302","Low-Income Community","2011-2015"]
["Texas","Hidalgo","48215021303","Low-Income Community","2011-2015"]
["Texas","Hidalgo","48215021304","Low-Income Community","2011-2015"]
["Texas","Hidalgo","48215021305","Low-Income Community","2011-2015"]
["Texas","Hidalgo","48215021401","Low-Income Community","2011-2015"]
["Texas","Hidalgo","48215021701","Low-Income Community","2011-2015"]
["Texas","Hidalgo","48215021702","Low-Income Community","2011-2015"]
["Texas","Hidalgo","48215022103","Low-Income Community","2011-2015"]
["Texas","Hidalgo","48215022106","Low-Income Community","2011-2015"]
["Texas","Hidalgo","48215022401","Low-Income Community","2011-2015"]
["Texas","Hidalgo","48215022402","Low-Income Community","2011-2015"]
["Texas","Hidalgo","48215023103","Low-Income Community","2011-2015"]
["Texas","Hidalgo","48215023104","Low-Income Community","2011-2015"]
["Texas","Hidalgo","48215023503","Low-Income Community","2011-2015"]
["Texas","Hidalgo","48215024108","Low-Income Community","2011-2015"]
["Texas","Hidalgo","48215024114","Low-Income Community","2011-2015"]
["Texas","Hidalgo","48215024201","Low-Income Community","2011-2015"]
["Texas","Hidalgo","48215024203","Low-Income Community","2011-2015"]
["Texas","Hidalgo","48215024204","Low-Income Community","2011-2015"]
["Texas","Hidalgo","48215024205","Low-Income Community","2011-2015"]
["Texas","Hill","48217960100","Low-Income Community","2011-2015"]
["Texas","Hill","48217960900","Low-Income Community","2011-2015"]
["Texas","Hockley","48219950100","Low-Income Community","2011-2015"]
["Texas","Hockley","48219950400","Low-Income Community","2011-2015"]
["Texas","Hopkins","48223950600","Low-Income Community","2011-2015"]
["Texas","Hopkins","48223950700","Low-Income Community","2011-2015"]
["Texas","Hopkins","48223950800","Low-Income Community","2011-2015"]
["Texas","Howard","48227950500","Low-Income Community","2011-2015"]
["Texas","Hunt","48231960200","Low-Income Community","2011-2015"]
["Texas","Hunt","48231960500","Low-Income Community","2011-2015"]
["Texas","Hunt","48231960600","Low-Income Community","2011-2015"]
["Texas","Hunt","48231960700","Low-Income Community","2011-2015"]
["Texas","Hunt","48231960800","Low-Income Community","2011-2015"]
["Texas","Hunt","48231961300","Low-Income Community","2011-2015"]
["Texas","Hunt","48231961503","Low-Income Community","2011-2015"]
["Texas","Hunt","48231961600","Low-Income Community","2011-2015"]
["Texas","Jasper","48241950200","Low-Income Community","2011-2015"]
["Texas","Jasper","48241950300","Low-Income Community","2011-2015"]
["Texas","Jefferson","48245002500","Low-Income Community","2011-2015"]
["Texas","Jefferson","48245005400","Low-Income Community","2011-2015"]
["Texas","Jefferson","48245005900","Low-Income Community","2011-2015"]
["Texas","Jefferson","48245006100","Low-Income Community","2011-2015"]
["Texas","Jefferson","48245006300","Low-Income Community","2011-2015"]
["Texas","Jefferson","48245010100","Low-Income Community","2011-2015"]
["Texas","Jefferson","48245011700","Low-Income Community","2011-2015"]
["Texas","Jefferson","48245011800","Low-Income Community","2011-2015"]
["Texas","Jim Hogg","48247950200","Low-Income Community","2011-2015"]
["Texas","Jim Hogg","48247950400","Low-Income Community","2011-2015"]
["Texas","Johnson","48251130212","Low-Income Community","2011-2015"]
["Texas","Johnson","48251130302","Low-Income Community","2011-2015"]
["Texas","Jones","48253020400","Low-Income Community","2011-2015"]
["Texas","Karnes","48255970200","Low-Income Community","2011-2015"]
["Texas","Karnes","48255970300","Low-Income Community","2011-2015"]
["Texas","Kaufman","48257050300","Low-Income Community","2011-2015"]
["Texas","Kaufman","48257050400","Low-Income Community","2011-2015"]
["Texas","Kaufman","48257050500","Low-Income Community","2011-2015"]
["Texas","Kaufman","48257050704","Low-Income Community","2011-2015"]
["Texas","Kaufman","48257051201","Low-Income Community","2011-2015"]
["Texas","Kaufman","48257051300","Low-Income Community","2011-2015"]
["Texas","Kerr","48265960500","Low-Income Community","2011-2015"]
["Texas","Kerr","48265960800","Low-Income Community","2011-2015"]
["Texas","Kleberg","48273020200","Low-Income Community","2011-2015"]
["Texas","Kleberg","48273020300","Low-Income Community","2011-2015"]
["Texas","Lamar","48277000300","Low-Income Community","2011-2015"]
["Texas","Lamar","48277000500","Low-Income Community","2011-2015"]
["Texas","Lamar","48277000600","Low-Income Community","2011-2015"]
["Texas","Lamar","48277000700","Low-Income Community","2011-2015"]
["Texas","Lamar","48277000800","Low-Income Community","2011-2015"]
["Texas","Lamb","48279950500","Low-Income Community","2011-2015"]
["Texas","Lamb","48279950600","Low-Income Community","2011-2015"]
["Texas","La Salle","48283950300","Low-Income Community","2011-2015"]
["Texas","Lavaca","48285000600","Low-Income Community","2011-2015"]
["Texas","Lee","48287000400","Low-Income Community","2011-2015"]
["Texas","Liberty","48291700100","Low-Income Community","2011-2015"]
["Texas","Liberty","48291700200","Low-Income Community","2011-2015"]
["Texas","Liberty","48291700300","Low-Income Community","2011-2015"]
["Texas","Liberty","48291700400","Low-Income Community","2011-2015"]
["Texas","Liberty","48291700600","Low-Income Community","2011-2015"]
["Texas","Liberty","48291701200","Low-Income Community","2011-2015"]
["Texas","Liberty","48291701300","Low-Income Community","2011-2015"]
["Texas","Limestone","48293970400","Low-Income Community","2011-2015"]
["Texas","Limestone","48293970600","Low-Income Community","2011-2015"]
["Texas","Llano","48299970200","Low-Income Community","2011-2015"]
["Texas","Llano","48299970500","Low-Income Community","2011-2015"]
["Texas","Llano","48299970600","Low-Income Community","2011-2015"]
["Texas","Loving","48301950100","Low-Income Community","2011-2015"]
["Texas","Lubbock","48303000100","Low-Income Community","2011-2015"]
["Texas","Lubbock","48303000201","Low-Income Community","2011-2015"]
["Texas","Lubbock","48303000301","Low-Income Community","2011-2015"]
["Texas","Lubbock","48303000302","Low-Income Community","2011-2015"]
["Texas","Lubbock","48303000700","Low-Income Community","2011-2015"]
["Texas","Lubbock","48303000900","Low-Income Community","2011-2015"]
["Texas","Lubbock","48303001000","Low-Income Community","2011-2015"]
["Texas","Lubbock","48303010200","Low-Income Community","2011-2015"]
["Texas","McLennan","48309000100","Low-Income Community","2011-2015"]
["Texas","McLennan","48309001200","Low-Income Community","2011-2015"]
["Texas","McLennan","48309001500","Low-Income Community","2011-2015"]
["Texas","McLennan","48309003602","Low-Income Community","2011-2015"]
["Texas","McLennan","48309004201","Low-Income Community","2011-2015"]
["Texas","Madison","48313000100","Low-Income Community","2011-2015"]
["Texas","Marion","48315950300","Low-Income Community","2011-2015"]
["Texas","Matagorda","48321730201","Low-Income Community","2011-2015"]
["Texas","Matagorda","48321730501","Low-Income Community","2011-2015"]
["Texas","Matagorda","48321730600","Low-Income Community","2011-2015"]
["Texas","Matagorda","48321730700","Low-Income Community","2011-2015"]
["Texas","Maverick","48323950201","Low-Income Community","2011-2015"]
["Texas","Maverick","48323950601","Low-Income Community","2011-2015"]
["Texas","Medina","48325000402","Low-Income Community","2011-2015"]
["Texas","Medina","48325000500","Low-Income Community","2011-2015"]
["Texas","Milam","48331950402","Low-Income Community","2011-2015"]
["Texas","Milam","48331950700","Low-Income Community","2011-2015"]
["Texas","Montgomery","48339692200","Low-Income Community","2011-2015"]
["Texas","Montgomery","48339692500","Low-Income Community","2011-2015"]
["Texas","Montgomery","48339692601","Low-Income Community","2011-2015"]
["Texas","Montgomery","48339692602","Low-Income Community","2011-2015"]
["Texas","Montgomery","48339692700","Low-Income Community","2011-2015"]
["Texas","Montgomery","48339692802","Low-Income Community","2011-2015"]
["Texas","Montgomery","48339693000","Low-Income Community","2011-2015"]
["Texas","Montgomery","48339693400","Low-Income Community","2011-2015"]
["Texas","Montgomery","48339693500","Low-Income Community","2011-2015"]
["Texas","Montgomery","48339694000","Low-Income Community","2011-2015"]
["Texas","Montgomery","48339694101","Low-Income Community","2011-2015"]
["Texas","Morris","48343950100","Low-Income Community","2011-2015"]
["Texas","Morris","48343950200","Low-Income Community","2011-2015"]
["Texas","Morris","48343950300","Low-Income Community","2011-2015"]
["Texas","Motley","48345950100","Low-Income Community","2011-2015"]
["Texas","Nacogdoches","48347950301","Low-Income Community","2011-2015"]
["Texas","Nacogdoches","48347950302","Low-Income Community","2011-2015"]
["Texas","Nacogdoches","48347950700","Low-Income Community","2011-2015"]
["Texas","Nacogdoches","48347950800","Low-Income Community","2011-2015"]
["Texas","Nacogdoches","48347950900","Low-Income Community","2011-2015"]
["Texas","Nacogdoches","48347951000","Low-Income Community","2011-2015"]
["Texas","Navarro","48349970100","Low-Income Community","2011-2015"]
["Texas","Navarro","48349970200","Low-Income Community","2011-2015"]
["Texas","Navarro","48349970500","Low-Income Community","2011-2015"]
["Texas","Navarro","48349970600","Low-Income Community","2011-2015"]
["Texas","Navarro","48349970700","Low-Income Community","2011-2015"]
["Texas","Navarro","48349970800","Low-Income Community","2011-2015"]
["Texas","Navarro","48349970900","Low-Income Community","2011-2015"]
["Texas","Newton","48351950200","Low-Income Community","2011-2015"]
["Texas","Newton","48351950300","Low-Income Community","2011-2015"]
["Texas","Nueces","48355001000","Low-Income Community","2011-2015"]
["Texas","Nueces","48355001602","Low-Income Community","2011-2015"]
["Texas","Nueces","48355002001","Low-Income Community","2011-2015"]
["Texas","Nueces","48355002200","Low-Income Community","2011-2015"]
["Texas","Nueces","48355002704","Low-Income Community","2011-2015"]
["Texas","Nueces","48355002900","Low-Income Community","2011-2015"]
["Texas","Nueces","48355005602","Low-Income Community","2011-2015"]
["Texas","Nueces","48355006300","Low-Income Community","2011-2015"]
["Texas","Nueces","48355006400","Low-Income Community","2011-2015"]
["Texas","Orange","48361020200","Low-Income Community","2011-2015"]
["Texas","Orange","48361020300","Low-Income Community","2011-2015"]
["Texas","Orange","48361020500","Low-Income Community","2011-2015"]
["Texas","Orange","48361020700","Low-Income Community","2011-2015"]
["Texas","Orange","48361020900","Low-Income Community","2011-2015"]
["Texas","Palo Pinto","48363000500","Low-Income Community","2011-2015"]
["Texas","Palo Pinto","48363000600","Low-Income Community","2011-2015"]
["Texas","Palo Pinto","48363000800","Low-Income Community","2011-2015"]
["Texas","Polk","48373210101","Low-Income Community","2011-2015"]
["Texas","Polk","48373210102","Low-Income Community","2011-2015"]
["Texas","Polk","48373210203","Low-Income Community","2011-2015"]
["Texas","Polk","48373210204","Low-Income Community","2011-2015"]
["Texas","Polk","48373210301","Low-Income Community","2011-2015"]
["Texas","Polk","48373210400","Low-Income Community","2011-2015"]
["Texas","Potter","48375015400","Low-Income Community","2011-2015"]
["Texas","Presidio","48377950200","Low-Income Community","2011-2015"]
["Texas","Reeves","48389950100","Low-Income Community","2011-2015"]
["Texas","Robertson","48395960200","Low-Income Community","2011-2015"]
["Texas","Rusk","48401950501","Low-Income Community","2011-2015"]
["Texas","Rusk","48401950502","Low-Income Community","2011-2015"]
["Texas","Rusk","48401951000","Low-Income Community","2011-2015"]
["Texas","Sabine","48403950300","Low-Income Community","2011-2015"]
["Texas","San Augustine","48405950100","Low-Income Community","2011-2015"]
["Texas","San Augustine","48405950300","Low-Income Community","2011-2015"]
["Texas","San Jacinto","48407200101","Low-Income Community","2011-2015"]
["Texas","San Patricio","48409010800","Low-Income Community","2011-2015"]
["Texas","San Saba","48411950100","Low-Income Community","2011-2015"]
["Texas","Shelby","48419950100","Low-Income Community","2011-2015"]
["Texas","Shelby","48419950200","Low-Income Community","2011-2015"]
["Texas","Shelby","48419950300","Low-Income Community","2011-2015"]
["Texas","Shelby","48419950400","Low-Income Community","2011-2015"]
["Texas","Smith","48423000100","Low-Income Community","2011-2015"]
["Texas","Smith","48423000201","Low-Income Community","2011-2015"]
["Texas","Smith","48423000202","Low-Income Community","2011-2015"]
["Texas","Smith","48423000400","Low-Income Community","2011-2015"]
["Texas","Smith","48423000500","Low-Income Community","2011-2015"]
["Texas","Smith","48423000900","Low-Income Community","2011-2015"]
["Texas","Smith","48423001500","Low-Income Community","2011-2015"]
["Texas","Smith","48423001601","Low-Income Community","2011-2015"]
["Texas","Smith","48423001700","Low-Income Community","2011-2015"]
["Texas","Smith","48423001801","Low-Income Community","2011-2015"]
["Texas","Smith","48423001802","Low-Income Community","2011-2015"]
["Texas","Smith","48423002101","Low-Income Community","2011-2015"]
["Texas","Somervell","48425000200","Low-Income Community","2011-2015"]
["Texas","Starr","48427950104","Low-Income Community","2011-2015"]
["Texas","Starr","48427950105","Low-Income Community","2011-2015"]
["Texas","Starr","48427950106","Low-Income Community","2011-2015"]
["Texas","Starr","48427950107","Low-Income Community","2011-2015"]
["Texas","Starr","48427950202","Low-Income Community","2011-2015"]
["Texas","Starr","48427950204","Low-Income Community","2011-2015"]
["Texas","Starr","48427950401","Low-Income Community","2011-2015"]
["Texas","Starr","48427950402","Low-Income Community","2011-2015"]
["Texas","Stephens","48429950300","Low-Income Community","2011-2015"]
["Texas","Tarrant","48439100201","Low-Income Community","2011-2015"]
["Texas","Tarrant","48439100202","Low-Income Community","2011-2015"]
["Texas","Tarrant","48439100300","Low-Income Community","2011-2015"]
["Texas","Tarrant","48439103800","Low-Income Community","2011-2015"]
["Texas","Tarrant","48439106201","Low-Income Community","2011-2015"]
["Texas","Tarrant","48439122900","Low-Income Community","2011-2015"]
["Texas","Tarrant","48439123500","Low-Income Community","2011-2015"]
["Texas","Taylor","48441011700","Low-Income Community","2011-2015"]
["Texas","Taylor","48441013000","Low-Income Community","2011-2015"]
["Texas","Terry","48445950400","Low-Income Community","2011-2015"]
["Texas","Titus","48449950300","Low-Income Community","2011-2015"]
["Texas","Tom Green","48451001702","Low-Income Community","2011-2015"]
["Texas","Travis","48453001712","Low-Income Community","2011-2015"]
["Texas","Travis","48453001804","Low-Income Community","2011-2015"]
["Texas","Travis","48453001832","Low-Income Community","2011-2015"]
["Texas","Travis","48453001842","Low-Income Community","2011-2015"]
["Texas","Travis","48453002106","Low-Income Community","2011-2015"]
["Texas","Travis","48453002109","Low-Income Community","2011-2015"]
["Texas","Travis","48453002111","Low-Income Community","2011-2015"]
["Texas","Travis","48453002112","Low-Income Community","2011-2015"]
["Texas","Travis","48453002209","Low-Income Community","2011-2015"]
["Texas","Travis","48453002307","Low-Income Community","2011-2015"]
["Texas","Travis","48453002312","Low-Income Community","2011-2015"]
["Texas","Travis","48453002313","Low-Income Community","2011-2015"]
["Texas","Travis","48453002319","Low-Income Community","2011-2015"]
["Texas","Travis","48453002410","Low-Income Community","2011-2015"]
["Texas","Travis","48453002411","Low-Income Community","2011-2015"]
["Texas","Travis","48453002413","Low-Income Community","2011-2015"]
["Texas","Travis","48453002427","Low-Income Community","2011-2015"]
["Texas","Travis","48453002432","Low-Income Community","2011-2015"]
["Texas","Travis","48453002433","Low-Income Community","2011-2015"]
["Texas","Travis","48453002435","Low-Income Community","2011-2015"]
["Texas","Travis","48453002436","Low-Income Community","2011-2015"]
["Texas","Trinity","48455950200","Low-Income Community","2011-2015"]
["Texas","Trinity","48455950400","Low-Income Community","2011-2015"]
["Texas","Trinity","48455950500","Low-Income Community","2011-2015"]
["Texas","Tyler","48457950200","Low-Income Community","2011-2015"]
["Texas","Tyler","48457950300","Low-Income Community","2011-2015"]
["Texas","Val Verde","48465950400","Low-Income Community","2011-2015"]
["Texas","Van Zandt","48467950500","Low-Income Community","2011-2015"]
["Texas","Victoria","48469000100","Low-Income Community","2011-2015"]
["Texas","Victoria","48469000201","Low-Income Community","2011-2015"]
["Texas","Victoria","48469000202","Low-Income Community","2011-2015"]
["Texas","Victoria","48469000301","Low-Income Community","2011-2015"]
["Texas","Victoria","48469000302","Low-Income Community","2011-2015"]
["Texas","Victoria","48469000700","Low-Income Community","2011-2015"]
["Texas","Victoria","48469001601","Low-Income Community","2011-2015"]
["Texas","Walker","48471790102","Low-Income Community","2011-2015"]
["Texas","Walker","48471790400","Low-Income Community","2011-2015"]
["Texas","Walker","48471790500","Low-Income Community","2011-2015"]
["Texas","Walker","48471790600","Low-Income Community","2011-2015"]
["Texas","Waller","48473680200","Low-Income Community","2011-2015"]
["Texas","Waller","48473680500","Low-Income Community","2011-2015"]
["Texas","Washington","48477170100","Low-Income Community","2011-2015"]
["Texas","Webb","48479000105","Low-Income Community","2011-2015"]
["Texas","Webb","48479000106","Low-Income Community","2011-2015"]
["Texas","Webb","48479001816","Low-Income Community","2011-2015"]
["Texas","Webb","48479001818","Low-Income Community","2011-2015"]
["Texas","Wharton","48481740200","Low-Income Community","2011-2015"]
["Texas","Wharton","48481740300","Low-Income Community","2011-2015"]
["Texas","Wharton","48481740500","Low-Income Community","2011-2015"]
["Texas","Wharton","48481740700","Low-Income Community","2011-2015"]
["Texas","Wharton","48481740800","Low-Income Community","2011-2015"]
["Texas","Wharton","48481741000","Low-Income Community","2011-2015"]
["Texas","Wichita","48485011200","Low-Income Community","2011-2015"]
["Texas","Wichita","48485011300","Low-Income Community","2011-2015"]
["Texas","Wichita","48485011500","Low-Income Community","2011-2015"]
["Texas","Wilbarger","48487950500","Low-Income Community","2011-2015"]
["Texas","Wilbarger","48487950700","Low-Income Community","2011-2015"]
["Texas","Willacy","48489950300","Low-Income Community","2011-2015"]
["Texas","Willacy","48489950400","Low-Income Community","2011-2015"]
["Texas","Willacy","48489950500","Low-Income Community","2011-2015"]
["Texas","Willacy","48489950600","Low-Income Community","2011-2015"]
["Texas","Willacy","48489950700","Low-Income Community","2011-2015"]
["Texas","Williamson","48491020201","Low-Income Community","2011-2015"]
["Texas","Williamson","48491020808","Low-Income Community","2011-2015"]
["Texas","Williamson","48491021300","Low-Income Community","2011-2015"]
["Texas","Williamson","48491021602","Low-Income Community","2011-2015"]
["Texas","Wilson","48493000201","Low-Income Community","2011-2015"]
["Texas","Wise","48497150200","Low-Income Community","2011-2015"]
["Texas","Wood","48499950200","Low-Income Community","2011-2015"]
["Texas","Wood","48499950400","Low-Income Community","2011-2015"]
["Texas","Wood","48499950601","Low-Income Community","2011-2015"]
["Texas","Wood","48499950700","Low-Income Community","2011-2015"]
["Texas","Zapata","48505950400","Low-Income Community","2011-2015"]
["Texas","Zavala","48507950100","Low-Income Community","2011-2015"]
["Texas","Zavala","48507950200","Low-Income Community","2011-2015"]
["Texas","Zavala","48507950302","Low-Income Community","2011-2015"]
["Utah","Beaver","49001100100","Low-Income Community","2011-2015"]
["Utah","Box Elder","49003960300","Low-Income Community","2011-2015"]
["Utah","Box Elder","49003960601","Low-Income Community","2011-2015"]
["Utah","Cache","49005000900","Low-Income Community","2011-2015"]
["Utah","Cache","49005001002","Low-Income Community","2011-2015"]
["Utah","Carbon","49007000600","Low-Income Community","2011-2015"]
["Utah","Davis","49011125701","Low-Income Community","2011-2015"]
["Utah","Davis","49011125702","Low-Income Community","2011-2015"]
["Utah","Davis","49011126001","Low-Income Community","2011-2015"]
["Utah","Duchesne","49013940300","Low-Income Community","2011-2015"]
["Utah","Garfield","49017000300","Low-Income Community","2011-2015"]
["Utah","Grand","49019000300","Low-Income Community","2011-2015"]
["Utah","Iron","49021110300","Low-Income Community","2011-2015"]
["Utah","Iron","49021110600","Low-Income Community","2011-2015"]
["Utah","Millard","49027974300","Low-Income Community","2011-2015"]
["Utah","Salt Lake","49035100600","Low-Income Community","2011-2015"]
["Utah","Salt Lake","49035102500","Low-Income Community","2011-2015"]
["Utah","Salt Lake","49035102600","Low-Income Community","2011-2015"]
["Utah","Salt Lake","49035102702","Low-Income Community","2011-2015"]
["Utah","Salt Lake","49035111500","Low-Income Community","2011-2015"]
["Utah","Salt Lake","49035111600","Low-Income Community","2011-2015"]
["Utah","Salt Lake","49035111802","Low-Income Community","2011-2015"]
["Utah","Salt Lake","49035112403","Low-Income Community","2011-2015"]
["Utah","Salt Lake","49035112907","Low-Income Community","2011-2015"]
["Utah","Salt Lake","49035113305","Low-Income Community","2011-2015"]
["Utah","Salt Lake","49035113513","Low-Income Community","2011-2015"]
["Utah","Salt Lake","49035113802","Low-Income Community","2011-2015"]
["Utah","Salt Lake","49035113906","Low-Income Community","2011-2015"]
["Utah","Salt Lake","49035114000","Low-Income Community","2011-2015"]
["Utah","Salt Lake","49035114500","Low-Income Community","2011-2015"]
["Utah","San Juan","49037942100","Low-Income Community","2011-2015"]
["Utah","Sanpete","49039972400","Low-Income Community","2011-2015"]
["Utah","Sevier","49041975300","Low-Income Community","2011-2015"]
["Utah","Tooele","49045130900","Low-Income Community","2011-2015"]
["Utah","Utah","49049000400","Low-Income Community","2011-2015"]
["Utah","Utah","49049002400","Low-Income Community","2011-2015"]
["Utah","Utah","49049002500","Low-Income Community","2011-2015"]
["Utah","Utah","49049002801","Low-Income Community","2011-2015"]
["Utah","Utah","49049002802","Low-Income Community","2011-2015"]
["Utah","Washington","49053270300","Low-Income Community","2011-2015"]
["Utah","Washington","49053271300","Low-Income Community","2011-2015"]
["Utah","Weber","49057200400","Low-Income Community","2011-2015"]
["Utah","Weber","49057200800","Low-Income Community","2011-2015"]
["Utah","Weber","49057200900","Low-Income Community","2011-2015"]
["Utah","Weber","49057201100","Low-Income Community","2011-2015"]
["Utah","Weber","49057210800","Low-Income Community","2011-2015"]
["Vermont","Addison","50001960300","Low-Income Community","2011-2015"]
["Vermont","Bennington","50003970900","Low-Income Community","2011-2015"]
["Vermont","Bennington","50003971200","Low-Income Community","2011-2015"]
["Vermont","Caledonia","50005957200","Low-Income Community","2011-2015"]
["Vermont","Caledonia","50005957400","Low-Income Community","2012-2016"]
["Vermont","Caledonia","50005957500","Low-Income Community","2011-2015"]
["Vermont","Chittenden","50007000500","Low-Income Community","2011-2015"]
["Vermont","Chittenden","50007001000","Low-Income Community","2011-2015"]
["Vermont","Chittenden","50007002400","Low-Income Community","2011-2015"]
["Vermont","Chittenden","50007002500","Low-Income Community","2011-2015"]
["Vermont","Chittenden","50007003600","Low-Income Community","2011-2015"]
["Vermont","Franklin","50011010700","Low-Income Community","2011-2015"]
["Vermont","Lamoille","50015953200","Low-Income Community","2011-2015"]
["Vermont","Orange","50017959400","Non-LIC Contiguous","2011-2015"]
["Vermont","Orleans","50019951400","Low-Income Community","2011-2015"]
["Vermont","Orleans","50019951500","Low-Income Community","2011-2015"]
["Vermont","Rutland","50021963100","Low-Income Community","2011-2015"]
["Vermont","Rutland","50021963200","Low-Income Community","2011-2015"]
["Vermont","Rutland","50021963300","Low-Income Community","2011-2015"]
["Vermont","Washington","50023955200","Low-Income Community","2011-2015"]
["Vermont","Windham","50025967000","Low-Income Community","2011-2015"]
["Vermont","Windham","50025968500","Low-Income Community","2011-2015"]
["Vermont","Windsor","50027965100","Low-Income Community","2011-2015"]
["Vermont","Windsor","50027966600","Low-Income Community","2011-2015"]
["Vermont","Windsor","50027966700","Non-LIC Contiguous","2011-2015"]
["Virgin Islands","St. Croix ","78010970200","Low-Income Community","2011-2015"]
["Virgin Islands","St. Croix ","78010970300","Low-Income Community","2011-2015"]
["Virgin Islands","St. Croix ","78010970800","Low-Income Community","2011-2015"]
["Virgin Islands","St. Croix ","78010970900","Low-Income Community","2011-2015"]
["Virgin Islands","St. Croix ","78010971000","Low-Income Community","2011-2015"]
["Virgin Islands","St. Croix ","78010971100","Low-Income Community","2011-2015"]
["Virgin Islands","St. Croix ","78010971200","Low-Income Community","2011-2015"]
["Virgin Islands","St. Croix ","78010971300","Low-Income Community","2011-2015"]
["Virgin Islands","St. Croix ","78010971400","Low-Income Community","2011-2015"]
["Virgin Islands","St. Thomas ","78030960800","Non-LIC Contiguous","2011-2015"]
["Virgin Islands","St. Thomas ","78030960900","Low-Income Community","2011-2015"]
["Virgin Islands","St. Thomas ","78030961000","Low-Income Community","2011-2015"]
["Virgin Islands","St. Thomas ","78030961100","Low-Income Community","2011-2015"]
["Virgin Islands","St. Thomas ","78030961200","Low-Income Community","2011-2015"]
["Virginia","Accomack","51001090100","Low-Income Community","2012-2016"]
["Virginia","Accomack","51001090200","Low-Income Community","2011-2015"]
["Virginia","Albemarle","51003010700","Low-Income Community","2011-2015"]
["Virginia","Albemarle","51003011302","Low-Income Community","2011-2015"]
["Virginia","Alleghany","51005080202","Low-Income Community","2011-2015"]
["Virginia","Amherst","51009010502","Low-Income Community","2011-2015"]
["Virginia","Appomattox","51011040100","Low-Income Community","2011-2015"]
["Virginia","Arlington","51013102701","Low-Income Community","2011-2015"]
["Virginia","Arlington","51013103100","Low-Income Community","2011-2015"]
["Virginia","Augusta","51015071200","Low-Income Community","2011-2015"]
["Virginia","Bedford","51019030605","Low-Income Community","2011-2015"]
["Virginia","Bedford","51019050100","Low-Income Community","2011-2015"]
["Virginia","Brunswick","51025930203","Low-Income Community","2011-2015"]
["Virginia","Buchanan","51027010300","Low-Income Community","2011-2015"]
["Virginia","Campbell","51031020500","Low-Income Community","2011-2015"]
["Virginia","Campbell","51031020900","Low-Income Community","2011-2015"]
["Virginia","Caroline","51033030100","Low-Income Community","2012-2016"]
["Virginia","Carroll","51035080200","Low-Income Community","2011-2015"]
["Virginia","Charlotte","51037930100","Low-Income Community","2011-2015"]
["Virginia","Chesterfield","51041100107","Low-Income Community","2011-2015"]
["Virginia","Chesterfield","51041100210","Low-Income Community","2011-2015"]
["Virginia","Chesterfield","51041100407","Low-Income Community","2011-2015"]
["Virginia","Chesterfield","51041100600","Low-Income Community","2011-2015"]
["Virginia","Culpeper","51047930400","Low-Income Community","2011-2015"]
["Virginia","Cumberland","51049930200","Low-Income Community","2011-2015"]
["Virginia","Dickenson","51051040300","Low-Income Community","2011-2015"]
["Virginia","Dinwiddie","51053840500","Low-Income Community","2011-2015"]
["Virginia","Essex","51057950700","Low-Income Community","2011-2015"]
["Virginia","Fairfax","51059415401","Low-Income Community","2011-2015"]
["Virginia","Fairfax","51059421500","Low-Income Community","2011-2015"]
["Virginia","Fairfax","51059421600","Low-Income Community","2011-2015"]
["Virginia","Fairfax","51059421800","Low-Income Community","2011-2015"]
["Virginia","Fairfax","51059451400","Low-Income Community","2011-2015"]
["Virginia","Fairfax","51059451502","Low-Income Community","2011-2015"]
["Virginia","Fairfax","51059452801","Low-Income Community","2011-2015"]
["Virginia","Fairfax","51059481000","Low-Income Community","2011-2015"]
["Virginia","Fairfax","51059482100","Low-Income Community","2011-2015"]
["Virginia","Fauquier","51061930706","Low-Income Community","2011-2015"]
["Virginia","Franklin","51067020500","Low-Income Community","2011-2015"]
["Virginia","Frederick","51069051102","Low-Income Community","2011-2015"]
["Virginia","Giles","51071930100","Low-Income Community","2011-2015"]
["Virginia","Gloucester","51073100301","Low-Income Community","2012-2016"]
["Virginia","Grayson","51077060201","Low-Income Community","2011-2015"]
["Virginia","Greensville","51081880101","Low-Income Community","2011-2015"]
["Virginia","Halifax","51083930301","Low-Income Community","2011-2015"]
["Virginia","Halifax","51083930600","Low-Income Community","2011-2015"]
["Virginia","Halifax","51083930800","Low-Income Community","2011-2015"]
["Virginia","Henrico","51087200105","Low-Income Community","2011-2015"]
["Virginia","Henrico","51087200106","Non-LIC Contiguous","2011-2015"]
["Virginia","Henrico","51087200303","Low-Income Community","2011-2015"]
["Virginia","Henrico","51087200501","Low-Income Community","2011-2015"]
["Virginia","Henrico","51087200805","Low-Income Community","2011-2015"]
["Virginia","Henrico","51087201501","Low-Income Community","2011-2015"]
["Virginia","Henrico","51087201502","Non-LIC Contiguous","2011-2015"]
["Virginia","Henry","51089010100","Low-Income Community","2011-2015"]
["Virginia","Henry","51089010300","Low-Income Community","2011-2015"]
["Virginia","Henry","51089010602","Low-Income Community","2011-2015"]
["Virginia","Henry","51089010700","Low-Income Community","2011-2015"]
["Virginia","Henry","51089010800","Low-Income Community","2011-2015"]
["Virginia","James City","51095080102","Low-Income Community","2011-2015"]
["Virginia","King and Queen","51097950500","Low-Income Community","2011-2015"]
["Virginia","Lancaster","51103030200","Low-Income Community","2012-2016"]
["Virginia","Lee","51105950500","Low-Income Community","2011-2015"]
["Virginia","Loudoun","51107611501","Low-Income Community","2011-2015"]
["Virginia","Loudoun","51107611700","Low-Income Community","2011-2015"]
["Virginia","Mecklenburg","51117930101","Low-Income Community","2011-2015"]
["Virginia","Mecklenburg","51117930200","Low-Income Community","2011-2015"]
["Virginia","Montgomery","51121020700","Low-Income Community","2011-2015"]
["Virginia","Montgomery","51121020900","Low-Income Community","2011-2015"]
["Virginia","Northampton","51131930300","Low-Income Community","2011-2015"]
["Virginia","Orange","51137110200","Low-Income Community","2011-2015"]
["Virginia","Page","51139030100","Low-Income Community","2011-2015"]
["Virginia","Pittsylvania","51143010200","Low-Income Community","2011-2015"]
["Virginia","Pittsylvania","51143011100","Low-Income Community","2011-2015"]
["Virginia","Pittsylvania","51143011400","Low-Income Community","2011-2015"]
["Virginia","Prince Edward","51147930201","Low-Income Community","2011-2015"]
["Virginia","Prince George","51149850200","Low-Income Community","2011-2015"]
["Virginia","Prince William","51153900201","Low-Income Community","2011-2015"]
["Virginia","Prince William","51153900203","Low-Income Community","2011-2015"]
["Virginia","Prince William","51153900300","Low-Income Community","2011-2015"]
["Virginia","Prince William","51153900600","Low-Income Community","2011-2015"]
["Virginia","Prince William","51153901008","Low-Income Community","2012-2016"]
["Virginia","Prince William","51153901900","Low-Income Community","2011-2015"]
["Virginia","Pulaski","51155210300","Low-Income Community","2011-2015"]
["Virginia","Richmond","51159040100","Low-Income Community","2011-2015"]
["Virginia","Roanoke","51161030201","Non-LIC Contiguous","2011-2015"]
["Virginia","Rockingham","51165010500","Low-Income Community","2011-2015"]
["Virginia","Rockingham","51165011700","Low-Income Community","2011-2015"]
["Virginia","Russell","51167030401","Low-Income Community","2011-2015"]
["Virginia","Scott","51169030600","Low-Income Community","2011-2015"]
["Virginia","Shenandoah","51171040700","Low-Income Community","2011-2015"]
["Virginia","Smyth","51173030301","Low-Income Community","2011-2015"]
["Virginia","Smyth","51173030701","Low-Income Community","2011-2015"]
["Virginia","Spotsylvania","51177020202","Low-Income Community","2011-2015"]
["Virginia","Spotsylvania","51177020304","Low-Income Community","2011-2015"]
["Virginia","Spotsylvania","51177020305","Low-Income Community","2011-2015"]
["Virginia","Sussex","51183870300","Low-Income Community","2011-2015"]
["Virginia","Tazewell","51185020200","Low-Income Community","2011-2015"]
["Virginia","Tazewell","51185020600","Low-Income Community","2011-2015"]
["Virginia","Warren","51187020601","Low-Income Community","2011-2015"]
["Virginia","Washington","51191010100","Low-Income Community","2011-2015"]
["Virginia","Wise","51195930900","Low-Income Community","2011-2015"]
["Virginia","Wise","51195931300","Low-Income Community","2011-2015"]
["Virginia","Wise","51195931400","Non-LIC Contiguous","2011-2015"]
["Virginia","Wise","51195931700","Low-Income Community","2011-2015"]
["Virginia","Wythe","51197050100","Low-Income Community","2011-2015"]
["Virginia","Alexandria","51510200102","Low-Income Community","2011-2015"]
["Virginia","Alexandria","51510200104","Low-Income Community","2011-2015"]
["Virginia","Alexandria","51510200303","Low-Income Community","2011-2015"]
["Virginia","Alexandria","51510201203","Low-Income Community","2011-2015"]
["Virginia","Bristol","51520020100","Low-Income Community","2011-2015"]
["Virginia","Bristol","51520020400","Low-Income Community","2011-2015"]
["Virginia","Buena Vista","51530930600","Low-Income Community","2011-2015"]
["Virginia","Charlottesville","51540000401","Low-Income Community","2011-2015"]
["Virginia","Charlottesville","51540000501","Low-Income Community","2011-2015"]
["Virginia","Chesapeake","51550020300","Low-Income Community","2011-2015"]
["Virginia","Chesapeake","51550020500","Low-Income Community","2011-2015"]
["Virginia","Chesapeake","51550021403","Low-Income Community","2011-2015"]
["Virginia","Covington","51580060200","Low-Income Community","2011-2015"]
["Virginia","Danville","51590000300","Low-Income Community","2011-2015"]
["Virginia","Danville","51590000400","Low-Income Community","2011-2015"]
["Virginia","Danville","51590000500","Low-Income Community","2011-2015"]
["Virginia","Danville","51590000600","Low-Income Community","2011-2015"]
["Virginia","Emporia","51595890100","Low-Income Community","2011-2015"]
["Virginia","Franklin","51620090200","Low-Income Community","2011-2015"]
["Virginia","Fredericksburg","51630000200","Low-Income Community","2011-2015"]
["Virginia","Fredericksburg","51630000500","Low-Income Community","2011-2015"]
["Virginia","Galax","51640070101","Low-Income Community","2011-2015"]
["Virginia","Galax","51640070102","Low-Income Community","2011-2015"]
["Virginia","Hampton","51650010313","Low-Income Community","2011-2015"]
["Virginia","Hampton","51650010314","Low-Income Community","2011-2015"]
["Virginia","Hampton","51650010502","Low-Income Community","2011-2015"]
["Virginia","Hampton","51650010601","Low-Income Community","2011-2015"]
["Virginia","Harrisonburg","51660000101","Low-Income Community","2011-2015"]
["Virginia","Harrisonburg","51660000302","Low-Income Community","2011-2015"]
["Virginia","Hopewell","51670820300","Low-Income Community","2011-2015"]
["Virginia","Hopewell","51670820600","Low-Income Community","2011-2015"]
["Virginia","Lexington","51678930500","Low-Income Community","2011-2015"]
["Virginia","Lynchburg","51680000500","Low-Income Community","2011-2015"]
["Virginia","Lynchburg","51680000600","Low-Income Community","2011-2015"]
["Virginia","Lynchburg","51680001400","Low-Income Community","2011-2015"]
["Virginia","Lynchburg","51680001600","Low-Income Community","2011-2015"]
["Virginia","Manassas","51683910201","Low-Income Community","2011-2015"]
["Virginia","Martinsville","51690000100","Low-Income Community","2011-2015"]
["Virginia","Martinsville","51690000200","Low-Income Community","2011-2015"]
["Virginia","Newport News","51700030100","Low-Income Community","2011-2015"]
["Virginia","Newport News","51700030400","Low-Income Community","2011-2015"]
["Virginia","Newport News","51700030800","Low-Income Community","2011-2015"]
["Virginia","Newport News","51700032113","Low-Income Community","2011-2015"]
["Virginia","Newport News","51700032128","Low-Income Community","2011-2015"]
["Virginia","Newport News","51700032225","Low-Income Community","2011-2015"]
["Virginia","Newport News","51700032400","Low-Income Community","2011-2015"]
["Virginia","Norfolk","51710001100","Low-Income Community","2011-2015"]
["Virginia","Norfolk","51710002500","Low-Income Community","2011-2015"]
["Virginia","Norfolk","51710002600","Low-Income Community","2011-2015"]
["Virginia","Norfolk","51710002700","Low-Income Community","2011-2015"]
["Virginia","Norfolk","51710002900","Low-Income Community","2011-2015"]
["Virginia","Norfolk","51710003501","Low-Income Community","2011-2015"]
["Virginia","Norfolk","51710004100","Low-Income Community","2011-2015"]
["Virginia","Norfolk","51710004200","Low-Income Community","2011-2015"]
["Virginia","Norfolk","51710004700","Low-Income Community","2011-2015"]
["Virginia","Norfolk","51710004800","Low-Income Community","2011-2015"]
["Virginia","Norfolk","51710005000","Low-Income Community","2011-2015"]
["Virginia","Norfolk","51710005701","Low-Income Community","2011-2015"]
["Virginia","Norfolk","51710006502","Low-Income Community","2011-2015"]
["Virginia","Norfolk","51710006800","Low-Income Community","2011-2015"]
["Virginia","Norfolk","51710006901","Low-Income Community","2011-2015"]
["Virginia","Norfolk","51710007001","Low-Income Community","2011-2015"]
["Virginia","Norton","51720960100","Low-Income Community","2011-2015"]
["Virginia","Petersburg","51730810100","Low-Income Community","2011-2015"]
["Virginia","Petersburg","51730811200","Low-Income Community","2011-2015"]
["Virginia","Petersburg","51730811300","Low-Income Community","2011-2015"]
["Virginia","Portsmouth","51740210200","Low-Income Community","2011-2015"]
["Virginia","Portsmouth","51740210500","Low-Income Community","2011-2015"]
["Virginia","Portsmouth","51740211400","Low-Income Community","2011-2015"]
["Virginia","Portsmouth","51740211700","Low-Income Community","2011-2015"]
["Virginia","Portsmouth","51740211800","Low-Income Community","2011-2015"]
["Virginia","Portsmouth","51740211900","Low-Income Community","2011-2015"]
["Virginia","Portsmouth","51740212000","Low-Income Community","2011-2015"]
["Virginia","Portsmouth","51740212100","Low-Income Community","2011-2015"]
["Virginia","Radford","51750010102","Low-Income Community","2011-2015"]
["Virginia","Radford","51750010200","Low-Income Community","2011-2015"]
["Virginia","Richmond","51760020200","Low-Income Community","2011-2015"]
["Virginia","Richmond","51760020300","Low-Income Community","2011-2015"]
["Virginia","Richmond","51760020500","Low-Income Community","2011-2015"]
["Virginia","Richmond","51760021100","Low-Income Community","2011-2015"]
["Virginia","Richmond","51760030200","Low-Income Community","2011-2015"]
["Virginia","Richmond","51760040200","Low-Income Community","2011-2015"]
["Virginia","Richmond","51760060200","Low-Income Community","2011-2015"]
["Virginia","Richmond","51760060700","Low-Income Community","2011-2015"]
["Virginia","Richmond","51760060800","Low-Income Community","2011-2015"]
["Virginia","Richmond","51760060900","Low-Income Community","2011-2015"]
["Virginia","Richmond","51760061000","Low-Income Community","2011-2015"]
["Virginia","Roanoke","51770000601","Low-Income Community","2011-2015"]
["Virginia","Roanoke","51770000602","Low-Income Community","2011-2015"]
["Virginia","Roanoke","51770001100","Non-LIC Contiguous","2011-2015"]
["Virginia","Roanoke","51770001200","Low-Income Community","2011-2015"]
["Virginia","Salem","51775010100","Low-Income Community","2011-2015"]
["Virginia","Staunton","51790000200","Low-Income Community","2011-2015"]
["Virginia","Staunton","51790000300","Low-Income Community","2012-2016"]
["Virginia","Suffolk","51800065400","Low-Income Community","2011-2015"]
["Virginia","Virginia Beach","51810040200","Low-Income Community","2011-2015"]
["Virginia","Virginia Beach","51810041002","Low-Income Community","2011-2015"]
["Virginia","Virginia Beach","51810044200","Low-Income Community","2011-2015"]
["Virginia","Virginia Beach","51810044805","Low-Income Community","2011-2015"]
["Virginia","Virginia Beach","51810044806","Low-Income Community","2011-2015"]
["Virginia","Virginia Beach","51810045407","Low-Income Community","2011-2015"]
["Virginia","Virginia Beach","51810045408","Low-Income Community","2011-2015"]
["Virginia","Virginia Beach","51810045604","Low-Income Community","2011-2015"]
["Virginia","Waynesboro","51820003200","Low-Income Community","2011-2015"]
["Virginia","Williamsburg","51830370200","Low-Income Community","2011-2015"]
["Virginia","Winchester","51840000100","Low-Income Community","2011-2015"]
["Washington","Adams","53001950200","Low-Income Community","2011-2015"]
["Washington","Asotin","53003960300","Low-Income Community","2011-2015"]
["Washington","Benton","53005010901","Low-Income Community","2011-2015"]
["Washington","Benton","53005011300","Low-Income Community","2011-2015"]
["Washington","Chelan","53007961000","Low-Income Community","2011-2015"]
["Washington","Chelan","53007961100","Low-Income Community","2011-2015"]
["Washington","Chelan","53007961200","Non-LIC Contiguous","2011-2015"]
["Washington","Clallam","53009000200","Low-Income Community","2011-2015"]
["Washington","Clallam","53009000300","Low-Income Community","2011-2015"]
["Washington","Clallam","53009000400","Low-Income Community","2011-2015"]
["Washington","Clallam","53009000700","Low-Income Community","2011-2015"]
["Washington","Clallam","53009000800","Low-Income Community","2011-2015"]
["Washington","Clallam","53009000900","Low-Income Community","2011-2015"]
["Washington","Clallam","53009001500","Non-LIC Contiguous","2011-2015"]
["Washington","Clallam","53009002100","Low-Income Community","2011-2015"]
["Washington","Clallam","53009002300","Non-LIC Contiguous","2011-2015"]
["Washington","Clallam","53009940000","Low-Income Community","2011-2015"]
["Washington","Clark","53011040507","Low-Income Community","2011-2015"]
["Washington","Clark","53011040509","Low-Income Community","2011-2015"]
["Washington","Clark","53011041009","Low-Income Community","2011-2015"]
["Washington","Clark","53011041600","Low-Income Community","2011-2015"]
["Washington","Clark","53011042400","Low-Income Community","2011-2015"]
["Washington","Clark","53011042500","Non-LIC Contiguous","2011-2015"]
["Washington","Clark","53011042600","Low-Income Community","2011-2015"]
["Washington","Columbia","53013960200","Low-Income Community","2011-2015"]
["Washington","Cowlitz","53015000300","Low-Income Community","2011-2015"]
["Washington","Cowlitz","53015001100","Low-Income Community","2011-2015"]
["Washington","Douglas","53017950300","Low-Income Community","2011-2015"]
["Washington","Ferry","53019940000","Low-Income Community","2011-2015"]
["Washington","Ferry","53019970100","Low-Income Community","2011-2015"]
["Washington","Ferry","53019970200","Low-Income Community","2011-2015"]
["Washington","Franklin","53021020100","Low-Income Community","2011-2015"]
["Washington","Garfield","53023970300","Low-Income Community","2011-2015"]
["Washington","Grant","53025010800","Low-Income Community","2011-2015"]
["Washington","Grays Harbor","53027000200","Low-Income Community","2011-2015"]
["Washington","Grays Harbor","53027001000","Low-Income Community","2011-2015"]
["Washington","Grays Harbor","53027001500","Low-Income Community","2011-2015"]
["Washington","Island","53029970700","Low-Income Community","2011-2015"]
["Washington","Jefferson","53031950202","Low-Income Community","2011-2015"]
["Washington","Jefferson","53031950400","Low-Income Community","2011-2015"]
["Washington","Jefferson","53031950601","Non-LIC Contiguous","2011-2015"]
["Washington","Jefferson","53031950702","Low-Income Community","2011-2015"]
["Washington","King","53033008600","Low-Income Community","2011-2015"]
["Washington","King","53033008700","Low-Income Community","2011-2015"]
["Washington","King","53033009000","Low-Income Community","2011-2015"]
["Washington","King","53033009100","Low-Income Community","2011-2015"]
["Washington","King","53033009200","Low-Income Community","2011-2015"]
["Washington","King","53033009300","Low-Income Community","2011-2015"]
["Washington","King","53033009400","Low-Income Community","2011-2015"]
["Washington","King","53033011001","Low-Income Community","2011-2015"]
["Washington","King","53033011101","Low-Income Community","2011-2015"]
["Washington","King","53033011800","Low-Income Community","2011-2015"]
["Washington","King","53033026100","Low-Income Community","2011-2015"]
["Washington","King","53033026801","Low-Income Community","2011-2015"]
["Washington","King","53033026802","Low-Income Community","2011-2015"]
["Washington","King","53033027200","Low-Income Community","2011-2015"]
["Washington","King","53033027300","Low-Income Community","2011-2015"]
["Washington","King","53033027900","Low-Income Community","2011-2015"]
["Washington","King","53033028000","Low-Income Community","2011-2015"]
["Washington","King","53033028100","Low-Income Community","2011-2015"]
["Washington","King","53033028200","Low-Income Community","2011-2015"]
["Washington","King","53033028402","Low-Income Community","2011-2015"]
["Washington","King","53033028403","Low-Income Community","2011-2015"]
["Washington","King","53033028802","Low-Income Community","2011-2015"]
["Washington","King","53033030006","Low-Income Community","2011-2015"]
["Washington","Kitsap","53035080500","Low-Income Community","2011-2015"]
["Washington","Kitsap","53035092200","Low-Income Community","2011-2015"]
["Washington","Kitsap","53035092300","Low-Income Community","2011-2015"]
["Washington","Kittitas","53037975500","Low-Income Community","2011-2015"]
["Washington","Kittitas","53037975600","Low-Income Community","2011-2015"]
["Washington","Klickitat","53039950100","Low-Income Community","2011-2015"]
["Washington","Klickitat","53039950200","Low-Income Community","2011-2015"]
["Washington","Lewis","53041971000","Low-Income Community","2011-2015"]
["Washington","Lewis","53041971100","Non-LIC Contiguous","2011-2015"]
["Washington","Lincoln","53043960400","Low-Income Community","2011-2015"]
["Washington","Mason","53045960600","Low-Income Community","2011-2015"]
["Washington","Mason","53045961300","Low-Income Community","2011-2015"]
["Washington","Okanogan","53047940100","Low-Income Community","2011-2015"]
["Washington","Okanogan","53047940200","Low-Income Community","2011-2015"]
["Washington","Okanogan","53047970400","Low-Income Community","2011-2015"]
["Washington","Okanogan","53047970800","Low-Income Community","2011-2015"]
["Washington","Pacific","53049950200","Low-Income Community","2011-2015"]
["Washington","Pacific","53049950300","Low-Income Community","2011-2015"]
["Washington","Pacific","53049950800","Low-Income Community","2011-2015"]
["Washington","Pend Oreille","53051970200","Low-Income Community","2011-2015"]
["Washington","Pend Oreille","53051970500","Low-Income Community","2011-2015"]
["Washington","Pierce","53053061400","Low-Income Community","2011-2015"]
["Washington","Pierce","53053061601","Low-Income Community","2011-2015"]
["Washington","Pierce","53053061602","Low-Income Community","2011-2015"]
["Washington","Pierce","53053062400","Low-Income Community","2011-2015"]
["Washington","Pierce","53053062600","Low-Income Community","2011-2015"]
["Washington","Pierce","53053071408","Low-Income Community","2011-2015"]
["Washington","Pierce","53053071409","Low-Income Community","2011-2015"]
["Washington","Pierce","53053071503","Low-Income Community","2011-2015"]
["Washington","Pierce","53053071805","Low-Income Community","2011-2015"]
["Washington","Pierce","53053071806","Low-Income Community","2011-2015"]
["Washington","Pierce","53053072000","Low-Income Community","2011-2015"]
["Washington","Pierce","53053940007","Low-Income Community","2011-2015"]
["Washington","Skagit","53057940500","Low-Income Community","2011-2015"]
["Washington","Skagit","53057951500","Low-Income Community","2011-2015"]
["Washington","Skagit","53057952200","Low-Income Community","2011-2015"]
["Washington","Skagit","53057952401","Low-Income Community","2011-2015"]
["Washington","Skagit","53057952500","Non-LIC Contiguous","2011-2015"]
["Washington","Skamania","53059950300","Low-Income Community","2011-2015"]
["Washington","Skamania","53059950400","Low-Income Community","2011-2015"]
["Washington","Skamania","53059950500","Low-Income Community","2011-2015"]
["Washington","Snohomish","53061040200","Low-Income Community","2011-2015"]
["Washington","Snohomish","53061040700","Low-Income Community","2011-2015"]
["Washington","Snohomish","53061041901","Low-Income Community","2011-2015"]
["Washington","Snohomish","53061051400","Low-Income Community","2011-2015"]
["Washington","Snohomish","53061052803","Low-Income Community","2011-2015"]
["Washington","Snohomish","53061053509","Low-Income Community","2011-2015"]
["Washington","Snohomish","53061053700","Low-Income Community","2011-2015"]
["Washington","Spokane","53063000200","Low-Income Community","2011-2015"]
["Washington","Spokane","53063001600","Low-Income Community","2011-2015"]
["Washington","Spokane","53063002300","Low-Income Community","2011-2015"]
["Washington","Spokane","53063002400","Low-Income Community","2011-2015"]
["Washington","Spokane","53063003100","Low-Income Community","2011-2015"]
["Washington","Spokane","53063003200","Low-Income Community","2011-2015"]
["Washington","Spokane","53063003500","Low-Income Community","2011-2015"]
["Washington","Spokane","53063004000","Low-Income Community","2011-2015"]
["Washington","Spokane","53063010401","Low-Income Community","2011-2015"]
["Washington","Spokane","53063014400","Low-Income Community","2011-2015"]
["Washington","Spokane","53063014500","Low-Income Community","2011-2015"]
["Washington","Stevens","53065941000","Low-Income Community","2011-2015"]
["Washington","Stevens","53065950800","Low-Income Community","2011-2015"]
["Washington","Thurston","53067010100","Low-Income Community","2011-2015"]
["Washington","Thurston","53067011200","Low-Income Community","2011-2015"]
["Washington","Thurston","53067012320","Low-Income Community","2011-2015"]
["Washington","Thurston","53067012720","Low-Income Community","2011-2015"]
["Washington","Walla Walla","53071920300","Low-Income Community","2011-2015"]
["Washington","Walla Walla","53071920500","Low-Income Community","2011-2015"]
["Washington","Whatcom","53073000600","Low-Income Community","2011-2015"]
["Washington","Whatcom","53073001000","Low-Income Community","2011-2015"]
["Washington","Whatcom","53073940000","Low-Income Community","2011-2015"]
["Washington","Yakima","53077000100","Low-Income Community","2011-2015"]
["Washington","Yakima","53077000200","Low-Income Community","2011-2015"]
["Washington","Yakima","53077001300","Low-Income Community","2011-2015"]
["Washington","Yakima","53077001501","Low-Income Community","2011-2015"]
["West Virginia","Berkeley","54003971500","Low-Income Community","2011-2015"]
["West Virginia","Berkeley","54003971600","Low-Income Community","2011-2015"]
["West Virginia","Berkeley","54003971700","Low-Income Community","2011-2015"]
["West Virginia","Boone","54005958300","Low-Income Community","2011-2015"]
["West Virginia","Cabell","54011000600","Low-Income Community","2011-2015"]
["West Virginia","Cabell","54011010900","Low-Income Community","2011-2015"]
["West Virginia","Greenbrier","54025950100","Low-Income Community","2011-2015"]
["West Virginia","Greenbrier","54025950700","Low-Income Community","2011-2015"]
["West Virginia","Hampshire","54027968200","Low-Income Community","2011-2015"]
["West Virginia","Hancock","54029021300","Low-Income Community","2011-2015"]
["West Virginia","Harrison","54033030100","Low-Income Community","2011-2015"]
["West Virginia","Jackson","54035963300","Low-Income Community","2011-2015"]
["West Virginia","Jackson","54035963400","Non-LIC Contiguous","2011-2015"]
["West Virginia","Jefferson","54037972300","Low-Income Community","2011-2015"]
["West Virginia","Jefferson","54037972401","Low-Income Community","2011-2015"]
["West Virginia","Jefferson","54037972402","Low-Income Community","2011-2015"]
["West Virginia","Jefferson","54037972505","Low-Income Community","2011-2015"]
["West Virginia","Jefferson","54037972506","Low-Income Community","2011-2015"]
["West Virginia","Jefferson","54037972800","Low-Income Community","2011-2015"]
["West Virginia","Kanawha","54039000800","Low-Income Community","2011-2015"]
["West Virginia","Kanawha","54039000900","Low-Income Community","2011-2015"]
["West Virginia","Kanawha","54039001200","Low-Income Community","2011-2015"]
["West Virginia","Kanawha","54039001700","Low-Income Community","2011-2015"]
["West Virginia","Kanawha","54039013000","Low-Income Community","2011-2015"]
["West Virginia","Kanawha","54039013100","Low-Income Community","2011-2015"]
["West Virginia","Marion","54049020100","Low-Income Community","2011-2015"]
["West Virginia","Marion","54049020700","Low-Income Community","2011-2015"]
["West Virginia","Marshall","54051020200","Low-Income Community","2011-2015"]
["West Virginia","Mason","54053955102","Low-Income Community","2011-2015"]
["West Virginia","Mercer","54055001300","Low-Income Community","2011-2015"]
["West Virginia","Mercer","54055002300","Low-Income Community","2011-2015"]
["West Virginia","Mercer","54055002400","Low-Income Community","2011-2015"]
["West Virginia","Mingo","54059957400","Low-Income Community","2011-2015"]
["West Virginia","Mingo","54059957700","Low-Income Community","2011-2015"]
["West Virginia","Monongalia","54061010102","Low-Income Community","2011-2015"]
["West Virginia","Monongalia","54061010201","Low-Income Community","2011-2015"]
["West Virginia","Monongalia","54061010600","Low-Income Community","2011-2015"]
["West Virginia","Monroe","54063950200","Low-Income Community","2011-2015"]
["West Virginia","Morgan","54065970800","Low-Income Community","2011-2015"]
["West Virginia","Nicholas","54067950100","Non-LIC Contiguous","2011-2015"]
["West Virginia","Nicholas","54067950200","Low-Income Community","2011-2015"]
["West Virginia","Ohio","54069002700","Low-Income Community","2011-2015"]
["West Virginia","Raleigh","54081000200","Low-Income Community","2011-2015"]
["West Virginia","Raleigh","54081000400","Low-Income Community","2011-2015"]
["West Virginia","Randolph","54083966100","Low-Income Community","2011-2015"]
["West Virginia","Summers","54089000700","Low-Income Community","2011-2015"]
["West Virginia","Taylor","54091964600","Low-Income Community","2011-2015"]
["West Virginia","Tyler","54095961800","Low-Income Community","2011-2015"]
["West Virginia","Upshur","54097966700","Low-Income Community","2011-2015"]
["West Virginia","Upshur","54097966800","Low-Income Community","2011-2015"]
["West Virginia","Wayne","54099005200","Low-Income Community","2011-2015"]
["West Virginia","Wetzel","54103030400","Low-Income Community","2011-2015"]
["West Virginia","Wood","54107000701","Low-Income Community","2011-2015"]
["West Virginia","Wood","54107011000","Non-LIC Contiguous","2011-2015"]
["West Virginia","Wyoming","54109003100","Low-Income Community","2011-2015"]
["Wisconsin","Ashland","55003950300","Low-Income Community","2011-2015"]
["Wisconsin","Barron","55005000500","Low-Income Community","2011-2015"]
["Wisconsin","Barron","55005000600","Low-Income Community","2011-2015"]
["Wisconsin","Brown","55009000100","Low-Income Community","2011-2015"]
["Wisconsin","Brown","55009000800","Low-Income Community","2011-2015"]
["Wisconsin","Brown","55009001702","Low-Income Community","2011-2015"]
["Wisconsin","Brown","55009021303","Low-Income Community","2011-2015"]
["Wisconsin","Chippewa","55017010500","Low-Income Community","2011-2015"]
["Wisconsin","Columbia","55021970400","Low-Income Community","2011-2015"]
["Wisconsin","Crawford","55023960500","Low-Income Community","2011-2015"]
["Wisconsin","Dane","55025000407","Low-Income Community","2011-2015"]
["Wisconsin","Dane","55025000408","Low-Income Community","2011-2015"]
["Wisconsin","Dane","55025000600","Low-Income Community","2011-2015"]
["Wisconsin","Dane","55025001401","Low-Income Community","2011-2015"]
["Wisconsin","Dane","55025001402","Low-Income Community","2011-2015"]
["Wisconsin","Dane","55025001502","Low-Income Community","2011-2015"]
["Wisconsin","Dane","55025001804","Low-Income Community","2011-2015"]
["Wisconsin","Dane","55025002100","Low-Income Community","2011-2015"]
["Wisconsin","Dane","55025002402","Low-Income Community","2011-2015"]
["Wisconsin","Dane","55025002500","Low-Income Community","2011-2015"]
["Wisconsin","Dane","55025011505","Low-Income Community","2011-2015"]
["Wisconsin","Dodge","55027960900","Low-Income Community","2011-2015"]
["Wisconsin","Douglas","55031020300","Low-Income Community","2011-2015"]
["Wisconsin","Douglas","55031021100","Low-Income Community","2011-2015"]
["Wisconsin","Dunn","55033970800","Low-Income Community","2011-2015"]
["Wisconsin","Eau Claire","55035000600","Low-Income Community","2011-2015"]
["Wisconsin","Eau Claire","55035001101","Low-Income Community","2011-2015"]
["Wisconsin","Eau Claire","55035001200","Low-Income Community","2011-2015"]
["Wisconsin","Fond du Lac","55039040500","Low-Income Community","2011-2015"]
["Wisconsin","Grant","55043960900","Low-Income Community","2011-2015"]
["Wisconsin","Green","55045960500","Low-Income Community","2011-2015"]
["Wisconsin","Green Lake","55047100100","Low-Income Community","2011-2015"]
["Wisconsin","Jefferson","55055100200","Low-Income Community","2011-2015"]
["Wisconsin","Jefferson","55055101100","Low-Income Community","2011-2015"]
["Wisconsin","Kenosha","55059000700","Low-Income Community","2011-2015"]
["Wisconsin","Kenosha","55059001000","Low-Income Community","2011-2015"]
["Wisconsin","Kenosha","55059001200","Low-Income Community","2011-2015"]
["Wisconsin","La Crosse","55063000200","Low-Income Community","2011-2015"]
["Wisconsin","La Crosse","55063000400","Low-Income Community","2011-2015"]
["Wisconsin","Langlade","55067960600","Low-Income Community","2011-2015"]
["Wisconsin","Lincoln","55069960800","Low-Income Community","2011-2015"]
["Wisconsin","Manitowoc","55071000800","Low-Income Community","2011-2015"]
["Wisconsin","Manitowoc","55071005400","Low-Income Community","2011-2015"]
["Wisconsin","Marathon","55073000100","Low-Income Community","2011-2015"]
["Wisconsin","Marathon","55073000500","Low-Income Community","2011-2015"]
["Wisconsin","Marinette","55075960800","Low-Income Community","2011-2015"]
["Wisconsin","Marinette","55075961400","Low-Income Community","2011-2015"]
["Wisconsin","Milwaukee","55079000101","Low-Income Community","2011-2015"]
["Wisconsin","Milwaukee","55079000102","Low-Income Community","2011-2015"]
["Wisconsin","Milwaukee","55079000201","Low-Income Community","2011-2015"]
["Wisconsin","Milwaukee","55079001200","Low-Income Community","2011-2015"]
["Wisconsin","Milwaukee","55079001300","Low-Income Community","2011-2015"]
["Wisconsin","Milwaukee","55079002100","Low-Income Community","2011-2015"]
["Wisconsin","Milwaukee","55079002400","Low-Income Community","2011-2015"]
["Wisconsin","Milwaukee","55079002500","Low-Income Community","2011-2015"]
["Wisconsin","Milwaukee","55079004100","Low-Income Community","2011-2015"]
["Wisconsin","Milwaukee","55079004700","Low-Income Community","2011-2015"]
["Wisconsin","Milwaukee","55079006300","Low-Income Community","2011-2015"]
["Wisconsin","Milwaukee","55079006500","Low-Income Community","2011-2015"]
["Wisconsin","Milwaukee","55079006900","Low-Income Community","2011-2015"]
["Wisconsin","Milwaukee","55079008900","Low-Income Community","2011-2015"]
["Wisconsin","Milwaukee","55079009800","Low-Income Community","2011-2015"]
["Wisconsin","Milwaukee","55079009900","Low-Income Community","2011-2015"]
["Wisconsin","Milwaukee","55079011300","Low-Income Community","2011-2015"]
["Wisconsin","Milwaukee","55079013500","Low-Income Community","2011-2015"]
["Wisconsin","Milwaukee","55079013700","Low-Income Community","2011-2015"]
["Wisconsin","Milwaukee","55079014100","Low-Income Community","2011-2015"]
["Wisconsin","Milwaukee","55079014900","Low-Income Community","2011-2015"]
["Wisconsin","Milwaukee","55079015700","Low-Income Community","2011-2015"]
["Wisconsin","Milwaukee","55079015800","Low-Income Community","2011-2015"]
["Wisconsin","Milwaukee","55079015900","Low-Income Community","2011-2015"]
["Wisconsin","Milwaukee","55079016200","Low-Income Community","2011-2015"]
["Wisconsin","Milwaukee","55079016500","Low-Income Community","2011-2015"]
["Wisconsin","Milwaukee","55079016700","Low-Income Community","2011-2015"]
["Wisconsin","Milwaukee","55079016800","Low-Income Community","2011-2015"]
["Wisconsin","Milwaukee","55079021600","Low-Income Community","2011-2015"]
["Wisconsin","Milwaukee","55079100200","Low-Income Community","2011-2015"]
["Wisconsin","Milwaukee","55079110100","Low-Income Community","2011-2015"]
["Wisconsin","Milwaukee","55079170600","Low-Income Community","2011-2015"]
["Wisconsin","Milwaukee","55079185400","Low-Income Community","2011-2015"]
["Wisconsin","Milwaukee","55079185600","Low-Income Community","2011-2015"]
["Wisconsin","Milwaukee","55079186000","Low-Income Community","2011-2015"]
["Wisconsin","Milwaukee","55079186500","Low-Income Community","2011-2015"]
["Wisconsin","Milwaukee","55079186800","Low-Income Community","2011-2015"]
["Wisconsin","Oneida","55085971500","Low-Income Community","2011-2015"]
["Wisconsin","Outagamie","55087010100","Low-Income Community","2011-2015"]
["Wisconsin","Pierce","55093960400","Low-Income Community","2011-2015"]
["Wisconsin","Portage","55097960400","Low-Income Community","2011-2015"]
["Wisconsin","Portage","55097961000","Low-Income Community","2011-2015"]
["Wisconsin","Price","55099970200","Low-Income Community","2011-2015"]
["Wisconsin","Racine","55101000100","Low-Income Community","2011-2015"]
["Wisconsin","Racine","55101000400","Low-Income Community","2011-2015"]
["Wisconsin","Racine","55101000500","Low-Income Community","2011-2015"]
["Wisconsin","Richland","55103970400","Low-Income Community","2011-2015"]
["Wisconsin","Rock","55105000100","Low-Income Community","2011-2015"]
["Wisconsin","Rock","55105001000","Low-Income Community","2011-2015"]
["Wisconsin","Rock","55105001400","Low-Income Community","2011-2015"]
["Wisconsin","Rock","55105001500","Low-Income Community","2011-2015"]
["Wisconsin","Rock","55105001700","Low-Income Community","2011-2015"]
["Wisconsin","Rusk","55107960500","Low-Income Community","2011-2015"]
["Wisconsin","Sauk","55111000300","Low-Income Community","2011-2015"]
["Wisconsin","Sawyer","55113100300","Low-Income Community","2011-2015"]
["Wisconsin","Sawyer","55113940000","Low-Income Community","2011-2015"]
["Wisconsin","Shawano","55115100500","Low-Income Community","2011-2015"]
["Wisconsin","Sheboygan","55117000800","Low-Income Community","2011-2015"]
["Wisconsin","Sheboygan","55117011400","Low-Income Community","2011-2015"]
["Wisconsin","Vernon","55123960100","Low-Income Community","2011-2015"]
["Wisconsin","Vilas","55125940000","Low-Income Community","2011-2015"]
["Wisconsin","Vilas","55125950500","Low-Income Community","2011-2015"]
["Wisconsin","Walworth","55127000400","Low-Income Community","2011-2015"]
["Wisconsin","Walworth","55127000501","Low-Income Community","2011-2015"]
["Wisconsin","Washburn","55129950500","Low-Income Community","2011-2015"]
["Wisconsin","Waukesha","55133202600","Low-Income Community","2011-2015"]
["Wisconsin","Winnebago","55139000500","Low-Income Community","2011-2015"]
["Wisconsin","Winnebago","55139001500","Low-Income Community","2011-2015"]
["Wisconsin","Winnebago","55139002900","Low-Income Community","2011-2015"]
["Wisconsin","Winnebago","55139003300","Low-Income Community","2011-2015"]
["Wisconsin","Wood","55141010400","Low-Income Community","2011-2015"]
["Wisconsin","Wood","55141011200","Low-Income Community","2011-2015"]
["Wisconsin","Wood","55141011700","Low-Income Community","2011-2015"]
["Wyoming","Albany","56001962800","Low-Income Community","2011-2015"]
["Wyoming","Albany","56001963100","Low-Income Community","2011-2015"]
["Wyoming","Albany","56001963400","Low-Income Community","2011-2015"]
["Wyoming","Albany","56001963500","Low-Income Community","2011-2015"]
["Wyoming","Albany","56001963700","Low-Income Community","2011-2015"]
["Wyoming","Carbon","56007967700","Low-Income Community","2011-2015"]
["Wyoming","Converse","56009956600","Non-LIC Contiguous","2011-2015"]
["Wyoming","Fremont","56013000100","Low-Income Community","2011-2015"]
["Wyoming","Fremont","56013940100","Low-Income Community","2011-2015"]
["Wyoming","Fremont","56013940300","Low-Income Community","2011-2015"]
["Wyoming","Goshen","56015957800","Low-Income Community","2011-2015"]
["Wyoming","Goshen","56015958000","Low-Income Community","2011-2015"]
["Wyoming","Hot Springs","56017967800","Low-Income Community","2011-2015"]
["Wyoming","Laramie","56021000402","Low-Income Community","2011-2015"]
["Wyoming","Laramie","56021001502","Low-Income Community","2011-2015"]
["Wyoming","Natrona","56025000200","Low-Income Community","2011-2015"]
["Wyoming","Natrona","56025000800","Low-Income Community","2011-2015"]
["Wyoming","Natrona","56025001100","Low-Income Community","2011-2015"]
["Wyoming","Natrona","56025001200","Low-Income Community","2011-2015"]
["Wyoming","Park","56029965400","Low-Income Community","2011-2015"]
["Wyoming","Platte","56031959100","Low-Income Community","2011-2015"]
["Wyoming","Platte","56031959400","Low-Income Community","2011-2015"]
["Wyoming","Sweetwater","56037970903","Low-Income Community","2011-2015"]
["Wyoming","Uinta","56041975400","Low-Income Community","2011-2015"]
["Wyoming","Washakie","56043000301","Low-Income Community","2011-2015"]

{"sheet":"export","index":5,"n_rows":47,"n_cols":84,"rows_kept":47,"hidden":true,"merged":[[2,0,2,4],[5,17,5,19]]}
["OrgName","ReqAmt","NumParticipants","OppZone","Priority","AuthRepName","AuthRepPhone","POCname","POCphone","POCemail","Address","SSVF","GPD","VASH","HUDcoc","State1","S1c1","S1c2","S1c3","S1c4","S1c5","S1c6","S1c7","S1c8","S1c9","S1c10","S1c11","S1c12","S1c13","State2","S2c1","S2c2","S2c3","S2c4","S2c5","S2c6","S2c7","S2c8","S2c9","S2c10","S2c11","S2c12","S2c13","State3","S3c1","S3c2","S3c3","S3c4","S3c5","S3c6","S3c7","S3c8","S3c9","S3c10","S3c11","S3c12","S3c13","CoC1","CoC2","CoC3","CoC4","CoC5","CoC6","CoC7","CoC8","CoC9","CoC10","CoC11","CoC12","CoC13","CoC14","CoC15","CoC16","CoC17","CoC18","CoC19","CoC20","CoC21","CoC22","CoC23","CoC24","CoC25","CoC26","CoC27"]
[{"$f":"'VETS-704 Applicant Synopsis'!$E$2","v":0},{"$f":"'VETS-704 Applicant Synopsis'!$E$3","v":0},{"$f":"'VETS-704 Applicant Synopsis'!$E$4","v":0},{"$f":"'VETS-704 Applicant Synopsis'!$J$2","v":0},{"$f":"'VETS-704 Applicant Synopsis'!$J$3","v":0},{"$f":"'VETS-704 Applicant Synopsis'!$E$6","v":0},{"$f":"'VETS-704 Applicant Synopsis'!$E$7","v":0},{"$f":"'VETS-704 Applicant Synopsis'!$E$8","v":0},{"$f":"'VETS-704 Applicant Synopsis'!$E$9","v":0},{"$f":"'VETS-704 Applicant Synopsis'!$E$10","v":0},{"$f":"'VETS-704 Applicant Synopsis'!#REF!","v":{"$error":"#REF!"}},{"$f":"'VETS-704 Applicant Synopsis'!$C$15","v":0},{"$f":"'VETS-704 Applicant Synopsis'!$C$16","v":0},{"$f":"'VETS-704 Applicant Synopsis'!$C$17","v":0},{"$f":"'VETS-704 Applicant Synopsis'!$C$18","v":0},{"$f":"'VETS-704 Applicant Synopsis'!E29","v":0},{"$f":"'VETS-704 Applicant Synopsis'!E30","v":0},{"$f":"'VETS-704 Applicant Synopsis'!E31","v":0},{"$f":"'VETS-704 Applicant Synopsis'!E32","v":0},{"$f":"'VETS-704 Applicant Synopsis'!E33","v":0},{"$f":"'VETS-704 Applicant Synopsis'!E34","v":0},{"$f":"'VETS-704 Applicant Synopsis'!D23","v":"Opportunity Zone"},{"$f":"'VETS-704 Applicant Synopsis'!E19","v":0},{"$f":"'VETS-704 Applicant Synopsis'!E21","v":0},{"$f":"'VETS-704 Applicant Synopsis'!J23","v":0},{"$f":"'VETS-704 Applicant Synopsis'!J24","v":0},{"$f":"'VETS-704 Applicant Synopsis'!#REF!","v":{"$error":"#REF!"}},{"$f":"'VETS-704 Applicant Synopsis'!#REF!","v":{"$error":"#REF!"}},{"$f":"'VETS-704 Applicant Synopsis'!#REF!","v":{"$error":"#REF!"}},{"$f":"'VETS-704 Applicant Synopsis'!H29","v":0},{"$f":"'VETS-704 Applicant Synopsis'!H30","v":0},{"$f":"'VETS-704 Applicant Synopsis'!H31","v":0},{"$f":"'VETS-704 Applicant Synopsis'!H32","v":0},{"$f":"'VETS-704 Applicant Synopsis'!H33","v":0},{"$f":"'VETS-704 Applicant Synopsis'!H34","v":0},{"$f":"'VETS-704 Applicant Synopsis'!G22","v":0},{"$f":"'VETS-704 Applicant Synopsis'!H19","v":0},{"$f":"'VETS-704 Applicant Synopsis'!H21","v":0},{"$f":"'VETS-704 Applicant Synopsis'!H24","v":0},{"$f":"'VETS-704 Applicant Synopsis'!H25","v":0},{"$f":"'VETS-704 Applicant Synopsis'!#REF!","v":{"$error":"#REF!"}},{"$f":"'VETS-704 Applicant Synopsis'!#REF!","v":{"$error":"#REF!"}},{"$f":"'VETS-704 Applicant Synopsis'!#REF!","v":{"$error":"#REF!"}},{"$f":"'VETS-704 Applicant Synopsis'!K29","v":0},{"$f":"'VETS-704 Applicant Synopsis'!K30","v":0},{"$f":"'VETS-704 Applicant Synopsis'!K31","v":0},{"$f":"'VETS-704 Applicant Synopsis'!K32","v":0},{"$f":"'VETS-704 Applicant Synopsis'!K33","v":0},{"$f":"'VETS-704 Applicant Synopsis'!K34","v":0},{"$f":"'VETS-704 Applicant Synopsis'!K23","v":0},{"$f":"'VETS-704 Applicant Synopsis'!K19","v":0},{"$f":"'VETS-704 Applicant Synopsis'!K21","v":0},{"$f":"'VETS-704 Applicant Synopsis'!F24","v":0},{"$f":"'VETS-704 Applicant Synopsis'!K25","v":0},{"$f":"'VETS-704 Applicant Synopsis'!#REF!","v":{"$error":"#REF!"}},{"$f":"'VETS-704 Applicant Synopsis'!#REF!","v":{"$error":"#REF!"}},{"$f":"'VETS-704 Applicant Synopsis'!#REF!","v":{"$error":"#REF!"}},{"$f":"'VETS-704 Applicant Synopsis'!E39","v":0},{"$f":"'VETS-704 Applicant Synopsis'!E40","v":0},{"$f":"'VETS-704 Applicant Synopsis'!E41","v":0},{"$f":"'VETS-704 Applicant Synopsis'!E42","v":0},{"$f":"'VETS-704 Applicant Synopsis'!E43","v":0},{"$f":"'VETS-704 Applicant Synopsis'!E44","v":0},{"$f":"'VETS-704 Applicant Synopsis'!E45","v":0},{"$f":"'VETS-704 Applicant Synopsis'!E46","v":0},{"$f":"'VETS-704 Applicant Synopsis'!E47","v":0},{"$f":"'VETS-704 Applicant Synopsis'!H39","v":0},{"$f":"'VETS-704 Applicant Synopsis'!H40","v":0},{"$f":"'VETS-704 Applicant Synopsis'!H41","v":0},{"$f":"'VETS-704 Applicant Synopsis'!H42","v":0},{"$f":"'VETS-704 Applicant Synopsis'!H43","v":0},{"$f":"'VETS-704 Applicant Synopsis'!H44","v":0},{"$f":"'VETS-704 Applicant Synopsis'!H45","v":0},{"$f":"'VETS-704 Applicant Synopsis'!H46","v":0},{"$f":"'VETS-704 Applicant Synopsis'!H47","v":0},{"$f":"'VETS-704 Applicant Synopsis'!K39","v":0},{"$f":"'VETS-704 Applicant Synopsis'!K40","v":0},{"$f":"'VETS-704 Applicant Synopsis'!K41","v":0},{"$f":"'VETS-704 Applicant Synopsis'!K42","v":0},{"$f":"'VETS-704 Applicant Synopsis'!K43","v":0},{"$f":"'VETS-704 Applicant Synopsis'!K44","v":0},{"$f":"'VETS-704 Applicant Synopsis'!K45","v":0},{"$f":"'VETS-704 Applicant Synopsis'!K46","v":0},{"$f":"'VETS-704 Applicant Synopsis'!K47","v":0}]
["Export to rollup list of all applicants"]
["OrgName","ReqAmt","NumParticipants","OppZone","Priority","AuthRepName","AuthRepPhone","POCname","POCphone","POCemail","Address","SSVF","GPD","VASH","HUDcoc","AllCounties","AllCOCs"]
[{"$f":"'VETS-704 Applicant Synopsis'!$E$2","v":0},{"$f":"'VETS-704 Applicant Synopsis'!$E$3","v":0},{"$f":"'VETS-704 Applicant Synopsis'!$E$4","v":0},{"$f":"'VETS-704 Applicant Synopsis'!$J$2","v":0},{"$f":"'VETS-704 Applicant Synopsis'!$J$3","v":0},{"$f":"'VETS-704 Applicant Synopsis'!$E$6","v":0},{"$f":"'VETS-704 Applicant Synopsis'!$E$7","v":0},{"$f":"'VETS-704 Applicant Synopsis'!$E$8","v":0},{"$f":"'VETS-704 Applicant Synopsis'!$E$9","v":0},{"$f":"'VETS-704 Applicant Synopsis'!$E$10","v":0},{"$f":"'VETS-704 Applicant Synopsis'!#REF!","v":{"$error":"#REF!"}},{"$f":"'VETS-704 Applicant Synopsis'!$C$15","v":0},{"$f":"'VETS-704 Applicant Synopsis'!$C$16","v":0},{"$f":"'VETS-704 Applicant Synopsis'!$C$17","v":0},{"$f":"'VETS-704 Applicant Synopsis'!$C$18","v":0},{"$f":"$W$46","v":"Opportunity Zone, "},{"$f":"$BJ$34","v":""}]
[{"$nulls":17},"Export to SDA rollup"]
[{"$nulls":14},"Index","RawCounty","RawState","County","State","AvgCtyParts","Stabbr","CtyST","ConcatCtySt",{"$nulls":33},"Index","RawCoCnum","RawCoCarea","CoC","AvgCOCparts","ConcatCOC"]
[{"$nulls":14},{"$f":"IF(P8=\"\",\"\",MAX(O$7:O7)+1)","v":""},{"$f":"IF(Q2>0,Q2,\"\")","v":""},{"$f":"IF(P8=\"\",\"\",$P$2)","v":""},{"$f":"IFERROR(INDEX($P$8:$P$46,MATCH(ROW()-ROW($AK$7),$O$8:$O$46,0)),\"\")","v":"Opportunity Zone"},{"$f":"IFERROR(INDEX($Q$8:$Q$46,MATCH(ROW()-ROW($AK$7),$O$8:$O$46,0)),\"\")","v":0},{"$f":"IF(R8>\"?*\",$C$5/$P$47,\"\")","v":0},{"$f":"IFERROR(VLOOKUP(S8,STabbr[],2,FALSE),\"\")","v":""},{"$f":"IF(R8>\"*\",R8&\", \"&U8,\"\")","v":"Opportunity Zone, "},{"$f":"V8","v":"Opportunity Zone, "},{"$nulls":33},{"$f":"IF(BF8=\"\",\"\",MAX(BE$7:BE7)+1)","v":""},{"$f":"IF(BF2>0,BF2,\"\")","v":""},{"$f":"IFERROR(VLOOKUP(BF8,CoClist[[COC '#]:[COC Location]],2,FALSE),\"\")","v":""},{"$f":"IFERROR(INDEX($BF$8:$BF$34,MATCH(ROW()-ROW($BH$7),$BE$8:$BE$34,0)),\"\")","v":""},{"$f":"IF(BH8>\"?*\",$C$5/$BH$35,\"\")","v":""},{"$f":"BH8","v":""}]
[{"$nulls":14},{"$f":"IF(P9=\"\",\"\",MAX(O$7:O8)+1)","v":""},{"$f":"IF(R2>0,R2,\"\")","v":""},{"$f":"IF(P9=\"\",\"\",$P$2)","v":""},{"$f":"IFERROR(INDEX($P$8:$P$46,MATCH(ROW()-ROW($AK$7),$O$8:$O$46,0)),\"\")","v":""},{"$f":"IFERROR(INDEX($Q$8:$Q$46,MATCH(ROW()-ROW($AK$7),$O$8:$O$46,0)),\"\")","v":""},"",{"$f":"IFERROR(VLOOKUP(S9,STabbr[],2,FALSE),\"\")","v":""},{"$f":"IF(R9>\"*\",R9&\", \"&U9,\"\")","v":""},{"$f":"IF(V9=\"\",W8,CONCATENATE(W8,\";\",V9))","v":"Opportunity Zone, "},{"$nulls":33},{"$f":"IF(BF9=\"\",\"\",MAX(BE$7:BE8)+1)","v":""},{"$f":"IF(BG$2>0,BG$2,\"\")","v":""},{"$f":"IFERROR(VLOOKUP(BF9,CoClist[[COC '#]:[COC Location]],2,FALSE),\"\")","v":""},"","",{"$f":"IF(BH9=\"\",BJ8,CONCATENATE(BJ8,\";\",BH9))","v":""}]
[{"$nulls":14},{"$f":"IF(P10=\"\",\"\",MAX(O$7:O9)+1)","v":""},{"$f":"IF(S2>0,S2,\"\")","v":""},"","","","",{"$f":"IFERROR(VLOOKUP(S10,STabbr[],2,FALSE),\"\")","v":""},"",{"$f":"IF(V10=\"\",W9,CONCATENATE(W9,\";\",V10))","v":"Opportunity Zone, "},{"$nulls":33},{"$f":"IF(BF10=\"\",\"\",MAX(BE$7:BE9)+1)","v":""},{"$f":"IF(BH$2>0,BH$2,\"\")","v":""},{"$f":"IFERROR(VLOOKUP(BF10,CoClist[[COC '#]:[COC Location]],2,FALSE),\"\")","v":""},"","",{"$f":"IF(BH10=\"\",BJ9,CONCATENATE(BJ9,\";\",BH10))","v":""}]
[{"$nulls":14},{"$f":"IF(P11=\"\",\"\",MAX(O$7:O10)+1)","v":""},{"$f":"IF(T2>0,T2,\"\")","v":""},"","","","",{"$f":"IFERROR(VLOOKUP(S11,STabbr[],2,FALSE),\"\")","v":""},"","Opportunity Zone, ",{"$nulls":33},{"$f":"IF(BF11=\"\",\"\",MAX(BE$7:BE10)+1)","v":""},{"$f":"IF(BHG$2>0,BI$2,\"\")","v":""},{"$f":"IFERROR(VLOOKUP(BF11,CoClist[[COC '#]:[COC Location]],2,FALSE),\"\")","v":""},"","",""]
[{"$nulls":14},{"$f":"IF(P12=\"\",\"\",MAX(O$7:O11)+1)","v":""},{"$f":"IF(U2>0,U2,\"\")","v":""},"","","","",{"$f":"IFERROR(VLOOKUP(S12,STabbr[],2,FALSE),\"\")","v":""},"","Opportunity Zone, ",{"$nulls":33},{"$f":"IF(BF12=\"\",\"\",MAX(BE$7:BE11)+1)","v":""},{"$f":"IF(BJ$2>0,BJ$2,\"\")","v":""},{"$f":"IFERROR(VLOOKUP(BF12,CoClist[[COC '#]:[COC Location]],2,FALSE),\"\")","v":""},"","",""]
[{"$nulls":14},{"$f":"IF(P13=\"\",\"\",MAX(O$7:O12)+1)","v":1},{"$f":"IF(V2>0,V2,\"\")","v":"Opportunity Zone"},0,"","","",{"$f":"IFERROR(VLOOKUP(S13,STabbr[],2,FALSE),\"\")","v":""},"","Opportunity Zone, ",{"$nulls":33},{"$f":"IF(BF13=\"\",\"\",MAX(BE$7:BE12)+1)","v":""},{"$f":"IF(BK$2>0,BK$2,\"\")","v":""},{"$f":"IFERROR(VLOOKUP(BF13,CoClist[[COC '#]:[COC Location]],2,FALSE),\"\")","v":""},"","",""]
[{"$nulls":14},{"$f":"IF(P14=\"\",\"\",MAX(O$7:O13)+1)","v":""},{"$f":"IF(W2>0,W2,\"\")","v":""},"","","","",{"$f":"IFERROR(VLOOKUP(S14,STabbr[],2,FALSE),\"\")","v":""},"","Opportunity Zone, ",{"$nulls":32},{"$f":"IFERROR(INDEX($BF$8:$BF$34,MATCH(ROW()-ROW($BH$7),$BE$8:$BE$34,0)),\"\")","v":""},{"$f":"IF(BF14=\"\",\"\",MAX(BE$7:BE13)+1)","v":""},{"$f":"IF(BL$2>0,BL$2,\"\")","v":""},{"$f":"IFERROR(VLOOKUP(BF14,CoClist[[COC '#]:[COC Location]],2,FALSE),\"\")","v":""},"","",""]
[{"$nulls":14},{"$f":"IF(P15=\"\",\"\",MAX(O$7:O14)+1)","v":""},{"$f":"IF(X2>0,X2,\"\")","v":""},"","","","",{"$f":"IFERROR(VLOOKUP(S15,STabbr[],2,FALSE),\"\")","v":""},"","Opportunity Zone, ",{"$nulls":32},"",{"$f":"IF(BF15=\"\",\"\",MAX(BE$7:BE14)+1)","v":""},{"$f":"IF(BM$2>0,BM$2,\"\")","v":""},{"$f":"IFERROR(VLOOKUP(BF15,CoClist[[COC '#]:[COC Location]],2,FALSE),\"\")","v":""},"","",""]
[{"$nulls":14},{"$f":"IF(P16=\"\",\"\",MAX(O$7:O15)+1)","v":""},{"$f":"IF(Y2>0,Y2,\"\")","v":""},"","","","",{"$f":"IFERROR(VLOOKUP(S16,STabbr[],2,FALSE),\"\")","v":""},"","Opportunity Zone, ",{"$nulls":32},"",{"$f":"IF(BF16=\"\",\"\",MAX(BE$7:BE15)+1)","v":""},{"$f":"IF(BN$2>0,BN$2,\"\")","v":""},{"$f":"IFERROR(VLOOKUP(BF16,CoClist[[COC '#]:[COC Location]],2,FALSE),\"\")","v":""},"","",""]
[{"$nulls":14},{"$f":"IF(P17=\"\",\"\",MAX(O$7:O16)+1)","v":""},{"$f":"IF(Z2>0,Z2,\"\")","v":""},"","","","",{"$f":"IFERROR(VLOOKUP(S17,STabbr[],2,FALSE),\"\")","v":""},"","Opportunity Zone, ",{"$nulls":32},"",{"$f":"IF(BF17=\"\",\"\",MAX(BE$7:BE16)+1)","v":""},{"$f":"IF(BO$2>0,BO$2,\"\")","v":""},{"$f":"IFERROR(VLOOKUP(BF17,CoClist[[COC '#]:[COC Location]],2,FALSE),\"\")","v":""},"","",""]
[{"$nulls":14},{"$f":"IF(P18=\"\",\"\",MAX(O$7:O17)+1)","v":{"$error":"#REF!"}},{"$f":"IF(AA2>0,AA2,\"\")","v":{"$error":"#REF!"}},{"$error":"#REF!"},"","","",{"$f":"IFERROR(VLOOKUP(S18,STabbr[],2,FALSE),\"\")","v":""},"","Opportunity Zone, ",{"$nulls":32},"",{"$f":"IF(BF18=\"\",\"\",MAX(BE$7:BE17)+1)","v":""},{"$f":"IF(BP$2>0,BP$2,\"\")","v":""},{"$f":"IFERROR(VLOOKUP(BF18,CoClist[[COC '#]:[COC Location]],2,FALSE),\"\")","v":""},"","",""]
[{"$nulls":14},{"$f":"IF(P19=\"\",\"\",MAX(O$7:O18)+1)","v":{"$error":"#REF!"}},{"$f":"IF(AB2>0,AB2,\"\")","v":{"$error":"#REF!"}},{"$error":"#REF!"},"","","",{"$f":"IFERROR(VLOOKUP(S19,STabbr[],2,FALSE),\"\")","v":""},"","Opportunity Zone, ",{"$nulls":32},"",{"$f":"IF(BF19=\"\",\"\",MAX(BE$7:BE18)+1)","v":""},{"$f":"IF(BQ$2>0,BQ$2,\"\")","v":""},{"$f":"IFERROR(VLOOKUP(BF19,CoClist[[COC '#]:[COC Location]],2,FALSE),\"\")","v":""},"","",""]
[{"$nulls":14},{"$f":"IF(P20=\"\",\"\",MAX(O$7:O19)+1)","v":{"$error":"#REF!"}},{"$f":"IF(AC2>0,AC2,\"\")","v":{"$error":"#REF!"}},{"$error":"#REF!"},"","","",{"$f":"IFERROR(VLOOKUP(S20,STabbr[],2,FALSE),\"\")","v":""},"","Opportunity Zone, ",{"$nulls":32},"",{"$f":"IF(BF20=\"\",\"\",MAX(BE$7:BE19)+1)","v":""},{"$f":"IF(BR$2>0,BR$2,\"\")","v":""},{"$f":"IFERROR(VLOOKUP(BF20,CoClist[[COC '#]:[COC Location]],2,FALSE),\"\")","v":""},"","",""]
[{"$nulls":14},{"$f":"IF(P21=\"\",\"\",MAX(O$7:O20)+1)","v":""},{"$f":"IF(AE2>0,AE2,\"\")","v":""},{"$f":"IF(P21=\"\",\"\",$AD$2)","v":""},"","","",{"$f":"IFERROR(VLOOKUP(S21,STabbr[],2,FALSE),\"\")","v":""},"","Opportunity Zone, ",{"$nulls":32},"",{"$f":"IF(BF21=\"\",\"\",MAX(BE$7:BE20)+1)","v":""},{"$f":"IF(BS$2>0,BS$2,\"\")","v":""},{"$f":"IFERROR(VLOOKUP(BF21,CoClist[[COC '#]:[COC Location]],2,FALSE),\"\")","v":""},"","",""]
[{"$nulls":14},{"$f":"IF(P22=\"\",\"\",MAX(O$7:O21)+1)","v":""},{"$f":"IF(AF2>0,AF2,\"\")","v":""},{"$f":"IF(P22=\"\",\"\",$AD$2)","v":""},"","","",{"$f":"IFERROR(VLOOKUP(S22,STabbr[],2,FALSE),\"\")","v":""},"","Opportunity Zone, ",{"$nulls":32},"",{"$f":"IF(BF22=\"\",\"\",MAX(BE$7:BE21)+1)","v":""},{"$f":"IF(BT$2>0,BT$2,\"\")","v":""},{"$f":"IFERROR(VLOOKUP(BF22,CoClist[[COC '#]:[COC Location]],2,FALSE),\"\")","v":""},"","",""]
[{"$nulls":14},{"$f":"IF(P23=\"\",\"\",MAX(O$7:O22)+1)","v":""},{"$f":"IF(AG2>0,AG2,\"\")","v":""},"","","","",{"$f":"IFERROR(VLOOKUP(S23,STabbr[],2,FALSE),\"\")","v":""},"","Opportunity Zone, ",{"$nulls":32},"",{"$f":"IF(BF23=\"\",\"\",MAX(BE$7:BE22)+1)","v":""},{"$f":"IF(BU$2>0,BU$2,\"\")","v":""},{"$f":"IFERROR(VLOOKUP(BF23,CoClist[[COC '#]:[COC Location]],2,FALSE),\"\")","v":""},"","",""]
[{"$nulls":14},{"$f":"IF(P24=\"\",\"\",MAX(O$7:O23)+1)","v":""},{"$f":"IF(AH2>0,AH2,\"\")","v":""},"","","","",{"$f":"IFERROR(VLOOKUP(S24,STabbr[],2,FALSE),\"\")","v":""},"","Opportunity Zone, ",{"$nulls":32},"",{"$f":"IF(BF24=\"\",\"\",MAX(BE$7:BE23)+1)","v":""},{"$f":"IF(BV$2>0,BV$2,\"\")","v":""},{"$f":"IFERROR(VLOOKUP(BF24,CoClist[[COC '#]:[COC Location]],2,FALSE),\"\")","v":""},"","",""]
[{"$nulls":14},{"$f":"IF(P25=\"\",\"\",MAX(O$7:O24)+1)","v":""},{"$f":"IF(AI2>0,AI2,\"\")","v":""},"","","","",{"$f":"IFERROR(VLOOKUP(S25,STabbr[],2,FALSE),\"\")","v":""},"","Opportunity Zone, ",{"$nulls":32},"",{"$f":"IF(BF25=\"\",\"\",MAX(BE$7:BE24)+1)","v":""},{"$f":"IF(BW$2>0,BW$2,\"\")","v":""},{"$f":"IFERROR(VLOOKUP(BF25,CoClist[[COC '#]:[COC Location]],2,FALSE),\"\")","v":""},"","",""]
[{"$nulls":14},{"$f":"IF(P26=\"\",\"\",MAX(O$7:O25)+1)","v":""},{"$f":"IF(AJ2>0,AJ2,\"\")","v":""},"","","","",{"$f":"IFERROR(VLOOKUP(S26,STabbr[],2,FALSE),\"\")","v":""},"","Opportunity Zone, ",{"$nulls":32},"",{"$f":"IF(BF26=\"\",\"\",MAX(BE$7:BE25)+1)","v":""},{"$f":"IF(BX$2>0,BX$2,\"\")","v":""},{"$f":"IFERROR(VLOOKUP(BF26,CoClist[[COC '#]:[COC Location]],2,FALSE),\"\")","v":""},"","",""]
[{"$nulls":14},{"$f":"IF(P27=\"\",\"\",MAX(O$7:O26)+1)","v":""},{"$f":"IF(AK2>0,AK2,\"\")","v":""},"","","","",{"$f":"IFERROR(VLOOKUP(S27,STabbr[],2,FALSE),\"\")","v":""},"","Opportunity Zone, ",{"$nulls":32},"",{"$f":"IF(BF27=\"\",\"\",MAX(BE$7:BE26)+1)","v":""},{"$f":"IF(BY$2>0,BY$2,\"\")","v":""},{"$f":"IFERROR(VLOOKUP(BF27,CoClist[[COC '#]:[COC Location]],2,FALSE),\"\")","v":""},"","",""]
[{"$nulls":14},{"$f":"IF(P28=\"\",\"\",MAX(O$7:O27)+1)","v":""},{"$f":"IF(AL2>0,AL2,\"\")","v":""},"","","","",{"$f":"IFERROR(VLOOKUP(S28,STabbr[],2,FALSE),\"\")","v":""},"","Opportunity Zone, ",{"$nulls":32},"",{"$f":"IF(BF28=\"\",\"\",MAX(BE$7:BE27)+1)","v":""},{"$f":"IF(BZ$2>0,BZ$2,\"\")","v":""},{"$f":"IFERROR(VLOOKUP(BF28,CoClist[[COC '#]:[COC Location]],2,FALSE),\"\")","v":""},"","",""]
[{"$nulls":13},{"$f":"IFERROR(INDEX($Q$8:$Q$46,MATCH(ROW()-ROW($R$7),$O$8:$O$46,0)),\"\")","v":""},{"$f":"IF(P29=\"\",\"\",MAX(O$7:O28)+1)","v":""},{"$f":"IF(AM2>0,AM2,\"\")","v":""},"","","","",{"$f":"IFERROR(VLOOKUP(S29,STabbr[],2,FALSE),\"\")","v":""},"","Opportunity Zone, ",{"$nulls":32},"",{"$f":"IF(BF29=\"\",\"\",MAX(BE$7:BE28)+1)","v":""},{"$f":"IF(CA$2>0,CA$2,\"\")","v":""},{"$f":"IFERROR(VLOOKUP(BF29,CoClist[[COC '#]:[COC Location]],2,FALSE),\"\")","v":""},"","",""]
[{"$nulls":13},"",{"$f":"IF(P30=\"\",\"\",MAX(O$7:O29)+1)","v":""},{"$f":"IF(AN2>0,AN2,\"\")","v":""},"","","","",{"$f":"IFERROR(VLOOKUP(S30,STabbr[],2,FALSE),\"\")","v":""},"","Opportunity Zone, ",{"$nulls":32},"",{"$f":"IF(BF30=\"\",\"\",MAX(BE$7:BE29)+1)","v":""},{"$f":"IF(CB$2>0,CB$2,\"\")","v":""},{"$f":"IFERROR(VLOOKUP(BF30,CoClist[[COC '#]:[COC Location]],2,FALSE),\"\")","v":""},"","",""]
[{"$nulls":13},"",{"$f":"IF(P31=\"\",\"\",MAX(O$7:O30)+1)","v":{"$error":"#REF!"}},{"$f":"IF(AO2>0,AO2,\"\")","v":{"$error":"#REF!"}},{"$error":"#REF!"},"","","",{"$f":"IFERROR(VLOOKUP(S31,STabbr[],2,FALSE),\"\")","v":""},"","Opportunity Zone, ",{"$nulls":32},"",{"$f":"IF(BF31=\"\",\"\",MAX(BE$7:BE30)+1)","v":""},{"$f":"IF(CC$2>0,CC$2,\"\")","v":""},{"$f":"IFERROR(VLOOKUP(BF31,CoClist[[COC '#]:[COC Location]],2,FALSE),\"\")","v":""},"","",""]
[{"$nulls":13},"",{"$f":"IF(P32=\"\",\"\",MAX(O$7:O31)+1)","v":{"$error":"#REF!"}},{"$f":"IF(AP2>0,AP2,\"\")","v":{"$error":"#REF!"}},{"$error":"#REF!"},"","","",{"$f":"IFERROR(VLOOKUP(S32,STabbr[],2,FALSE),\"\")","v":""},"","Opportunity Zone, ",{"$nulls":32},"",{"$f":"IF(BF32=\"\",\"\",MAX(BE$7:BE31)+1)","v":""},{"$f":"IF(CD$2>0,CD$2,\"\")","v":""},{"$f":"IFERROR(VLOOKUP(BF32,CoClist[[COC '#]:[COC Location]],2,FALSE),\"\")","v":""},"","",""]
[{"$nulls":13},"",{"$f":"IF(P33=\"\",\"\",MAX(O$7:O32)+1)","v":{"$error":"#REF!"}},{"$f":"IF(AQ2>0,AQ2,\"\")","v":{"$error":"#REF!"}},{"$error":"#REF!"},"","","",{"$f":"IFERROR(VLOOKUP(S33,STabbr[],2,FALSE),\"\")","v":""},"","Opportunity Zone, ",{"$nulls":32},"",{"$f":"IF(BF33=\"\",\"\",MAX(BE$7:BE32)+1)","v":""},{"$f":"IF(CE$2>0,CE$2,\"\")","v":""},{"$f":"IFERROR(VLOOKUP(BF33,CoClist[[COC '#]:[COC Location]],2,FALSE),\"\")","v":""},"","",""]
[{"$nulls":13},"",{"$f":"IF(P34=\"\",\"\",MAX(O$7:O33)+1)","v":""},{"$f":"IF(AS2>0,AS2,\"\")","v":""},{"$f":"IF(P34=\"\",\"\",$AR$2)","v":""},"","","",{"$f":"IFERROR(VLOOKUP(S34,STabbr[],2,FALSE),\"\")","v":""},"","Opportunity Zone, ",{"$nulls":32},"",{"$f":"IF(BF34=\"\",\"\",MAX(BE$7:BE33)+1)","v":""},{"$f":"IF(CF$2>0,CF$2,\"\")","v":""},{"$f":"IFERROR(VLOOKUP(BF34,CoClist[[COC '#]:[COC Location]],2,FALSE),\"\")","v":""},"","",""]
[{"$nulls":13},"",{"$f":"IF(P35=\"\",\"\",MAX(O$7:O34)+1)","v":""},{"$f":"IF(AT2>0,AT2,\"\")","v":""},{"$f":"IF(P35=\"\",\"\",$AR$2)","v":""},"","","",{"$f":"IFERROR(VLOOKUP(S35,STabbr[],2,FALSE),\"\")","v":""},"","Opportunity Zone, ",{"$nulls":36},{"$f":"COUNTIF(BH8:BH34,\"?*\")","v":0}]
[{"$nulls":13},"",{"$f":"IF(P36=\"\",\"\",MAX(O$7:O35)+1)","v":""},{"$f":"IF(AU2>0,AU2,\"\")","v":""},"","","","",{"$f":"IFERROR(VLOOKUP(S36,STabbr[],2,FALSE),\"\")","v":""},"","Opportunity Zone, "]
[{"$nulls":13},"",{"$f":"IF(P37=\"\",\"\",MAX(O$7:O36)+1)","v":""},{"$f":"IF(AV2>0,AV2,\"\")","v":""},"","","","",{"$f":"IFERROR(VLOOKUP(S37,STabbr[],2,FALSE),\"\")","v":""},"","Opportunity Zone, "]
[{"$nulls":13},"",{"$f":"IF(P38=\"\",\"\",MAX(O$7:O37)+1)","v":""},{"$f":"IF(AW2>0,AW2,\"\")","v":""},"","","","",{"$f":"IFERROR(VLOOKUP(S38,STabbr[],2,FALSE),\"\")","v":""},"","Opportunity Zone, "]
[{"$nulls":13},"",{"$f":"IF(P39=\"\",\"\",MAX(O$7:O38)+1)","v":""},{"$f":"IF(AX2>0,AX2,\"\")","v":""},"","","","",{"$f":"IFERROR(VLOOKUP(S39,STabbr[],2,FALSE),\"\")","v":""},"","Opportunity Zone, "]
[{"$nulls":13},"",{"$f":"IF(P40=\"\",\"\",MAX(O$7:O39)+1)","v":""},{"$f":"IF(AY2>0,AY2,\"\")","v":""},"","","","",{"$f":"IFERROR(VLOOKUP(S40,STabbr[],2,FALSE),\"\")","v":""},"","Opportunity Zone, "]
[{"$nulls":13},"",{"$f":"IF(P41=\"\",\"\",MAX(O$7:O40)+1)","v":""},{"$f":"IF(AZ2>0,AZ2,\"\")","v":""},"","","","",{"$f":"IFERROR(VLOOKUP(S41,STabbr[],2,FALSE),\"\")","v":""},"","Opportunity Zone, "]
[{"$nulls":13},"",{"$f":"IF(P42=\"\",\"\",MAX(O$7:O41)+1)","v":""},{"$f":"IF(BA2>0,BA2,\"\")","v":""},"","","","",{"$f":"IFERROR(VLOOKUP(S42,STabbr[],2,FALSE),\"\")","v":""},"","Opportunity Zone, "]
[{"$nulls":13},"",{"$f":"IF(P43=\"\",\"\",MAX(O$7:O42)+1)","v":""},{"$f":"IF(BB2>0,BB2,\"\")","v":""},"","","","",{"$f":"IFERROR(VLOOKUP(S43,STabbr[],2,FALSE),\"\")","v":""},"","Opportunity Zone, "]
[{"$nulls":13},"",{"$f":"IF(P44=\"\",\"\",MAX(O$7:O43)+1)","v":{"$error":"#REF!"}},{"$f":"IF(BC2>0,BC2,\"\")","v":{"$error":"#REF!"}},{"$error":"#REF!"},"","","",{"$f":"IFERROR(VLOOKUP(S44,STabbr[],2,FALSE),\"\")","v":""},"","Opportunity Zone, "]
[{"$nulls":13},"",{"$f":"IF(P45=\"\",\"\",MAX(O$7:O44)+1)","v":{"$error":"#REF!"}},{"$f":"IF(BD2>0,BD2,\"\")","v":{"$error":"#REF!"}},{"$error":"#REF!"},"","","",{"$f":"IFERROR(VLOOKUP(S45,STabbr[],2,FALSE),\"\")","v":""},"","Opportunity Zone, "]
[{"$nulls":13},"",{"$f":"IF(P46=\"\",\"\",MAX(O$7:O45)+1)","v":{"$error":"#REF!"}},{"$f":"IF(BE2>0,BE2,\"\")","v":{"$error":"#REF!"}},{"$error":"#REF!"},"","","",{"$f":"IFERROR(VLOOKUP(S46,STabbr[],2,FALSE),\"\")","v":""},"","Opportunity Zone, "]
[{"$nulls":15},{"$f":"COUNTIF(P8:P46,\"?*\")","v":1}]

{"sheet":"Counties","index":6,"n_rows":256,"n_cols":59,"rows_kept":256,"hidden":true}
["State or equivalent","Alabama","Alaska","Arizona","Arkansas","California","Colorado","Connecticut","Delaware","District of Columbia","Florida","Georgia","Hawaiʻi","Idaho","Illinois","Indiana","Iowa","Kansas","Kentucky","Louisiana","Maine","Maryland","Massachusetts","Michigan","Minnesota","Mississippi","Missouri","Montana","Nebraska","Nevada","New Hampshire","New Jersey","New Mexico","New York","North Carolina","North Dakota","Ohio","Oklahoma","Oregon","Pennsylvania","Rhode Island","South Carolina","South Dakota","Tennessee","Texas","Utah","Vermont","Virginia","Washington","West Virginia","Wisconsin","Wyoming","*Other Territories*","American Samoa","Guam","Northern Mariana Islands","Puerto Rico","U.S. Minor Outlying Islands","Virgin Islands (U.S.)"]
["Alabama","Alabama-All","Alaska-All","Arizona-All","Arkansas-All","California-All","Colorado-All","Connecticut-All","Delaware-All","District of Columbia-All","Florida-All","Georgia-All","Hawaiʻi-All","Idaho-All","Illinois-All","Indiana-All","Iowa-All","Kansas-All","Kentucky-All","Louisiana-All","Maine-All","Maryland-All","Massachusetts-All","Michigan-All","Minnesota-All","Mississippi-All","Missouri-All","Montana-All","Nebraska-All","Nevada-All","New Hampshire-All","New Jersey-All","New Mexico-All","New York-All","North Carolina-All","North Dakota-All","Ohio-All","Oklahoma-All","Oregon-All","Pennsylvania-All","Rhode Island-All","South Carolina-All","South Dakota-All","Tennessee-All","Texas-All","Utah-All","Vermont-All","Virginia-All","Washington-All","West Virginia-All","Wisconsin-All","Wyoming-All","*Other Territories*-All","American Samoa-All","Guam-All","Northern Mariana Islands-All","Puerto Rico-All","U.S. Minor Outlying Islands-All","Virgin Islands (U.S.)-All"]
["Alaska","Autauga County","Aleutians East Borough","Apache County","Arkansas County","Alameda County","Adams County","Fairfield County","Kent County",null,"Alachua County","Appling County","Hawaii County","Ada County","Adams County","Adams County","Adair County","Allen County","Adair County","Acadia Parish","Androscoggin County","Allegany County","Barnstable County","Alcona County","Aitkin County","Adams County","Adair County","Beaverhead County","Adams County","Carson City, Consolidated Municipality of","Belknap County","Atlantic County","Bernalillo County","Albany County","Alamance County","Adams County","Adams County","Adair County","Baker County","Adams County","Bristol County","Abbeville County","Aurora County","Anderson County","Anderson County","Beaver County","Addison County","Accomack County","Adams County","Barbour County","Adams County","Albany County",null,"Eastern District",null,"Northern Islands Municipality","Adjuntas Municipality","Baker Island","Saint Croix Island"]
["Arizona","Baldwin County","Aleutians West Census Area","Cochise County","Ashley County","Alpine County","Alamosa County","Hartford County","New Castle County",null,"Baker County","Atkinson County","Honolulu, City and County of","Adams County","Alexander County","Allen County","Adams County","Anderson County","Allen County","Allen Parish","Aroostook County","Anne Arundel County","Berkshire County","Alger County","Anoka County","Alcorn County","Andrew County","Big Horn County","Antelope County","Churchill County","Carroll County","Bergen County","Catron County","Allegany County","Alexander County","Barnes County","Allen County","Alfalfa County","Benton County","Allegheny County","Kent County","Aiken County","Beadle County","Bedford County","Andrews County","Box Elder County","Bennington County","Albemarle County","Asotin County","Berkeley County","Ashland County","Big Horn County",null,"Manu'a District",null,"Rota Municipality","Aguada Municipality","Howland Island","Saint John Island"]
["Arkansas","Barbour County","Anchorage, Municipality of","Coconino County","Baxter County","Amador County","Arapahoe County","Litchfield County","Sussex County",null,"Bay County","Bacon County","Kalawao County","Bannock County","Bond County","Bartholomew County","Allamakee County","Atchison County","Anderson County","Ascension Parish","Cumberland County","Baltimore City","Bristol County","Allegan County","Becker County","Amite County","Atchison County","Blaine County","Arthur County","Clark County","Cheshire County","Burlington County","Chaves County","Bronx County","Alleghany County","Benson County","Ashland County","Atoka County","Clackamas County","Armstrong County","Newport County","Allendale County","Bennett County","Benton County","Angelina County","Cache County","Caledonia County","Alexandria, City of","Benton County","Boone County","Barron County","Campbell County",null,"Rose Atoll (Rose Island)",null,"Saipan Municipality","Aguadilla Municipality","Jarvis Island","Saint Thomas Island"]
["California","Bibb County","Bethel Census Area","Gila County","Benton County","Butte County","Archuleta County","Middlesex County",null,null,"Bradford County","Baker County","Kauai County","Bear Lake County","Boone County","Benton County","Appanoose County","Barber County","Ballard County","Assumption Parish","Franklin County","Baltimore County","Dukes County","Alpena County","Beltrami County","Attala County","Audrain County","Broadwater County","Banner County","Douglas County","Coos County","Camden County","Cibola County","Broome County","Anson County","Billings County","Ashtabula County","Beaver County","Clatsop County","Beaver County","Providence County","Anderson County","Bon Homme County","Bledsoe County","Aransas County","Carbon County","Chittenden County","Alleghany County","Chelan County","Braxton County","Bayfield County","Carbon County",null,"Swains Island",null,"Tinian Municipality","Aguas Buenas Municipality","Johnston Atoll"]
["Colorado","Blount County","Bristol Bay Borough","Graham County","Boone County","Calaveras County","Baca County","New Haven County",null,null,"Brevard County","Baldwin County","Maui County","Benewah County","Brown County","Blackford County","Audubon County","Barton County","Barren County","Avoyelles Parish","Hancock County","Calvert County","Essex County","Antrim County","Benton County","Benton County","Barry County","Carbon County","Blaine County","Elko County","Grafton County","Cape May County","Colfax County","Cattaraugus County","Ashe County","Bottineau County","Athens County","Beckham County","Columbia County","Bedford County","Washington County","Bamberg County","Brookings County","Blount County","Archer County","Daggett County","Essex County","Amelia County","Clallam County","Brooke County","Brown County","Converse County",null,"Western District",null,null,"Aibonito Municipality","Kingman Reef"]
["Connecticut","Bullock County","Denali Borough","Greenlee County","Bradley County","Colusa County","Bent County","New London County",null,null,"Broward County","Banks County",null,"Bingham County","Bureau County","Boone County","Benton County","Bourbon County","Bath County","Beauregard Parish","Kennebec County","Caroline County","Franklin County","Arenac County","Big Stone County","Bolivar County","Barton County","Carter County","Boone County","Esmeralda County","Hillsborough County","Cumberland County","Curry County","Cayuga County","Avery County","Bowman County","Auglaize County","Blaine County","Coos County","Berks County",null,"Barnwell County","Brown County","Bradley County","Armstrong County","Davis County","Franklin County","Amherst County","Clark County","Cabell County","Buffalo County","Crook County",{"$nulls":4},"Añasco Municipality","Midway Islands"]
["Delaware","Butler County","Dillingham Census Area","La Paz County","Calhoun County","Contra Costa County","Boulder County","Tolland County",null,null,"Calhoun County","Barrow County",null,"Blaine County","Calhoun County","Brown County","Black Hawk County","Brown County","Bell County","Bienville Parish","Knox County","Carroll County","Hampden County","Baraga County","Blue Earth County","Calhoun County","Bates County","Cascade County","Box Butte County","Eureka County","Merrimack County","Essex County","De Baca County","Chautauqua County","Beaufort County","Burke County","Belmont County","Bryan County","Crook County","Blair County",null,"Beaufort County","Brule County","Campbell County","Atascosa County","Duchesne County","Grand Isle County","Appomattox County","Columbia County","Calhoun County","Burnett County","Fremont County",{"$nulls":4},"Arecibo Municipality","Navassa Island"]
["District_of_Columbia","Calhoun County","Fairbanks North Star Borough","Maricopa County","Carroll County","Del Norte County","Broomfield, City and County of","Windham County",null,null,"Charlotte County","Bartow County",null,"Boise County","Carroll County","Carroll County","Boone County","Butler County","Boone County","Bossier Parish","Lincoln County","Cecil County","Hampshire County","Barry County","Brown County","Carroll County","Benton County","Chouteau County","Boyd County","Humboldt County","Rockingham County","Gloucester County","Doña Ana County","Chemung County","Bertie County","Burleigh County","Brown County","Caddo County","Curry County","Bradford County",null,"Berkeley County","Buffalo County","Cannon County","Austin County","Emery County","Lamoille County","Arlington County","Cowlitz County","Clay County","Calumet County","Goshen County",{"$nulls":4},"Arroyo Municipality","Palmyra Atoll"]
["Florida","Chambers County","Haines Borough","Mohave County","Chicot County","El Dorado County","Chaffee County",{"$nulls":3},"Citrus County","Ben Hill County",null,"Bonner County","Cass County","Cass County","Bremer County","Chase County","Bourbon County","Caddo Parish","Oxford County","Charles County","Middlesex County","Bay County","Carlton County","Chickasaw County","Bollinger County","Custer County","Brown County","Lander County","Strafford County","Hudson County","Eddy County","Chenango County","Bladen County","Cass County","Butler County","Canadian County","Deschutes County","Bucks County",null,"Calhoun County","Butte County","Carroll County","Bailey County","Garfield County","Orange County","Augusta County","Douglas County","Doddridge County","Chippewa County","Hot Springs County",{"$nulls":4},"Barceloneta Municipality","Wake Island"]
["Georgia","Cherokee County","Hoonah–Angoon Census Area","Navajo County","Clark County","Fresno County","Cheyenne County",{"$nulls":3},"Clay County","Berrien County",null,"Bonneville County","Champaign County","Clark County","Buchanan County","Chautauqua County","Boyd County","Calcasieu Parish","Penobscot County","Dorchester County","Nantucket, Town and County of","Benzie County","Carver County","Choctaw County","Boone County","Daniels County","Buffalo County","Lincoln County","Sullivan County","Hunterdon County","Grant County","Clinton County","Brunswick County","Cavalier County","Carroll County","Carter County","Douglas County","Butler County",null,"Charleston County","Campbell County","Carter County","Bandera County","Grand County","Orleans County","Bath County","Ferry County","Fayette County","Clark County","Johnson County",{"$nulls":4},"Barranquitas Municipality"]
["Hawaiʻi","Chilton County","Juneau, City and Borough of","Pima County","Clay County","Glenn County","Clear Creek County",{"$nulls":3},"Collier County","Bibb County",null,"Boundary County","Christian County","Clay County","Buena Vista County","Cherokee County","Boyle County","Caldwell Parish","Piscataquis County","Frederick County","Norfolk County","Berrien County","Cass County","Claiborne County","Buchanan County","Dawson County","Burt County","Lyon County",null,"Mercer County","Guadalupe County","Columbia County","Buncombe County","Dickey County","Champaign County","Cherokee County","Gilliam County","Cambria County",null,"Cherokee County","Charles Mix County","Cheatham County","Bastrop County","Iron County","Rutland County","Bedford County","Franklin County","Gilmer County","Columbia County","Laramie County",{"$nulls":4},"Bayamón Municipality"]
["Idaho","Choctaw County","Kenai Peninsula Borough","Pinal County","Cleburne County","Humboldt County","Conejos County",{"$nulls":3},"Columbia County","Bleckley County",null,"Butte County","Clark County","Clinton County","Butler County","Cheyenne County","Bracken County","Cameron Parish","Sagadahoc County","Garrett County","Plymouth County","Branch County","Chippewa County","Clarke County","Butler County","Deer Lodge County","Butler County","Mineral County",null,"Middlesex County","Harding County","Cortland County","Burke County","Divide County","Clark County","Choctaw County","Grant County","Cameron County",null,"Chester County","Clark County","Chester County","Baylor County","Juab County","Washington County","Bland County","Garfield County","Grant County","Crawford County","Lincoln County",{"$nulls":4},"Cabo Rojo Municipality"]
["Illinois","Clarke County","Ketchikan Gateway Borough","Santa Cruz County","Cleveland County","Imperial County","Costilla County",{"$nulls":3},"DeSoto County","Brantley County",null,"Camas County","Clay County","Crawford County","Calhoun County","Clark County","Breathitt County","Catahoula Parish","Somerset County","Harford County","Suffolk County","Calhoun County","Chisago County","Clay County","Caldwell County","Fallon County","Cass County","Nye County",null,"Monmouth County","Hidalgo County","Delaware County","Cabarrus County","Dunn County","Clermont County","Cimarron County","Harney County","Carbon County",null,"Chesterfield County","Clay County","Claiborne County","Bee County","Kane County","Windham County","Botetourt County","Grant County","Greenbrier County","Dane County","Natrona County",{"$nulls":4},"Caguas Municipality"]
["Indiana","Clay County","Kodiak Island Borough","Yavapai County","Columbia County","Inyo County","Crowley County",{"$nulls":3},"Dixie County","Brooks County",null,"Canyon County","Clinton County","Daviess County","Carroll County","Clay County","Breckinridge County","Claiborne Parish","Waldo County","Howard County","Worcester County","Cass County","Clay County","Coahoma County","Callaway County","Fergus County","Cedar County","Pershing County",null,"Morris County","Lea County","Dutchess County","Caldwell County","Eddy County","Clinton County","Cleveland County","Hood River County","Centre County",null,"Clarendon County","Codington County","Clay County","Bell County","Millard County","Windsor County","Bristol, City of","Grays Harbor County","Hampshire County","Dodge County","Niobrara County",{"$nulls":4},"Camuy Municipality"]
["Iowa","Cleburne County","Kusilvak Census Area","Yuma County","Conway County","Kern County","Custer County",{"$nulls":3},"Duval County","Bryan County",null,"Caribou County","Coles County","Dearborn County","Cass County","Cloud County","Bullitt County","Concordia Parish","Washington County","Kent County",null,"Charlevoix County","Clearwater County","Copiah County","Camden County","Flathead County","Chase County","Storey County",null,"Ocean County","Lincoln County","Erie County","Camden County","Emmons County","Columbiana County","Coal County","Jackson County","Chester County",null,"Colleton County","Corson County","Cocke County","Bexar County","Morgan County",null,"Brunswick County","Island County","Hancock County","Door County","Park County",{"$nulls":4},"Canóvanas Municipality"]
["Kansas","Coffee County","Lake and Peninsula Borough",null,"Craighead County","Kings County","Delta County",{"$nulls":3},"Escambia County","Bulloch County",null,"Cassia County","Cook County","Decatur County","Cedar County","Coffey County","Butler County","De Soto Parish","York County","Montgomery County",null,"Cheboygan County","Cook County","Covington County","Cape Girardeau County","Gallatin County","Cherry County","Washoe County",null,"Passaic County","Los Alamos County","Essex County","Carteret County","Foster County","Coshocton County","Comanche County","Jefferson County","Clarion County",null,"Darlington County","Custer County","Coffee County","Blanco County","Piute County",null,"Buchanan County","Jefferson County","Hardy County","Douglas County","Platte County",{"$nulls":4},"Carolina Municipality"]
["Kentucky","Colbert County","Matanuska-Susitna Borough",null,"Crawford County","Lake County","Denver, City and County of",{"$nulls":3},"Flagler County","Burke County",null,"Clark County","Crawford County","DeKalb County","Cerro Gordo County","Comanche County","Caldwell County","East Baton Rouge Parish",null,"Prince George's County",null,"Chippewa County","Cottonwood County","DeSoto County","Carroll County","Garfield County","Cheyenne County","White Pine County",null,"Salem County","Luna County","Franklin County","Caswell County","Golden Valley County","Crawford County","Cotton County","Josephine County","Clearfield County",null,"Dillon County","Davison County","Crockett County","Borden County","Rich County",null,"Buckingham County","King County","Harrison County","Dunn County","Sheridan County",{"$nulls":4},"Cataño Municipality"]
["Louisiana","Conecuh County","Nome Census Area",null,"Crittenden County","Lassen County","Dolores County",{"$nulls":3},"Franklin County","Butts County",null,"Clearwater County","Cumberland County","Delaware County","Cherokee County","Cowley County","Calloway County","East Carroll Parish",null,"Queen Anne's County",null,"Clare County","Crow Wing County","Forrest County","Carter County","Glacier County","Clay County",null,null,"Somerset County","McKinley County","Fulton County","Catawba County","Grand Forks County","Cuyahoga County","Craig County","Klamath County","Clinton County",null,"Dorchester County","Day County","Cumberland County","Bosque County","Salt Lake County",null,"Buena Vista, City of","Kitsap County","Jackson County","Eau Claire County","Sublette County",{"$nulls":4},"Cayey Municipality"]
["Maine","Coosa County","North Slope Borough",null,"Cross County","Los Angeles County","Douglas County",{"$nulls":3},"Gadsden County","Calhoun County",null,"Custer County","De Witt County","Dubois County","Chickasaw County","Crawford County","Campbell County","East Feliciana Parish",null,"Somerset County",null,"Clinton County","Dakota County","Franklin County","Cass County","Golden Valley County","Colfax County",null,null,"Sussex County","Mora County","Genesee County","Chatham County","Grant County","Darke County","Creek County","Lake County","Columbia County",null,"Edgefield County","Deuel County","Davidson County","Bowie County","San Juan County",null,"Campbell County","Kittitas County","Jefferson County","Florence County","Sweetwater County",{"$nulls":4},"Ceiba Municipality"]
["Maryland","Covington County","Northwest Arctic Borough",null,"Dallas County","Madera County","Eagle County",{"$nulls":3},"Gilchrist County","Camden County",null,"Elmore County","DeKalb County","Elkhart County","Clarke County","Decatur County","Carlisle County","Evangeline Parish",null,"St. Mary's County",null,"Crawford County","Dodge County","George County","Cedar County","Granite County","Cuming County",null,null,"Union County","Otero County","Greene County","Cherokee County","Griggs County","Defiance County","Custer County","Lane County","Crawford County",null,"Fairfield County","Dewey County","Decatur County","Brazoria County","Sanpete County",null,"Caroline County","Klickitat County","Kanawha County","Fond du Lac County","Teton County",{"$nulls":4},"Ciales Municipality"]
["Massachusetts","Crenshaw County","Petersburg Borough",null,"Desha County","Marin County","El Paso County",{"$nulls":3},"Glades County","Candler County",null,"Franklin County","Douglas County","Fayette County","Clay County","Dickinson County","Carroll County","Franklin Parish",null,"Talbot County",null,"Delta County","Douglas County","Greene County","Chariton County","Hill County","Custer County",null,null,"Warren County","Quay County","Hamilton County","Chowan County","Hettinger County","Delaware County","Delaware County","Lincoln County","Cumberland County",null,"Florence County","Douglas County","DeKalb County","Brazos County","Sevier County",null,"Carroll County","Lewis County","Lewis County","Forest County","Uinta County",{"$nulls":4},"Cidra Municipality"]
["Michigan","Cullman County","Prince of Wales – Hyder Census Area",null,"Drew County","Mariposa County","Elbert County",{"$nulls":3},"Gulf County","Carroll County",null,"Fremont County","DuPage County","Floyd County","Clayton County","Doniphan County","Carter County","Grant Parish",null,"Washington County",null,"Dickinson County","Faribault County","Grenada County","Christian County","Jefferson County","Dakota County",{"$nulls":3},"Rio Arriba County","Herkimer County","Clay County","Kidder County","Erie County","Dewey County","Linn County","Dauphin County",null,"Georgetown County","Edmunds County","Dickson County","Brewster County","Summit County",null,"Charles City County","Lincoln County","Lincoln County","Grant County","Washakie County",{"$nulls":4},"Coamo Municipality"]
["Minnesota","Dale County","Sitka, City and Borough of",null,"Faulkner County","Mendocino County","Fremont County",{"$nulls":3},"Hamilton County","Catoosa County",null,"Gem County","Edgar County","Fountain County","Clinton County","Douglas County","Casey County","Iberia Parish",null,"Wicomico County",null,"Eaton County","Fillmore County","Hancock County","Clark County","Judith Basin County","Dawes County",{"$nulls":3},"Roosevelt County","Jefferson County","Cleveland County","LaMoure County","Fairfield County","Ellis County","Malheur County","Delaware County",null,"Greenville County","Fall River County","Dyer County","Briscoe County","Tooele County",null,"Charlotte County","Mason County","Logan County","Green County","Weston County",{"$nulls":4},"Comerío Municipality"]
["Mississippi","Dallas County","Skagway, Municipality of",null,"Franklin County","Merced County","Garfield County",{"$nulls":3},"Hardee County","Charlton County",null,"Gooding County","Edwards County","Franklin County","Crawford County","Edwards County","Christian County","Iberville Parish",null,"Worcester County",null,"Emmet County","Freeborn County","Harrison County","Clay County","Lake County","Dawson County",{"$nulls":3},"San Juan County","Kings County","Columbus County","Logan County","Fayette County","Garfield County","Marion County","Elk County",null,"Greenwood County","Faulk County","Fayette County","Brooks County","Uintah County",null,"Charlottesville, City of","Okanogan County","Marion County","Green Lake County",{"$nulls":5},"Corozal Municipality"]
["Missouri","DeKalb County","Southeast Fairbanks Census Area",null,"Fulton County","Modoc County","Gilpin County",{"$nulls":3},"Hendry County","Chatham County",null,"Idaho County","Effingham County","Fulton County","Dallas County","Elk County","Clark County","Jackson Parish",{"$nulls":3},"Genesee County","Goodhue County","Hinds County","Clinton County","Lewis and Clark County","Deuel County",{"$nulls":3},"San Miguel County","Lewis County","Craven County","McHenry County","Franklin County","Garvin County","Morrow County","Erie County",null,"Hampton County","Grant County","Fentress County","Brown County","Utah County",null,"Chesapeake, City of","Pacific County","Marshall County","Iowa County",{"$nulls":5},"Culebra Municipality"]
["Montana","Elmore County","Valdez–Cordova Census Area",null,"Garland County","Mono County","Grand County",{"$nulls":3},"Hernando County","Chattahoochee County",null,"Jefferson County","Fayette County","Gibson County","Davis County","Ellis County","Clay County","Jefferson Davis Parish",{"$nulls":3},"Gladwin County","Grant County","Holmes County","Cole County","Liberty County","Dixon County",{"$nulls":3},"Sandoval County","Livingston County","Cumberland County","McIntosh County","Fulton County","Grady County","Multnomah County","Fayette County",null,"Horry County","Gregory County","Franklin County","Burleson County","Wasatch County",null,"Chesterfield County","Pend Oreille County","Mason County","Iron County",{"$nulls":5},"Dorado Municipality"]
["Nebraska","Escambia County","Wrangell, City and Borough of",null,"Grant County","Monterey County","Gunnison County",{"$nulls":3},"Highlands County","Chattooga County",null,"Jerome County","Ford County","Grant County","Decatur County","Ellsworth County","Clinton County","Jefferson Parish",{"$nulls":3},"Gogebic County","Hennepin County","Humphreys County","Cooper County","Lincoln County","Dodge County",{"$nulls":3},"Santa Fe County","Madison County","Currituck County","McKenzie County","Gallia County","Grant County","Polk County","Forest County",null,"Jasper County","Haakon County","Gibson County","Burnet County","Washington County",null,"Clarke County","Pierce County","McDowell County","Jackson County",{"$nulls":5},"Fajardo Municipality"]
["Nevada","Etowah County","Yakutat, City and Borough of",null,"Greene County","Napa County","Hinsdale County",{"$nulls":3},"Hillsborough County","Cherokee County",null,"Kootenai County","Franklin County","Greene County","Delaware County","Finney County","Crittenden County","Lafayette Parish",{"$nulls":3},"Grand Traverse County","Houston County","Issaquena County","Crawford County","Madison County","Douglas County",{"$nulls":3},"Sierra County","Monroe County","Dare County","McLean County","Geauga County","Greer County","Sherman County","Franklin County",null,"Kershaw County","Hamlin County","Giles County","Caldwell County","Wayne County",null,"Colonial Heights, City of","San Juan County","Mercer County","Jefferson County",{"$nulls":5},"Florida Municipality"]
["New_Hampshire","Fayette County","Yukon–Koyukuk Census Area",null,"Hempstead County","Nevada County","Huerfano County",{"$nulls":3},"Holmes County","Clarke County",null,"Latah County","Fulton County","Hamilton County","Des Moines County","Ford County","Cumberland County","Lafourche Parish",{"$nulls":3},"Gratiot County","Hubbard County","Itawamba County","Dade County","McCone County","Dundy County",{"$nulls":3},"Socorro County","Montgomery County","Davidson County","Mercer County","Greene County","Harmon County","Tillamook County","Fulton County",null,"Lancaster County","Hand County","Grainger County","Calhoun County","Weber County",null,"Covington, City of","Skagit County","Mineral County","Juneau County",{"$nulls":5},"Guánica Municipality"]
["New_Jersey","Franklin County",null,null,"Hot Spring County","Orange County","Jackson County",{"$nulls":3},"Indian River County","Clay County",null,"Lemhi County","Gallatin County","Hancock County","Dickinson County","Franklin County","Daviess County","LaSalle Parish",{"$nulls":3},"Hillsdale County","Isanti County","Jackson County","Dallas County","Meagher County","Fillmore County",{"$nulls":3},"Taos County","Nassau County","Davie County","Morton County","Guernsey County","Harper County","Umatilla County","Greene County",null,"Laurens County","Hanson County","Greene County","Callahan County",null,null,"Craig County","Skamania County","Mingo County","Kenosha County",{"$nulls":5},"Guayama Municipality"]
["New_Mexico","Geneva County",null,null,"Howard County","Placer County","Jefferson County",{"$nulls":3},"Jackson County","Clayton County",null,"Lewis County","Greene County","Harrison County","Dubuque County","Geary County","Edmonson County","Lincoln Parish",{"$nulls":3},"Houghton County","Itasca County","Jasper County","Daviess County","Mineral County","Franklin County",{"$nulls":3},"Torrance County","New York County","Duplin County","Mountrail County","Hamilton County","Haskell County","Union County","Huntingdon County",null,"Lee County","Harding County","Grundy County","Cameron County",null,null,"Culpeper County","Snohomish County","Monongalia County","Kewaunee County",{"$nulls":5},"Guayanilla Municipality"]
["New_York","Greene County",null,null,"Independence County","Plumas County","Kiowa County",{"$nulls":3},"Jefferson County","Clinch County",null,"Lincoln County","Grundy County","Hendricks County","Emmet County","Gove County","Elliott County","Livingston Parish",{"$nulls":3},"Huron County","Jackson County","Jefferson County","DeKalb County","Missoula County","Frontier County",{"$nulls":3},"Union County","Niagara County","Durham County","Nelson County","Hancock County","Hughes County","Wallowa County","Indiana County",null,"Lexington County","Hughes County","Hamblen County","Camp County",null,null,"Cumberland County","Spokane County","Monroe County","La Crosse County",{"$nulls":5},"Guaynabo Municipality"]
["North_Carolina","Hale County",null,null,"Izard County","Riverside County","Kit Carson County",{"$nulls":3},"Lafayette County","Cobb County",null,"Madison County","Hamilton County","Henry County","Fayette County","Graham County","Estill County","Madison Parish",{"$nulls":3},"Ingham County","Kanabec County","Jefferson Davis County","Dent County","Musselshell County","Furnas County",{"$nulls":3},"Valencia County","Oneida County","Edgecombe County","Oliver County","Hardin County","Jackson County","Wasco County","Jefferson County",null,"Marion County","Hutchinson County","Hamilton County","Carson County",null,null,"Danville, City of","Stevens County","Morgan County","Lafayette County",{"$nulls":5},"Gurabo Municipality"]
["North_Dakota","Henry County",null,null,"Jackson County","Sacramento County","La Plata County",{"$nulls":3},"Lake County","Coffee County",null,"Minidoka County","Hancock County","Howard County","Floyd County","Grant County","Fayette County","Morehouse Parish",{"$nulls":3},"Ionia County","Kandiyohi County","Jones County","Douglas County","Park County","Gage County",{"$nulls":4},"Onondaga County","Forsyth County","Pembina County","Harrison County","Jefferson County","Washington County","Juniata County",null,"Marlboro County","Hyde County","Hancock County","Cass County",null,null,"Dickenson County","Thurston County","Nicholas County","Langlade County",{"$nulls":5},"Hatillo Municipality"]
["Ohio","Houston County",null,null,"Jefferson County","San Benito County","Lake County",{"$nulls":3},"Lee County","Colquitt County",null,"Nez Perce County","Hardin County","Huntington County","Franklin County","Gray County","Fleming County","Natchitoches Parish",{"$nulls":3},"Iosco County","Kittson County","Kemper County","Dunklin County","Petroleum County","Garden County",{"$nulls":4},"Ontario County","Franklin County","Pierce County","Henry County","Johnston County","Wheeler County","Lackawanna County",null,"McCormick County","Jackson County","Hardeman County","Castro County",null,null,"Dinwiddie County","Wahkiakum County","Ohio County","Lincoln County",{"$nulls":5},"Hormigueros Municipality"]
["Oklahoma","Jackson County",null,null,"Johnson County","San Bernardino County","Larimer County",{"$nulls":3},"Leon County","Columbia County",null,"Oneida County","Henderson County","Jackson County","Fremont County","Greeley County","Floyd County","Orleans Parish",{"$nulls":3},"Iron County","Koochiching County","Lafayette County","Franklin County","Phillips County","Garfield County",{"$nulls":4},"Orange County","Gaston County","Ramsey County","Highland County","Kay County","Yamhill County","Lancaster County",null,"Newberry County","Jerauld County","Hardin County","Chambers County",null,null,"Emporia, City of","Walla Walla County","Pendleton County","Manitowoc County",{"$nulls":5},"Humacao Municipality"]
["Oregon","Jefferson County",null,null,"Lafayette County","San Diego County","Las Animas County",{"$nulls":3},"Levy County","Cook County",null,"Owyhee County","Henry County","Jasper County","Greene County","Greenwood County","Franklin County","Ouachita Parish",{"$nulls":3},"Isabella County","Lac qui Parle County","Lamar County","Gasconade County","Pondera County","Gosper County",{"$nulls":4},"Orleans County","Gates County","Ransom County","Hocking County","Kingfisher County",null,"Lawrence County",null,"Oconee County","Jones County","Hawkins County","Cherokee County",null,null,"Essex County","Whatcom County","Pleasants County","Marathon County",{"$nulls":5},"Isabela Municipality"]
["Pennsylvania","Lamar County",null,null,"Lawrence County","San Francisco, City and County of","Lincoln County",{"$nulls":3},"Liberty County","Coweta County",null,"Payette County","Iroquois County","Jay County","Grundy County","Hamilton County","Fulton County","Plaquemines Parish",{"$nulls":3},"Jackson County","Lake County","Lauderdale County","Gentry County","Powder River County","Grant County",{"$nulls":4},"Oswego County","Graham County","Renville County","Holmes County","Kiowa County",null,"Lebanon County",null,"Orangeburg County","Kingsbury County","Haywood County","Childress County",null,null,"Fairfax County","Whitman County","Pocahontas County","Marinette County",{"$nulls":5},"Jayuya Municipality"]
["Rhode_Island","Lauderdale County",null,null,"Lee County","San Joaquin County","Logan County",{"$nulls":3},"Madison County","Crawford County",null,"Power County","Jackson County","Jefferson County","Guthrie County","Harper County","Gallatin County","Pointe Coupee Parish",{"$nulls":3},"Kalamazoo County","Lake of the Woods County","Lawrence County","Greene County","Powell County","Greeley County",{"$nulls":4},"Otsego County","Granville County","Richland County","Huron County","Latimer County",null,"Lehigh County",null,"Pickens County","Lake County","Henderson County","Clay County",null,null,"Fairfax, City of","Yakima County","Preston County","Marquette County",{"$nulls":5},"Juana Díaz Municipality"]
["South_Carolina","Lawrence County",null,null,"Lincoln County","San Luis Obispo County","Mesa County",{"$nulls":3},"Manatee County","Crisp County",null,"Shoshone County","Jasper County","Jennings County","Hamilton County","Harvey County","Garrard County","Rapides Parish",{"$nulls":3},"Kalkaska County","Le Sueur County","Leake County","Grundy County","Prairie County","Hall County",{"$nulls":4},"Putnam County","Greene County","Rolette County","Jackson County","Le Flore County",null,"Luzerne County",null,"Richland County","Lawrence County","Henry County","Cochran County",null,null,"Falls Church, City of",null,"Putnam County","Menominee County",{"$nulls":5},"Juncos Municipality"]
["South_Dakota","Lee County",null,null,"Little River County","San Mateo County","Mineral County",{"$nulls":3},"Marion County","Dade County",null,"Teton County","Jefferson County","Johnson County","Hancock County","Haskell County","Grant County","Red River Parish",{"$nulls":3},"Kent County","Lincoln County","Lee County","Harrison County","Ravalli County","Hamilton County",{"$nulls":4},"Queens County","Guilford County","Sargent County","Jefferson County","Lincoln County",null,"Lycoming County",null,"Saluda County","Lincoln County","Hickman County","Coke County",null,null,"Fauquier County",null,"Raleigh County","Milwaukee County",{"$nulls":5},"Lajas Municipality"]
["Tennessee","Limestone County",null,null,"Logan County","Santa Barbara County","Moffat County",{"$nulls":3},"Martin County","Dawson County",null,"Twin Falls County","Jersey County","Knox County","Hardin County","Hodgeman County","Graves County","Richland Parish",{"$nulls":3},"Keweenaw County","Lyon County","Leflore County","Henry County","Richland County","Harlan County",{"$nulls":4},"Rensselaer County","Halifax County","Sheridan County","Knox County","Logan County",null,"McKean County",null,"Spartanburg County","Lyman County","Houston County","Coleman County",null,null,"Floyd County",null,"Randolph County","Monroe County",{"$nulls":5},"Lares Municipality"]
["Texas","Lowndes County",null,null,"Lonoke County","Santa Clara County","Montezuma County",{"$nulls":3},"Miami-Dade County","Decatur County",null,"Valley County","Jo Daviess County","Kosciusko County","Harrison County","Jackson County","Grayson County","Sabine Parish",{"$nulls":3},"Lake County","Mahnomen County","Lincoln County","Hickory County","Roosevelt County","Hayes County",{"$nulls":4},"Richmond County","Harnett County","Sioux County","Lake County","Love County",null,"Mercer County",null,"Sumter County","Marshall County","Humphreys County","Collin County",null,null,"Fluvanna County",null,"Ritchie County","Oconto County",{"$nulls":5},"Las Marías Municipality"]
["Utah","Macon County",null,null,"Madison County","Santa Cruz County","Montrose County",{"$nulls":3},"Monroe County","DeKalb County",null,"Washington County","Johnson County","LaGrange County","Henry County","Jefferson County","Green County","St. Bernard Parish",{"$nulls":3},"Lapeer County","Marshall County","Lowndes County","Holt County","Rosebud County","Hitchcock County",{"$nulls":4},"Rockland County","Haywood County","Slope County","Lawrence County","Major County",null,"Mifflin County",null,"Union County","McCook County","Jackson County","Collingsworth County",null,null,"Franklin County",null,"Roane County","Oneida County",{"$nulls":5},"Las Piedras Municipality"]
["Vermont","Madison County",null,null,"Marion County","Shasta County","Morgan County",{"$nulls":3},"Nassau County","Dodge County",null,null,"Kane County","Lake County","Howard County","Jewell County","Greenup County","St. Charles Parish",{"$nulls":3},"Leelanau County","Martin County","Madison County","Howard County","Sanders County","Holt County",{"$nulls":4},"Saratoga County","Henderson County","Stark County","Licking County","Marshall County",null,"Monroe County",null,"Williamsburg County","McPherson County","Jefferson County","Colorado County",null,null,"Franklin, City of",null,"Summers County","Outagamie County",{"$nulls":5},"Loíza Municipality"]
["Virginia","Marengo County",null,null,"Miller County","Sierra County","Otero County",{"$nulls":3},"Okaloosa County","Dooly County",null,null,"Kankakee County","LaPorte County","Humboldt County","Johnson County","Hancock County","St. Helena Parish",{"$nulls":3},"Lenawee County","McLeod County","Marion County","Howell County","Sheridan County","Hooker County",{"$nulls":4},"Schenectady County","Hertford County","Steele County","Logan County","Mayes County",null,"Montgomery County",null,"York County","Meade County","Johnson County","Comal County",null,null,"Frederick County",null,"Taylor County","Ozaukee County",{"$nulls":5},"Luquillo Municipality"]
["Washington","Marion County",null,null,"Mississippi County","Siskiyou County","Ouray County",{"$nulls":3},"Okeechobee County","Dougherty County",null,null,"Kendall County","Lawrence County","Ida County","Kearny County","Hardin County","St. James Parish",{"$nulls":3},"Livingston County","Meeker County","Marshall County","Iron County","Silver Bow County","Howard County",{"$nulls":4},"Schoharie County","Hoke County","Stutsman County","Lorain County","McClain County",null,"Montour County",null,null,"Mellette County","Knox County","Comanche County",null,null,"Fredericksburg, City of",null,"Tucker County","Pepin County",{"$nulls":5},"Manatí Municipality"]
["West_Virginia","Marshall County",null,null,"Monroe County","Solano County","Park County",{"$nulls":3},"Orange County","Douglas County",null,null,"Knox County","Madison County","Iowa County","Kingman County","Harlan County","St. John the Baptist Parish",{"$nulls":3},"Luce County","Mille Lacs County","Monroe County","Jackson County","Stillwater County","Jefferson County",{"$nulls":4},"Schuyler County","Hyde County","Towner County","Lucas County","McCurtain County",null,"Northampton County",null,null,"Miner County","Lake County","Concho County",null,null,"Galax, City of",null,"Tyler County","Pierce County",{"$nulls":5},"Maricao Municipality"]
["Wisconsin","Mobile County",null,null,"Montgomery County","Sonoma County","Phillips County",{"$nulls":3},"Osceola County","Early County",null,null,"Lake County","Marion County","Jackson County","Kiowa County","Harrison County","St. Landry Parish",{"$nulls":3},"Mackinac County","Morrison County","Montgomery County","Jasper County","Sweet Grass County","Johnson County",{"$nulls":4},"Seneca County","Iredell County","Traill County","Madison County","McIntosh County",null,"Northumberland County",null,null,"Minnehaha County","Lauderdale County","Cooke County",null,null,"Giles County",null,"Upshur County","Polk County",{"$nulls":5},"Maunabo Municipality"]
["Wyoming","Monroe County",null,null,"Nevada County","Stanislaus County","Pitkin County",{"$nulls":3},"Palm Beach County","Echols County",null,null,"LaSalle County","Marshall County","Jasper County","Labette County","Hart County","St. Martin Parish",{"$nulls":3},"Macomb County","Mower County","Neshoba County","Jefferson County","Teton County","Kearney County",{"$nulls":4},"St. Lawrence County","Jackson County","Walsh County","Mahoning County","Murray County",null,"Perry County",null,null,"Moody County","Lawrence County","Coryell County",null,null,"Gloucester County",null,"Wayne County","Portage County",{"$nulls":5},"Mayagüez Municipality"]
["*Other_Territories*","Montgomery County",null,null,"Newton County","Sutter County","Prowers County",{"$nulls":3},"Pasco County","Effingham County",null,null,"Lawrence County","Martin County","Jefferson County","Lane County","Henderson County","St. Mary Parish",{"$nulls":3},"Manistee County","Murray County","Newton County","Johnson County","Toole County","Keith County",{"$nulls":4},"Steuben County","Johnston County","Ward County","Marion County","Muskogee County",null,"Philadelphia County",null,null,"Oglala Lakota County","Lewis County","Cottle County",null,null,"Goochland County",null,"Webster County","Price County",{"$nulls":5},"Moca Municipality"]
["American_Samoa","Morgan County",null,null,"Ouachita County","Tehama County","Pueblo County",{"$nulls":3},"Pinellas County","Elbert County",null,null,"Lee County","Miami County","Johnson County","Leavenworth County","Henry County","St. Tammany Parish",{"$nulls":3},"Marquette County","Nicollet County","Noxubee County","Knox County","Treasure County","Keya Paha County",{"$nulls":4},"Suffolk County","Jones County","Wells County","Medina County","Noble County",null,"Pike County",null,null,"Pennington County","Lincoln County","Crane County",null,null,"Grayson County",null,"Wetzel County","Racine County",{"$nulls":5},"Morovis Municipality"]
["Guam","Perry County",null,null,"Perry County","Trinity County","Rio Blanco County",{"$nulls":3},"Polk County","Emanuel County",null,null,"Livingston County","Monroe County","Jones County","Lincoln County","Hickman County","Tangipahoa Parish",{"$nulls":3},"Mason County","Nobles County","Oktibbeha County","Laclede County","Valley County","Kimball County",{"$nulls":4},"Sullivan County","Lee County","Williams County","Meigs County","Nowata County",null,"Potter County",null,null,"Perkins County","Loudon County","Crockett County",null,null,"Greene County",null,"Wirt County","Richland County",{"$nulls":5},"Naguabo Municipality"]
["Northern_Mariana_Islands","Pickens County",null,null,"Phillips County","Tulare County","Rio Grande County",{"$nulls":3},"Putnam County","Evans County",null,null,"Logan County","Montgomery County","Keokuk County","Linn County","Hopkins County","Tensas Parish",{"$nulls":3},"Mecosta County","Norman County","Panola County","Lafayette County","Wheatland County","Knox County",{"$nulls":4},"Tioga County","Lenoir County",null,"Mercer County","Okfuskee County",null,"Schuylkill County",null,null,"Potter County","Macon County","Crosby County",null,null,"Greensville County",null,"Wood County","Rock County",{"$nulls":5},"Naranjito Municipality"]
["Puerto_Rico","Pike County",null,null,"Pike County","Tuolumne County","Routt County",{"$nulls":3},"Santa Rosa County","Fannin County",null,null,"Macon County","Morgan County","Kossuth County","Logan County","Jackson County","Terrebonne Parish",{"$nulls":3},"Menominee County","Olmsted County","Pearl River County","Lawrence County","Wibaux County","Lancaster County",{"$nulls":4},"Tompkins County","Lincoln County",null,"Miami County","Oklahoma County",null,"Snyder County",null,null,"Roberts County","Madison County","Culberson County",null,null,"Halifax County",null,"Wyoming County","Rusk County",{"$nulls":5},"Orocovis Municipality"]
["U.S._Minor_Outlying_Islands","Randolph County",null,null,"Poinsett County","Ventura County","Saguache County",{"$nulls":3},"Sarasota County","Fayette County",null,null,"Macoupin County","Newton County","Lee County","Lyon County","Jefferson County","Union Parish",{"$nulls":3},"Midland County","Otter Tail County","Perry County","Lewis County","Yellowstone County","Lincoln County",{"$nulls":4},"Ulster County","Macon County",null,"Monroe County","Okmulgee County",null,"Somerset County",null,null,"Sanborn County","Marion County","Dallam County",null,null,"Hampton, City of",null,null,"Sauk County",{"$nulls":5},"Patillas Municipality"]
["Virgin_Islands_(U.S.)","Russell County",null,null,"Polk County","Yolo County","San Juan County",{"$nulls":3},"Seminole County","Floyd County",null,null,"Madison County","Noble County","Linn County","Marion County","Jessamine County","Vermilion Parish",{"$nulls":3},"Missaukee County","Pennington County","Pike County","Lincoln County",null,"Logan County",{"$nulls":4},"Warren County","Madison County",null,"Montgomery County","Osage County",null,"Sullivan County",null,null,"Spink County","Marshall County","Dallas County",null,null,"Hanover County",null,null,"Sawyer County",{"$nulls":5},"Peñuelas Municipality"]
[{"$nulls":4},"Pope County","Yuba County","San Miguel County",{"$nulls":3},"St. Johns County","Forsyth County",null,null,"Marion County","Ohio County","Louisa County","Marshall County","Johnson County","Vernon Parish",{"$nulls":3},"Monroe County","Pine County","Pontotoc County","Linn County",null,"Loup County",{"$nulls":4},"Washington County","Martin County",null,"Morgan County","Ottawa County",null,"Susquehanna County",null,null,"Stanley County","Maury County","Dawson County",null,null,"Harrisonburg, City of",null,null,"Shawano County",{"$nulls":5},"Ponce Municipality"]
[{"$nulls":4},"Prairie County",null,"Sedgwick County",{"$nulls":3},"St. Lucie County","Franklin County",null,null,"Marshall County","Orange County","Lucas County","McPherson County","Kenton County","Washington Parish",{"$nulls":3},"Montcalm County","Pipestone County","Prentiss County","Livingston County",null,"Madison County",{"$nulls":4},"Wayne County","McDowell County",null,"Morrow County","Pawnee County",null,"Tioga County",null,null,"Sully County","McMinn County","Deaf Smith County",null,null,"Henrico County",null,null,"Sheboygan County",{"$nulls":5},"Quebradillas Municipality"]
[{"$nulls":4},"Pulaski County",null,"Summit County",{"$nulls":3},"Sumter County","Fulton County",null,null,"Mason County","Owen County","Lyon County","Meade County","Knott County","Webster Parish",{"$nulls":3},"Montmorency County","Polk County","Quitman County","Macon County",null,"McPherson County",{"$nulls":4},"Westchester County","Mecklenburg County",null,"Muskingum County","Payne County",null,"Union County",null,null,"Todd County","McNairy County","Delta County",null,null,"Henry County",null,null,"St. Croix County",{"$nulls":5},"Rincón Municipality"]
[{"$nulls":4},"Randolph County",null,"Teller County",{"$nulls":3},"Suwannee County","Gilmer County",null,null,"Massac County","Parke County","Madison County","Miami County","Knox County","West Baton Rouge Parish",{"$nulls":3},"Muskegon County","Pope County","Rankin County","Madison County",null,"Merrick County",{"$nulls":4},"Wyoming County","Mitchell County",null,"Noble County","Pittsburg County",null,"Venango County",null,null,"Tripp County","Meigs County","Denton County",null,null,"Highland County",null,null,"Taylor County",{"$nulls":5},"Río Grande Municipality"]
[{"$nulls":4},"Saline County",null,"Washington County",{"$nulls":3},"Taylor County","Glascock County",null,null,"McDonough County","Perry County","Mahaska County","Mitchell County","LaRue County","West Carroll Parish",{"$nulls":3},"Newaygo County","Ramsey County","Scott County","Maries County",null,"Morrill County",{"$nulls":4},"Yates County","Montgomery County",null,"Ottawa County","Pontotoc County",null,"Warren County",null,null,"Turner County","Monroe County","DeWitt County",null,null,"Hopewell, City of",null,null,"Trempealeau County",{"$nulls":5},"Sabana Grande Municipality"]
[{"$nulls":4},"Scott County",null,"Weld County",{"$nulls":3},"Union County","Glynn County",null,null,"McHenry County","Pike County","Marion County","Montgomery County","Laurel County","West Feliciana Parish",{"$nulls":3},"Oakland County","Red Lake County","Sharkey County","Marion County",null,"Nance County",{"$nulls":5},"Moore County",null,"Paulding County","Pottawatomie County",null,"Washington County",null,null,"Union County","Montgomery County","Dickens County",null,null,"Isle of Wight County",null,null,"Vernon County",{"$nulls":5},"Salinas Municipality"]
[{"$nulls":4},"Searcy County",null,"Yuma County",{"$nulls":3},"Volusia County","Gordon County",null,null,"McLean County","Porter County","Marshall County","Morris County","Lawrence County","Winn Parish",{"$nulls":3},"Oceana County","Redwood County","Simpson County","McDonald County",null,"Nemaha County",{"$nulls":5},"Nash County",null,"Perry County","Pushmataha County",null,"Wayne County",null,null,"Walworth County","Moore County","Dimmit County",null,null,"James City County",null,null,"Vilas County",{"$nulls":5},"San Germán Municipality"]
[{"$nulls":4},"Sebastian County",{"$nulls":5},"Wakulla County","Grady County",null,null,"Menard County","Posey County","Mills County","Morton County","Lee County",{"$nulls":4},"Ogemaw County","Renville County","Smith County","Mercer County",null,"Nuckolls County",{"$nulls":5},"New Hanover County",null,"Pickaway County","Roger Mills County",null,"Westmoreland County",null,null,"Yankton County","Morgan County","Donley County",null,null,"King and Queen County",null,null,"Walworth County",{"$nulls":5},"San Juan Municipality"]
[{"$nulls":4},"Sevier County",{"$nulls":5},"Walton County","Greene County",null,null,"Mercer County","Pulaski County","Mitchell County","Nemaha County","Leslie County",{"$nulls":4},"Ontonagon County","Rice County","Stone County","Miller County",null,"Otoe County",{"$nulls":5},"Northampton County",null,"Pike County","Rogers County",null,"Wyoming County",null,null,"Ziebach County","Obion County","Duval County",null,null,"King George County",null,null,"Washburn County",{"$nulls":5},"San Lorenzo Municipality"]
[{"$nulls":4},"Sharp County",{"$nulls":5},"Washington County","Gwinnett County",null,null,"Monroe County","Putnam County","Monona County","Neosho County","Letcher County",{"$nulls":4},"Osceola County","Rock County","Sunflower County","Mississippi County",null,"Pawnee County",{"$nulls":5},"Onslow County",null,"Portage County","Seminole County",null,"York County",{"$nulls":3},"Overton County","Eastland County",null,null,"King William County",null,null,"Washington County",{"$nulls":5},"San Sebastián Municipality"]
[{"$nulls":4},"St. Francis County",{"$nulls":6},"Habersham County",null,null,"Montgomery County","Randolph County","Monroe County","Ness County","Lewis County",{"$nulls":4},"Oscoda County","Roseau County","Tallahatchie County","Moniteau County",null,"Perkins County",{"$nulls":5},"Orange County",null,"Preble County","Sequoyah County",{"$nulls":5},"Perry County","Ector County",null,null,"Lancaster County",null,null,"Waukesha County",{"$nulls":5},"Santa Isabel Municipality"]
[{"$nulls":4},"Stone County",{"$nulls":6},"Hall County",null,null,"Morgan County","Ripley County","Montgomery County","Norton County","Lincoln County",{"$nulls":4},"Otsego County","Scott County","Tate County","Monroe County",null,"Phelps County",{"$nulls":5},"Pamlico County",null,"Putnam County","Stephens County",{"$nulls":5},"Pickett County","Edwards County",null,null,"Lee County",null,null,"Waupaca County",{"$nulls":5},"Toa Alta Municipality"]
[{"$nulls":4},"Union County",{"$nulls":6},"Hancock County",null,null,"Moultrie County","Rush County","Muscatine County","Osage County","Livingston County",{"$nulls":4},"Ottawa County","Sherburne County","Tippah County","Montgomery County",null,"Pierce County",{"$nulls":5},"Pasquotank County",null,"Richland County","Texas County",{"$nulls":5},"Polk County","El Paso County",null,null,"Lexington, City of",null,null,"Waushara County",{"$nulls":5},"Toa Baja Municipality"]
[{"$nulls":4},"Van Buren County",{"$nulls":6},"Haralson County",null,null,"Ogle County","Scott County","O'Brien County","Osborne County","Logan County",{"$nulls":4},"Presque Isle County","Sibley County","Tishomingo County","Morgan County",null,"Platte County",{"$nulls":5},"Pender County",null,"Ross County","Tillman County",{"$nulls":5},"Putnam County","Ellis County",null,null,"Loudoun County",null,null,"Winnebago County",{"$nulls":5},"Trujillo Alto Municipality"]
[{"$nulls":4},"Washington County",{"$nulls":6},"Harris County",null,null,"Peoria County","Shelby County","Osceola County","Ottawa County","Lyon County",{"$nulls":4},"Roscommon County","St. Louis County","Tunica County","New Madrid County",null,"Polk County",{"$nulls":5},"Perquimans County",null,"Sandusky County","Tulsa County",{"$nulls":5},"Rhea County","Erath County",null,null,"Louisa County",null,null,"Wood County",{"$nulls":5},"Utuado Municipality"]
[{"$nulls":4},"White County",{"$nulls":6},"Hart County",null,null,"Perry County","Spencer County","Page County","Pawnee County","Madison County",{"$nulls":4},"Saginaw County","Stearns County","Union County","Newton County",null,"Red Willow County",{"$nulls":5},"Person County",null,"Scioto County","Wagoner County",{"$nulls":5},"Roane County","Falls County",null,null,"Lunenburg County",{"$nulls":8},"Vega Alta Municipality"]
[{"$nulls":4},"Woodruff County",{"$nulls":6},"Heard County",null,null,"Piatt County","St. Joseph County","Palo Alto County","Phillips County","Magoffin County",{"$nulls":4},"Sanilac County","Steele County","Walthall County","Nodaway County",null,"Richardson County",{"$nulls":5},"Pitt County",null,"Seneca County","Washington County",{"$nulls":5},"Robertson County","Fannin County",null,null,"Lynchburg, City of",{"$nulls":8},"Vega Baja Municipality"]
[{"$nulls":4},"Yell County",{"$nulls":6},"Henry County",null,null,"Pike County","Starke County","Plymouth County","Pottawatomie County","Marion County",{"$nulls":4},"Schoolcraft County","Stevens County","Warren County","Oregon County",null,"Rock County",{"$nulls":5},"Polk County",null,"Shelby County","Washita County",{"$nulls":5},"Rutherford County","Fayette County",null,null,"Madison County",{"$nulls":8},"Vieques Municipality"]
[{"$nulls":11},"Houston County",null,null,"Pope County","Steuben County","Pocahontas County","Pratt County","Marshall County",{"$nulls":4},"Shiawassee County","Swift County","Washington County","Osage County",null,"Saline County",{"$nulls":5},"Randolph County",null,"Stark County","Woods County",{"$nulls":5},"Scott County","Fisher County",null,null,"Manassas Park, City of",{"$nulls":8},"Villalba Municipality"]
[{"$nulls":11},"Irwin County",null,null,"Pulaski County","Sullivan County","Polk County","Rawlins County","Martin County",{"$nulls":4},"St. Clair County","Todd County","Wayne County","Ozark County",null,"Sarpy County",{"$nulls":5},"Richmond County",null,"Summit County","Woodward County",{"$nulls":5},"Sequatchie County","Floyd County",null,null,"Manassas, City of",{"$nulls":8},"Yabucoa Municipality"]
[{"$nulls":11},"Jackson County",null,null,"Putnam County","Switzerland County","Pottawattamie County","Reno County","Mason County",{"$nulls":4},"St. Joseph County","Traverse County","Webster County","Pemiscot County",null,"Saunders County",{"$nulls":5},"Robeson County",null,"Trumbull County",{"$nulls":6},"Sevier County","Foard County",null,null,"Martinsville, City of",{"$nulls":8},"Yauco Municipality"]
[{"$nulls":11},"Jasper County",null,null,"Randolph County","Tippecanoe County","Poweshiek County","Republic County","McCracken County",{"$nulls":4},"Tuscola County","Wabasha County","Wilkinson County","Perry County",null,"Scotts Bluff County",{"$nulls":5},"Rockingham County",null,"Tuscarawas County",{"$nulls":6},"Shelby County","Fort Bend County",null,null,"Mathews County"]
[{"$nulls":11},"Jeff Davis County",null,null,"Richland County","Tipton County","Ringgold County","Rice County","McCreary County",{"$nulls":4},"Van Buren County","Wadena County","Winston County","Pettis County",null,"Seward County",{"$nulls":5},"Rowan County",null,"Union County",{"$nulls":6},"Smith County","Franklin County",null,null,"Mecklenburg County"]
[{"$nulls":11},"Jefferson County",null,null,"Rock Island County","Union County","Sac County","Riley County","McLean County",{"$nulls":4},"Washtenaw County","Waseca County","Yalobusha County","Phelps County",null,"Sheridan County",{"$nulls":5},"Rutherford County",null,"Van Wert County",{"$nulls":6},"Stewart County","Freestone County",null,null,"Middlesex County"]
[{"$nulls":11},"Jenkins County",null,null,"Saline County","Vanderburgh County","Scott County","Rooks County","Meade County",{"$nulls":4},"Wayne County","Washington County","Yazoo County","Pike County",null,"Sherman County",{"$nulls":5},"Sampson County",null,"Vinton County",{"$nulls":6},"Sullivan County","Frio County",null,null,"Montgomery County"]
[{"$nulls":11},"Johnson County",null,null,"Sangamon County","Vermillion County","Shelby County","Rush County","Menifee County",{"$nulls":4},"Wexford County","Watonwan County",null,"Platte County",null,"Sioux County",{"$nulls":5},"Scotland County",null,"Warren County",{"$nulls":6},"Sumner County","Gaines County",null,null,"Nelson County"]
[{"$nulls":11},"Jones County",null,null,"Schuyler County","Vigo County","Sioux County","Russell County","Mercer County",{"$nulls":5},"Wilkin County",null,"Polk County",null,"Stanton County",{"$nulls":5},"Stanly County",null,"Washington County",{"$nulls":6},"Tipton County","Galveston County",null,null,"New Kent County"]
[{"$nulls":11},"Lamar County",null,null,"Scott County","Wabash County","Story County","Saline County","Metcalfe County",{"$nulls":5},"Winona County",null,"Pulaski County",null,"Thayer County",{"$nulls":5},"Stokes County",null,"Wayne County",{"$nulls":6},"Trousdale County","Garza County",null,null,"Newport News, City of"]
[{"$nulls":11},"Lanier County",null,null,"Shelby County","Warren County","Tama County","Scott County","Monroe County",{"$nulls":5},"Wright County",null,"Putnam County",null,"Thomas County",{"$nulls":5},"Surry County",null,"Williams County",{"$nulls":6},"Unicoi County","Gillespie County",null,null,"Norfolk, City of"]
[{"$nulls":11},"Laurens County",null,null,"St. Clair County","Warrick County","Taylor County","Sedgwick County","Montgomery County",{"$nulls":5},"Yellow Medicine County",null,"Ralls County",null,"Thurston County",{"$nulls":5},"Swain County",null,"Wood County",{"$nulls":6},"Union County","Glasscock County",null,null,"Northampton County"]
[{"$nulls":11},"Lee County",null,null,"Stark County","Washington County","Union County","Seward County","Morgan County",{"$nulls":7},"Randolph County",null,"Valley County",{"$nulls":5},"Transylvania County",null,"Wyandot County",{"$nulls":6},"Van Buren County","Goliad County",null,null,"Northumberland County"]
[{"$nulls":11},"Liberty County",null,null,"Stephenson County","Wayne County","Van Buren County","Shawnee County","Muhlenberg County",{"$nulls":7},"Ray County",null,"Washington County",{"$nulls":5},"Tyrrell County",{"$nulls":8},"Warren County","Gonzales County",null,null,"Norton, City of"]
[{"$nulls":11},"Lincoln County",null,null,"Tazewell County","Wells County","Wapello County","Sheridan County","Nelson County",{"$nulls":7},"Reynolds County",null,"Wayne County",{"$nulls":5},"Union County",{"$nulls":8},"Washington County","Gray County",null,null,"Nottoway County"]
[{"$nulls":11},"Long County",null,null,"Union County","White County","Warren County","Sherman County","Nicholas County",{"$nulls":7},"Ripley County",null,"Webster County",{"$nulls":5},"Vance County",{"$nulls":8},"Wayne County","Grayson County",null,null,"Orange County"]
[{"$nulls":11},"Lowndes County",null,null,"Vermilion County","Whitley County","Washington County","Smith County","Ohio County",{"$nulls":7},"Saline County",null,"Wheeler County",{"$nulls":5},"Wake County",{"$nulls":8},"Weakley County","Gregg County",null,null,"Page County"]
[{"$nulls":11},"Lumpkin County",null,null,"Wabash County",null,"Wayne County","Stafford County","Oldham County",{"$nulls":7},"Schuyler County",null,"York County",{"$nulls":5},"Warren County",{"$nulls":8},"White County","Grimes County",null,null,"Patrick County"]
[{"$nulls":11},"Macon County",null,null,"Warren County",null,"Webster County","Stanton County","Owen County",{"$nulls":7},"Scotland County",{"$nulls":7},"Washington County",{"$nulls":8},"Williamson County","Guadalupe County",null,null,"Petersburg, City of"]
[{"$nulls":11},"Madison County",null,null,"Washington County",null,"Winnebago County","Stevens County","Owsley County",{"$nulls":7},"Scott County",{"$nulls":7},"Watauga County",{"$nulls":8},"Wilson County","Hale County",null,null,"Pittsylvania County"]
[{"$nulls":11},"Marion County",null,null,"Wayne County",null,"Winneshiek County","Sumner County","Pendleton County",{"$nulls":7},"Shannon County",{"$nulls":7},"Wayne County",{"$nulls":9},"Hall County",null,null,"Poquoson, City of"]
[{"$nulls":11},"McDuffie County",null,null,"White County",null,"Woodbury County","Thomas County","Perry County",{"$nulls":7},"Shelby County",{"$nulls":7},"Wilkes County",{"$nulls":9},"Hamilton County",null,null,"Portsmouth, City of"]
[{"$nulls":11},"McIntosh County",null,null,"Whiteside County",null,"Worth County","Trego County","Pike County",{"$nulls":7},"St. Charles County",{"$nulls":7},"Wilson County",{"$nulls":9},"Hansford County",null,null,"Powhatan County"]
[{"$nulls":11},"Meriwether County",null,null,"Will County",null,"Wright County","Wabaunsee County","Powell County",{"$nulls":7},"St. Clair County",{"$nulls":7},"Yadkin County",{"$nulls":9},"Hardeman County",null,null,"Prince Edward County"]
[{"$nulls":11},"Miller County",null,null,"Williamson County",null,null,"Wallace County","Pulaski County",{"$nulls":7},"St. Francois County",{"$nulls":7},"Yancey County",{"$nulls":9},"Hardin County",null,null,"Prince George County"]
[{"$nulls":11},"Mitchell County",null,null,"Winnebago County",null,null,"Washington County","Robertson County",{"$nulls":7},"St. Louis County",{"$nulls":17},"Harris County",null,null,"Prince William County"]
[{"$nulls":11},"Monroe County",null,null,"Woodford County",null,null,"Wichita County","Rockcastle County",{"$nulls":7},"St. Louis, City of",{"$nulls":17},"Harrison County",null,null,"Pulaski County"]
[{"$nulls":11},"Montgomery County",{"$nulls":5},"Wilson County","Rowan County",{"$nulls":7},"Ste. Genevieve County",{"$nulls":17},"Hartley County",null,null,"Radford, City of"]
[{"$nulls":11},"Morgan County",{"$nulls":5},"Woodson County","Russell County",{"$nulls":7},"Stoddard County",{"$nulls":17},"Haskell County",null,null,"Rappahannock County"]
[{"$nulls":11},"Murray County",{"$nulls":5},"Wyandotte County","Scott County",{"$nulls":7},"Stone County",{"$nulls":17},"Hays County",null,null,"Richmond County"]
[{"$nulls":11},"Muscogee County",{"$nulls":6},"Shelby County",{"$nulls":7},"Sullivan County",{"$nulls":17},"Hemphill County",null,null,"Richmond, City of"]
[{"$nulls":11},"Newton County",{"$nulls":6},"Simpson County",{"$nulls":7},"Taney County",{"$nulls":17},"Henderson County",null,null,"Roanoke County"]
[{"$nulls":11},"Oconee County",{"$nulls":6},"Spencer County",{"$nulls":7},"Texas County",{"$nulls":17},"Hidalgo County",null,null,"Roanoke, City of"]
[{"$nulls":11},"Oglethorpe County",{"$nulls":6},"Taylor County",{"$nulls":7},"Vernon County",{"$nulls":17},"Hill County",null,null,"Rockbridge County"]
[{"$nulls":11},"Paulding County",{"$nulls":6},"Todd County",{"$nulls":7},"Warren County",{"$nulls":17},"Hockley County",null,null,"Rockingham County"]
[{"$nulls":11},"Peach County",{"$nulls":6},"Trigg County",{"$nulls":7},"Washington County",{"$nulls":17},"Hood County",null,null,"Russell County"]
[{"$nulls":11},"Pickens County",{"$nulls":6},"Trimble County",{"$nulls":7},"Wayne County",{"$nulls":17},"Hopkins County",null,null,"Salem, City of"]
[{"$nulls":11},"Pierce County",{"$nulls":6},"Union County",{"$nulls":7},"Webster County",{"$nulls":17},"Houston County",null,null,"Scott County"]
[{"$nulls":11},"Pike County",{"$nulls":6},"Warren County",{"$nulls":7},"Worth County",{"$nulls":17},"Howard County",null,null,"Shenandoah County"]
[{"$nulls":11},"Polk County",{"$nulls":6},"Washington County",{"$nulls":7},"Wright County",{"$nulls":17},"Hudspeth County",null,null,"Smyth County"]
[{"$nulls":11},"Pulaski County",{"$nulls":6},"Wayne County",{"$nulls":25},"Hunt County",null,null,"Southampton County"]
[{"$nulls":11},"Putnam County",{"$nulls":6},"Webster County",{"$nulls":25},"Hutchinson County",null,null,"Spotsylvania County"]
[{"$nulls":11},"Quitman County",{"$nulls":6},"Whitley County",{"$nulls":25},"Irion County",null,null,"Stafford County"]
[{"$nulls":11},"Rabun County",{"$nulls":6},"Wolfe County",{"$nulls":25},"Jack County",null,null,"Staunton, City of"]
[{"$nulls":11},"Randolph County",{"$nulls":6},"Woodford County",{"$nulls":25},"Jackson County",null,null,"Suffolk, City of"]
[{"$nulls":11},"Richmond County",{"$nulls":32},"Jasper County",null,null,"Surry County"]
[{"$nulls":11},"Rockdale County",{"$nulls":32},"Jeff Davis County",null,null,"Sussex County"]
[{"$nulls":11},"Schley County",{"$nulls":32},"Jefferson County",null,null,"Tazewell County"]
[{"$nulls":11},"Screven County",{"$nulls":32},"Jim Hogg County",null,null,"Virginia Beach, City of"]
[{"$nulls":11},"Seminole County",{"$nulls":32},"Jim Wells County",null,null,"Warren County"]
[{"$nulls":11},"Spalding County",{"$nulls":32},"Johnson County",null,null,"Washington County"]
[{"$nulls":11},"Stephens County",{"$nulls":32},"Jones County",null,null,"Waynesboro, City of"]
[{"$nulls":11},"Stewart County",{"$nulls":32},"Karnes County",null,null,"Westmoreland County"]
[{"$nulls":11},"Sumter County",{"$nulls":32},"Kaufman County",null,null,"Williamsburg, City of"]
[{"$nulls":11},"Talbot County",{"$nulls":32},"Kendall County",null,null,"Winchester, City of"]
[{"$nulls":11},"Taliaferro County",{"$nulls":32},"Kenedy County",null,null,"Wise County"]
[{"$nulls":11},"Tattnall County",{"$nulls":32},"Kent County",null,null,"Wythe County"]
[{"$nulls":11},"Taylor County",{"$nulls":32},"Kerr County",null,null,"York County"]
[{"$nulls":11},"Telfair County",{"$nulls":32},"Kimble County"]
[{"$nulls":11},"Terrell County",{"$nulls":32},"King County"]
[{"$nulls":11},"Thomas County",{"$nulls":32},"Kinney County"]
[{"$nulls":11},"Tift County",{"$nulls":32},"Kleberg County"]
[{"$nulls":11},"Toombs County",{"$nulls":32},"Knox County"]
[{"$nulls":11},"Towns County",{"$nulls":32},"La Salle County"]
[{"$nulls":11},"Treutlen County",{"$nulls":32},"Lamar County"]
[{"$nulls":11},"Troup County",{"$nulls":32},"Lamb County"]
[{"$nulls":11},"Turner County",{"$nulls":32},"Lampasas County"]
[{"$nulls":11},"Twiggs County",{"$nulls":32},"Lavaca County"]
[{"$nulls":11},"Union County",{"$nulls":32},"Lee County"]
[{"$nulls":11},"Upson County",{"$nulls":32},"Leon County"]
[{"$nulls":11},"Walker County",{"$nulls":32},"Liberty County"]
[{"$nulls":11},"Walton County",{"$nulls":32},"Limestone County"]
[{"$nulls":11},"Ware County",{"$nulls":32},"Lipscomb County"]
[{"$nulls":11},"Warren County",{"$nulls":32},"Live Oak County"]
[{"$nulls":11},"Washington County",{"$nulls":32},"Llano County"]
[{"$nulls":11},"Wayne County",{"$nulls":32},"Loving County"]
[{"$nulls":11},"Webster County",{"$nulls":32},"Lubbock County"]
[{"$nulls":11},"Wheeler County",{"$nulls":32},"Lynn County"]
[{"$nulls":11},"White County",{"$nulls":32},"Madison County"]
[{"$nulls":11},"Whitfield County",{"$nulls":32},"Marion County"]
[{"$nulls":11},"Wilcox County",{"$nulls":32},"Martin County"]
[{"$nulls":11},"Wilkes County",{"$nulls":32},"Mason County"]
[{"$nulls":11},"Wilkinson County",{"$nulls":32},"Matagorda County"]
[{"$nulls":11},"Worth County",{"$nulls":32},"Maverick County"]
[{"$nulls":44},"McCulloch County"]
[{"$nulls":44},"McLennan County"]
[{"$nulls":44},"McMullen County"]
[{"$nulls":44},"Medina County"]
[{"$nulls":44},"Menard County"]
[{"$nulls":44},"Midland County"]
[{"$nulls":44},"Milam County"]
[{"$nulls":44},"Mills County"]
[{"$nulls":44},"Mitchell County"]
[{"$nulls":44},"Montague County"]
[{"$nulls":44},"Montgomery County"]
[{"$nulls":44},"Moore County"]
[{"$nulls":44},"Morris County"]
[{"$nulls":44},"Motley County"]
[{"$nulls":44},"Nacogdoches County"]
[{"$nulls":44},"Navarro County"]
[{"$nulls":44},"Newton County"]
[{"$nulls":44},"Nolan County"]
[{"$nulls":44},"Nueces County"]
[{"$nulls":44},"Ochiltree County"]
[{"$nulls":44},"Oldham County"]
[{"$nulls":44},"Orange County"]
[{"$nulls":44},"Palo Pinto County"]
[{"$nulls":44},"Panola County"]
[{"$nulls":44},"Parker County"]
[{"$nulls":44},"Parmer County"]
[{"$nulls":44},"Pecos County"]
[{"$nulls":44},"Polk County"]
[{"$nulls":44},"Potter County"]
[{"$nulls":44},"Presidio County"]
[{"$nulls":44},"Rains County"]
[{"$nulls":44},"Randall County"]
[{"$nulls":44},"Reagan County"]
[{"$nulls":44},"Real County"]
[{"$nulls":44},"Red River County"]
[{"$nulls":44},"Reeves County"]
[{"$nulls":44},"Refugio County"]
[{"$nulls":44},"Roberts County"]
[{"$nulls":44},"Robertson County"]
[{"$nulls":44},"Rockwall County"]
[{"$nulls":44},"Runnels County"]
[{"$nulls":44},"Rusk County"]
[{"$nulls":44},"Sabine County"]
[{"$nulls":44},"San Augustine County"]
[{"$nulls":44},"San Jacinto County"]
[{"$nulls":44},"San Patricio County"]
[{"$nulls":44},"San Saba County"]
[{"$nulls":44},"Schleicher County"]
[{"$nulls":44},"Scurry County"]
[{"$nulls":44},"Shackelford County"]
[{"$nulls":44},"Shelby County"]
[{"$nulls":44},"Sherman County"]
[{"$nulls":44},"Smith County"]
[{"$nulls":44},"Somervell County"]
[{"$nulls":44},"Starr County"]
[{"$nulls":44},"Stephens County"]
[{"$nulls":44},"Sterling County"]
[{"$nulls":44},"Stonewall County"]
[{"$nulls":44},"Sutton County"]
[{"$nulls":44},"Swisher County"]
[{"$nulls":44},"Tarrant County"]
[{"$nulls":44},"Taylor County"]
[{"$nulls":44},"Terrell County"]
[{"$nulls":44},"Terry County"]
[{"$nulls":44},"Throckmorton County"]
[{"$nulls":44},"Titus County"]
[{"$nulls":44},"Tom Green County"]
[{"$nulls":44},"Travis County"]
[{"$nulls":44},"Trinity County"]
[{"$nulls":44},"Tyler County"]
[{"$nulls":44},"Upshur County"]
[{"$nulls":44},"Upton County"]
[{"$nulls":44},"Uvalde County"]
[{"$nulls":44},"Val Verde County"]
[{"$nulls":44},"Van Zandt County"]
[{"$nulls":44},"Victoria County"]
[{"$nulls":44},"Walker County"]
[{"$nulls":44},"Waller County"]
[{"$nulls":44},"Ward County"]
[{"$nulls":44},"Washington County"]
[{"$nulls":44},"Webb County"]
[{"$nulls":44},"Wharton County"]
[{"$nulls":44},"Wheeler County"]
[{"$nulls":44},"Wichita County"]
[{"$nulls":44},"Wilbarger County"]
[{"$nulls":44},"Willacy County"]
[{"$nulls":44},"Williamson County"]
[{"$nulls":44},"Wilson County"]
[{"$nulls":44},"Winkler County"]
[{"$nulls":44},"Wise County"]
[{"$nulls":44},"Wood County"]
[{"$nulls":44},"Yoakum County"]
[{"$nulls":44},"Young County"]
[{"$nulls":44},"Zapata County"]
[{"$nulls":44},"Zavala County"]

{"sheet":"CoCs","index":7,"n_rows":59,"n_cols":59,"rows_kept":59,"hidden":true}
["State or equivalent","AL-500","AK-500","AZ-500","AR-500","CA-500","CO-500","CT-503","DE-500","DC-500","FL-500","GA-500","HI-500","ID-500","IL-500","IN-502","IA-500","KS-502","KY-500","LA-500","ME-500","MD-500","MA-500","MI-500","MN-500","MS-500","MO-500","MT-500","NE-500","NV-500","NH-500","NJ-500","NM-500","NY-500","NC-500","ND-500","OH-500","OK-500","OR-500","PA-500","RI-500","SC-500","SD-500","TN-500","TX-500","UT-500","VT-500","VA-500","WA-500","WV-500","WI-500","WY-500","None","None","GU-500","None","PR-502","None","VI-500"]
["Alabama_State","AL-501","AK-501","AZ-501","AR-501","CA-501","CO-503","CT-505",null,null,"FL-501","GA-501","HI-501","ID-501","IL-501","IN-503","IA-501","KS-503","KY-501","LA-502",null,"MD-501","MA-502","MI-501","MN-501","MS-501","MO-501",null,"NE-501","NV-501","NH-501","NJ-501","NM-501","NY-501","NC-501",null,"OH-501","OK-501","OR-501","PA-501",null,"SC-501",null,"TN-501","TX-503","UT-503","VT-501","VA-501","WA-501","WV-501","WI-501",{"$nulls":5},"PR-503"]
["Alaska_State","AL-502",null,"AZ-502","AR-503","CA-502","CO-504",{"$nulls":3},"FL-502","GA-502",null,null,"IL-502",null,"IA-502","KS-505","KY-502","LA-503",null,"MD-502","MA-503","MI-502","MN-502","MS-503","MO-503",null,"NE-502","NV-502","NH-502","NJ-502",null,"NY-503","NC-502",null,"OH-502","OK-502","OR-502","PA-502",null,"SC-502",null,"TN-502","TX-600","UT-504",null,"VA-502","WA-502","WV-503","WI-502"]
["Arizona_State","AL-503",null,null,"AR-505","CA-503",{"$nulls":4},"FL-503","GA-503",null,null,"IL-503",null,null,"KS-507",null,"LA-505",null,"MD-503","MA-504","MI-503","MN-503",null,"MO-600",{"$nulls":4},"NJ-503",null,"NY-504","NC-503",null,"OH-503","OK-503","OR-503","PA-503",null,"SC-503",null,"TN-503","TX-601",null,null,"VA-503","WA-503","WV-508","WI-503"]
["Arkansas_State","AL-504",null,null,"AR-512","CA-504",{"$nulls":4},"FL-504","GA-504",null,null,"IL-504",{"$nulls":4},"LA-506",null,"MD-504","MA-505","MI-504","MN-504",null,"MO-602",{"$nulls":4},"NJ-504",null,"NY-505","NC-504",null,"OH-504","OK-504","OR-505","PA-504",{"$nulls":3},"TN-504","TX-603",null,null,"VA-504","WA-504"]
["California_State","AL-506",{"$nulls":3},"CA-505",{"$nulls":4},"FL-505","GA-505",null,null,"IL-506",{"$nulls":4},"LA-507",null,"MD-505","MA-506","MI-505","MN-505",null,"MO-603",{"$nulls":4},"NJ-506",null,"NY-507","NC-505",null,"OH-505","OK-505","OR-506","PA-505",{"$nulls":3},"TN-506","TX-604",null,null,"VA-505","WA-507"]
["Colorado_State","AL-507",{"$nulls":3},"CA-506",{"$nulls":4},"FL-506","GA-506",null,null,"IL-507",{"$nulls":4},"LA-508",null,"MD-506","MA-507","MI-506","MN-506",null,"MO-604",{"$nulls":4},"NJ-507",null,"NY-508","NC-506",null,"OH-506","OK-506","OR-507","PA-506",{"$nulls":3},"TN-507","TX-607",null,null,"VA-507","WA-508"]
["Connecticut_State",{"$nulls":4},"CA-507",{"$nulls":4},"FL-507","GA-507",null,null,"IL-508",{"$nulls":4},"LA-509",null,"MD-507","MA-508","MI-507","MN-508",null,"MO-606",{"$nulls":4},"NJ-508",null,"NY-510","NC-507",null,"OH-507","OK-507",null,"PA-508",{"$nulls":3},"TN-509","TX-611",null,null,"VA-508"]
["Delaware_State",{"$nulls":4},"CA-508",{"$nulls":4},"FL-508","GA-508",null,null,"IL-509",{"$nulls":6},"MD-508","MA-509","MI-508","MN-509",{"$nulls":6},"NJ-509",null,"NY-511","NC-509",null,"OH-508",null,null,"PA-509",{"$nulls":3},"TN-510","TX-624",null,null,"VA-513"]
["District_of_Columbia_State",{"$nulls":4},"CA-509",{"$nulls":4},"FL-509",{"$nulls":3},"IL-510",{"$nulls":6},"MD-509","MA-510","MI-509","MN-511",{"$nulls":6},"NJ-510",null,"NY-512","NC-511",{"$nulls":4},"PA-510",{"$nulls":3},"TN-512","TX-700",null,null,"VA-514"]
["Florida_State",{"$nulls":4},"CA-510",{"$nulls":4},"FL-510",{"$nulls":3},"IL-511",{"$nulls":6},"MD-510","MA-511","MI-510",{"$nulls":7},"NJ-511",null,"NY-513","NC-513",{"$nulls":4},"PA-511",{"$nulls":4},"TX-701",null,null,"VA-521"]
["Georgia_State",{"$nulls":4},"CA-511",{"$nulls":4},"FL-511",{"$nulls":3},"IL-512",{"$nulls":6},"MD-511","MA-515","MI-511",{"$nulls":7},"NJ-512",null,"NY-514","NC-516",{"$nulls":4},"PA-512",{"$nulls":7},"VA-600"]
["Hawaiʻi_State",{"$nulls":4},"CA-512",{"$nulls":4},"FL-512",{"$nulls":3},"IL-513",{"$nulls":6},"MD-512","MA-516","MI-512",{"$nulls":7},"NJ-513",null,"NY-516",{"$nulls":5},"PA-600",{"$nulls":7},"VA-601"]
["Idaho_State",{"$nulls":4},"CA-513",{"$nulls":4},"FL-513",{"$nulls":3},"IL-514",{"$nulls":6},"MD-513","MA-517","MI-513",{"$nulls":7},"NJ-514",null,"NY-518",{"$nulls":5},"PA-601",{"$nulls":7},"VA-602"]
["Illinois_State",{"$nulls":4},"CA-514",{"$nulls":4},"FL-514",{"$nulls":3},"IL-515",{"$nulls":6},"MD-600","MA-519","MI-514",{"$nulls":7},"NJ-515",null,"NY-519",{"$nulls":5},"PA-603",{"$nulls":7},"VA-603"]
["Indiana_State",{"$nulls":4},"CA-515",{"$nulls":4},"FL-515",{"$nulls":3},"IL-516",{"$nulls":6},"MD-601",null,"MI-515",{"$nulls":7},"NJ-516",null,"NY-520",{"$nulls":5},"PA-605",{"$nulls":7},"VA-604"]
["Iowa_State",{"$nulls":4},"CA-516",{"$nulls":4},"FL-517",{"$nulls":3},"IL-517",{"$nulls":8},"MI-516",{"$nulls":9},"NY-522"]
["Kansas_State",{"$nulls":4},"CA-517",{"$nulls":4},"FL-518",{"$nulls":3},"IL-518",{"$nulls":8},"MI-517",{"$nulls":9},"NY-523"]
["Kentucky_State",{"$nulls":4},"CA-518",{"$nulls":4},"FL-519",{"$nulls":3},"IL-519",{"$nulls":8},"MI-518",{"$nulls":9},"NY-600"]
["Louisiana_State",{"$nulls":4},"CA-519",{"$nulls":4},"FL-520",{"$nulls":3},"IL-520",{"$nulls":8},"MI-519",{"$nulls":9},"NY-601"]
["Maine_State",{"$nulls":4},"CA-520",{"$nulls":4},"FL-600",{"$nulls":12},"MI-523",{"$nulls":9},"NY-602"]
["Maryland_State",{"$nulls":4},"CA-521",{"$nulls":4},"FL-601",{"$nulls":22},"NY-603"]
["Massachusetts_State",{"$nulls":4},"CA-522",{"$nulls":4},"FL-602",{"$nulls":22},"NY-604"]
["Michigan_State",{"$nulls":4},"CA-523",{"$nulls":4},"FL-603",{"$nulls":22},"NY-606"]
["Minnesota_State",{"$nulls":4},"CA-524",{"$nulls":4},"FL-604",{"$nulls":22},"NY-607"]
["Mississippi_State",{"$nulls":4},"CA-525",{"$nulls":4},"FL-605",{"$nulls":22},"NY-608"]
["Missouri_State",{"$nulls":4},"CA-526",{"$nulls":4},"FL-606"]
["Montana_State",{"$nulls":4},"CA-527"]
["Nebraska_State",{"$nulls":4},"CA-530"]
["Nevada_State",{"$nulls":4},"CA-600"]
["New_Hampshire_State",{"$nulls":4},"CA-601"]
["New_Jersey_State",{"$nulls":4},"CA-602"]
["New_Mexico_State",{"$nulls":4},"CA-603"]
["New_York_State",{"$nulls":4},"CA-604"]
["North_Carolina_State",{"$nulls":4},"CA-606"]
["North_Dakota_State",{"$nulls":4},"CA-607"]
["Ohio_State",{"$nulls":4},"CA-608"]
["Oklahoma_State",{"$nulls":4},"CA-609"]
["Oregon_State",{"$nulls":4},"CA-611"]
["Pennsylvania_State",{"$nulls":4},"CA-612"]
["Rhode_Island_State",{"$nulls":4},"CA-613"]
["South_Carolina_State",{"$nulls":4},"CA-614"]
["South_Dakota_State"]
["Tennessee_State"]
["Texas_State"]
["Utah_State"]
["Vermont_State"]
["Virginia_State"]
["Washington_State"]
["West_Virginia_State"]
["Wisconsin_State"]
["Wyoming_State"]
["*Other_Territories*_State"]
["American_Samoa_State"]
["Guam_State"]
["Northern_Mariana_Islands_State"]
["Puerto_Rico_State"]
["U.S._Minor_Outlying_Islands_State"]
["Virgin_Islands_(U.S.)_State"]

{"sheet":"extra & old","index":8,"n_rows":3299,"n_cols":9,"rows_kept":3299,"hidden":true}
["State or equivalent","County or equivalent",null,"State or equivalent","ST",null,"State","COC #","COC Location"]
["Alabama","*Entire State*",null,"Alabama","AL",null,"Alabama","AL-500","Birmingham/Jefferson, Saint Clair, Shelby Counties CoC"]
["Alabama","Autauga County",null,"Alaska","AK",null,"Alabama","AL-501","Mobile City and County/Baldwin County CoC"]
["Alabama","Baldwin County",null,"Arizona","AZ",null,"Alabama","AL-502","Florence/Northwest Alabama CoC"]
["Alabama","Barbour County",null,"Arkansas","AR",null,"Alabama","AL-503","Huntsville/North Alabama CoC"]
["Alabama","Bibb County",null,"California","CA",null,"Alabama","AL-504","Montgomery City and County CoC"]
["Alabama","Blount County",null,"Colorado","CO",null,"Alabama","AL-506","Tuscaloosa City and County CoC"]
["Alabama","Bullock County",null,"Connecticut","CT",null,"Alabama","AL-507","Alabama Balance of State CoC"]
["Alabama","Butler County",null,"Delaware","DE",null,"Alaska","AK-500","Anchorage CoC"]
["Alabama","Calhoun County",null,"District of Columbia","DC",null,"Alaska","AK-501","Alaska Balance of State CoC"]
["Alabama","Chambers County",null,"Florida","FL",null,"Arizona","AZ-500","Arizona Balance of State CoC"]
["Alabama","Cherokee County",null,"Georgia","GA",null,"Arizona","AZ-501","Tucson/Pima County CoC"]
["Alabama","Chilton County",null,"Hawaiʻi","HI",null,"Arizona","AZ-502","Phoenix, Mesa/Maricopa County CoC"]
["Alabama","Choctaw County",null,"Idaho","ID",null,"Arkansas","AR-500","Little Rock/Central Arkansas CoC"]
["Alabama","Clarke County",null,"Illinois","IL",null,"Arkansas","AR-501","Fayetteville/Northwest Arkansas CoC"]
["Alabama","Clay County",null,"Indiana","IN",null,"Arkansas","AR-503","Arkansas Balance of State CoC"]
["Alabama","Cleburne County",null,"Iowa","IA",null,"Arkansas","AR-505","Southeast Arkansas CoC"]
["Alabama","Coffee County",null,"Kansas","KS",null,"Arkansas","AR-512","Boone, Baxter, Marion, Newton Counties CoC"]
["Alabama","Colbert County",null,"Kentucky","KY",null,"California","CA-500","San Jose, Santa Clara City and County CoC"]
["Alabama","Conecuh County",null,"Louisiana","LA",null,"California","CA-501","San Francisco CoC"]
["Alabama","Coosa County",null,"Maine","ME",null,"California","CA-502","Oakland, Berkeley/Alameda County CoC"]
["Alabama","Covington County",null,"Maryland","MD",null,"California","CA-503","Sacramento City and County CoC"]
["Alabama","Crenshaw County",null,"Massachusetts","MA",null,"California","CA-504","Santa Rosa, Petaluma/Sonoma County CoC"]
["Alabama","Cullman County",null,"Michigan","MI",null,"California","CA-505","Richmond/Contra Costa County CoC"]
["Alabama","Dale County",null,"Minnesota","MN",null,"California","CA-506","Salinas/Monterey, San Benito Counties CoC"]
["Alabama","Dallas County",null,"Mississippi","MS",null,"California","CA-507","Marin County CoC"]
["Alabama","DeKalb County",null,"Missouri","MO",null,"California","CA-508","Watsonville/Santa Cruz City and County CoC"]
["Alabama","Elmore County",null,"Montana","MT",null,"California","CA-509","Mendocino County CoC"]
["Alabama","Escambia County",null,"Nebraska","NE",null,"California","CA-510","Turlock, Modesto/Stanislaus County CoC"]
["Alabama","Etowah County",null,"Nevada","NV",null,"California","CA-511","Stockton/San Joaquin County CoC"]
["Alabama","Fayette County",null,"New Hampshire","NH",null,"California","CA-512","Daly City/San Mateo County CoC"]
["Alabama","Franklin County",null,"New Jersey","NJ",null,"California","CA-513","Visalia/Kings, Tulare Counties CoC"]
["Alabama","Geneva County",null,"New Mexico","NM",null,"California","CA-514","Fresno City and County/Madera County CoC"]
["Alabama","Greene County",null,"New York","NY",null,"California","CA-515","Roseville, Rocklin/Placer, Nevada Counties CoC"]
["Alabama","Hale County",null,"North Carolina","NC",null,"California","CA-516","Redding/Shasta, Siskiyou, Lassen, Plumas, Del Norte, Modoc, Sierra Counties CoC"]
["Alabama","Henry County",null,"North Dakota","ND",null,"California","CA-517","Napa City and County CoC"]
["Alabama","Houston County",null,"Ohio","OH",null,"California","CA-518","Vallejo/Solano County CoC"]
["Alabama","Jackson County",null,"Oklahoma","OK",null,"California","CA-519","Chico, Paradise/Butte County CoC"]
["Alabama","Jefferson County",null,"Oregon","OR",null,"California","CA-520","Merced City and County CoC"]
["Alabama","Lamar County",null,"Pennsylvania","PA",null,"California","CA-521","Davis, Woodland/Yolo County CoC"]
["Alabama","Lauderdale County",null,"Rhode Island","RI",null,"California","CA-522","Humboldt County CoC"]
["Alabama","Lawrence County",null,"South Carolina","SC",null,"California","CA-523","Colusa, Glenn, Trinity Counties CoC"]
["Alabama","Lee County",null,"South Dakota","SD",null,"California","CA-524","Yuba City and County/Sutter County CoC"]
["Alabama","Limestone County",null,"Tennessee","TN",null,"California","CA-525","El Dorado County CoC"]
["Alabama","Lowndes County",null,"Texas","TX",null,"California","CA-526","Amador, Calaveras, Mariposa, Tuolumne Counties CoC"]
["Alabama","Macon County",null,"Utah","UT",null,"California","CA-527","Tehama County CoC"]
["Alabama","Madison County",null,"Vermont","VT",null,"California","CA-530","Alpine, Inyo, Mono Counties CoC"]
["Alabama","Marengo County",null,"Virginia","VA",null,"California","CA-600","Los Angeles City and County CoC"]
["Alabama","Marion County",null,"Washington","WA",null,"California","CA-601","San Diego City and County CoC"]
["Alabama","Marshall County",null,"West Virginia","WV",null,"California","CA-602","Santa Ana, Anaheim/Orange County CoC"]
["Alabama","Mobile County",null,"Wisconsin","WI",null,"California","CA-603","Santa Maria/Santa Barbara County CoC"]
["Alabama","Monroe County",null,"Wyoming","WY",null,"California","CA-604","Bakersfield/Kern County CoC"]
["Alabama","Montgomery County",null,"*Other Territories*","NA",null,"California","CA-606","Long Beach CoC"]
["Alabama","Morgan County",null,"American Samoa","AS",null,"California","CA-607","Pasadena CoC"]
["Alabama","Perry County",null,"Guam","GU",null,"California","CA-608","Riverside City and County CoC"]
["Alabama","Pickens County",null,"Northern Mariana Islands","NI",null,"California","CA-609","San Bernardino City and County CoC"]
["Alabama","Pike County",null,"Puerto Rico","PR",null,"California","CA-611","Oxnard, San Buenaventura/Ventura County CoC"]
["Alabama","Randolph County",null,"U.S. Minor Outlying Islands","OI",null,"California","CA-612","Glendale CoC"]
["Alabama","Russell County",null,"Virgin Islands (U.S.)","VI",null,"California","CA-613","Imperial County CoC"]
["Alabama","Shelby County",{"$nulls":4},"California","CA-614","San Luis Obispo County CoC"]
["Alabama","St. Clair County",{"$nulls":4},"Colorado","CO-500","Colorado Balance of State CoC"]
["Alabama","Sumter County",{"$nulls":4},"Colorado","CO-503","Metropolitan Denver CoC"]
["Alabama","Talladega County",{"$nulls":4},"Colorado","CO-504","Colorado Springs/El Paso County CoC"]
["Alabama","Tallapoosa County",{"$nulls":4},"Connecticut","CT-503","Bridgeport, Stamford, Norwalk/Fairfield County CoC"]
["Alabama","Tuscaloosa County",{"$nulls":4},"Connecticut","CT-505","Connecticut Balance of State CoC"]
["Alabama","Walker County",null,"YesNo",null,null,"Delaware","DE-500","Delaware Statewide CoC"]
["Alabama","Washington County",null,"Yes",null,null,"District of Columbia","DC-500","District of Columbia CoC"]
["Alabama","Wilcox County",null,"No",null,null,"Florida","FL-500","Sarasota, Bradenton/Manatee, Sarasota Counties CoC"]
["Alabama","Winston County",{"$nulls":4},"Florida","FL-501","Tampa/Hillsborough County CoC"]
["Alaska","*Entire State*",{"$nulls":4},"Florida","FL-502","Saint Petersburg, Clearwater, Largo/Pinellas County CoC"]
["Alaska","Aleutians East Borough",{"$nulls":4},"Florida","FL-503","Lakeland, Winterhaven/Polk County CoC"]
["Alaska","Aleutians West Census Area",{"$nulls":4},"Florida","FL-504","Deltona, Daytona Beach/Volusia, Flagler Counties CoC"]
["Alaska","Anchorage, Municipality of",{"$nulls":4},"Florida","FL-505","Fort Walton Beach/Okaloosa, Walton Counties CoC"]
["Alaska","Bethel Census Area",{"$nulls":4},"Florida","FL-506","Tallahassee/Leon County CoC"]
["Alaska","Bristol Bay Borough",{"$nulls":4},"Florida","FL-507","Orlando/Orange, Osceola, Seminole Counties CoC"]
["Alaska","Denali Borough",{"$nulls":4},"Florida","FL-508","Gainesville/Alachua, Putnam Counties CoC"]
["Alaska","Dillingham Census Area",{"$nulls":4},"Florida","FL-509","Fort Pierce/Saint Lucie, Indian River, Martin Counties CoC"]
["Alaska","Fairbanks North Star Borough",{"$nulls":4},"Florida","FL-510","Jacksonville-Duval, Clay Counties CoC"]
["Alaska","Haines Borough",{"$nulls":4},"Florida","FL-511","Pensacola/Escambia, Santa Rosa Counties CoC"]
["Alaska","Hoonah–Angoon Census Area",{"$nulls":4},"Florida","FL-512","Saint Johns County CoC"]
["Alaska","Juneau, City and Borough of",{"$nulls":4},"Florida","FL-513","Palm Bay, Melbourne/Brevard County CoC"]
["Alaska","Kenai Peninsula Borough",{"$nulls":4},"Florida","FL-514","Ocala/Marion County CoC"]
["Alaska","Ketchikan Gateway Borough",{"$nulls":4},"Florida","FL-515","Panama City/Bay, Jackson Counties CoC"]
["Alaska","Kodiak Island Borough",{"$nulls":4},"Florida","FL-517","Hendry, Hardee, Highlands Counties CoC"]
["Alaska","Kusilvak Census Area",{"$nulls":4},"Florida","FL-518","Columbia, Hamilton, Lafayette, Suwannee Counties CoC"]
["Alaska","Lake and Peninsula Borough",{"$nulls":4},"Florida","FL-519","Pasco County CoC"]
["Alaska","Matanuska-Susitna Borough",{"$nulls":4},"Florida","FL-520","Citrus, Hernando, Lake, Sumter Counties CoC"]
["Alaska","Nome Census Area",{"$nulls":4},"Florida","FL-600","Miami-Dade County CoC"]
["Alaska","North Slope Borough",{"$nulls":4},"Florida","FL-601","Ft Lauderdale/Broward County CoC"]
["Alaska","Northwest Arctic Borough",{"$nulls":4},"Florida","FL-602","Punta Gorda/Charlotte County CoC"]
["Alaska","Petersburg Borough",{"$nulls":4},"Florida","FL-603","Ft Myers, Cape Coral/Lee County CoC"]
["Alaska","Prince of Wales – Hyder Census Area",{"$nulls":4},"Florida","FL-604","Monroe County CoC"]
["Alaska","Sitka, City and Borough of",{"$nulls":4},"Florida","FL-605","West Palm Beach/Palm Beach County CoC"]
["Alaska","Skagway, Municipality of",{"$nulls":4},"Florida","FL-606","Naples/Collier County CoC"]
["Alaska","Southeast Fairbanks Census Area",{"$nulls":4},"Georgia","GA-500","Atlanta CoC"]
["Alaska","Valdez–Cordova Census Area",{"$nulls":4},"Georgia","GA-501","Georgia Balance of State CoC"]
["Alaska","Wrangell, City and Borough of",{"$nulls":4},"Georgia","GA-502","Fulton County CoC"]
["Alaska","Yakutat, City and Borough of",{"$nulls":4},"Georgia","GA-503","Athens-Clarke County CoC"]
["Alaska","Yukon–Koyukuk Census Area",{"$nulls":4},"Georgia","GA-504","Augusta-Richmond County CoC"]
["Arizona","*Entire State*",{"$nulls":4},"Georgia","GA-505","Columbus-Muscogee CoC"]
["Arizona","Apache County",{"$nulls":4},"Georgia","GA-506","Marietta/Cobb County CoC"]
["Arizona","Cochise County",{"$nulls":4},"Georgia","GA-507","Savannah/Chatham County CoC"]
["Arizona","Coconino County",{"$nulls":4},"Georgia","GA-508","DeKalb County CoC"]
["Arizona","Gila County",{"$nulls":4},"Guam","GU-500","Guam CoC"]
["Arizona","Graham County",{"$nulls":4},"Hawaiʻi","HI-500","Hawaii Balance of State CoC"]
["Arizona","Greenlee County",{"$nulls":4},"Hawaiʻi","HI-501","Honolulu City and County CoC"]
["Arizona","La Paz County",{"$nulls":4},"Idaho","ID-500","Boise/Ada County CoC"]
["Arizona","Maricopa County",{"$nulls":4},"Idaho","ID-501","Idaho Balance of State CoC"]
["Arizona","Mohave County",{"$nulls":4},"Illinois","IL-500","McHenry County CoC"]
["Arizona","Navajo County",{"$nulls":4},"Illinois","IL-501","Rockford/Winnebago, Boone Counties CoC"]
["Arizona","Pima County",{"$nulls":4},"Illinois","IL-502","Waukegan, North Chicago/Lake County CoC"]
["Arizona","Pinal County",{"$nulls":4},"Illinois","IL-503","Champaign, Urbana, Rantoul/Champaign County CoC"]
["Arizona","Santa Cruz County",{"$nulls":4},"Illinois","IL-504","Madison County CoC"]
["Arizona","Yavapai County",{"$nulls":4},"Illinois","IL-506","Joliet, Bolingbrook/Will County CoC"]
["Arizona","Yuma County",{"$nulls":4},"Illinois","IL-507","Peoria, Pekin/Fulton, Tazewell, Peoria, Woodford Counties CoC"]
["Arkansas","*Entire State*",{"$nulls":4},"Illinois","IL-508","East Saint Louis, Belleville/Saint Clair County CoC"]
["Arkansas","Arkansas County",{"$nulls":4},"Illinois","IL-509","DeKalb City and County CoC"]
["Arkansas","Ashley County",{"$nulls":4},"Illinois","IL-510","Chicago CoC"]
["Arkansas","Baxter County",{"$nulls":4},"Illinois","IL-511","Cook County CoC"]
["Arkansas","Benton County",{"$nulls":4},"Illinois","IL-512","Bloomington/Central Illinois CoC"]
["Arkansas","Boone County",{"$nulls":4},"Illinois","IL-513","Springfield/Sangamon County CoC"]
["Arkansas","Bradley County",{"$nulls":4},"Illinois","IL-514","DuPage County CoC"]
["Arkansas","Calhoun County",{"$nulls":4},"Illinois","IL-515","South Central Illinois CoC"]
["Arkansas","Carroll County",{"$nulls":4},"Illinois","IL-516","Decatur/Macon County CoC"]
["Arkansas","Chicot County",{"$nulls":4},"Illinois","IL-517","Aurora, Elgin/Kane County CoC"]
["Arkansas","Clark County",{"$nulls":4},"Illinois","IL-518","Rock Island, Moline/Northwestern Illinois CoC"]
["Arkansas","Clay County",{"$nulls":4},"Illinois","IL-519","West Central Illinois CoC"]
["Arkansas","Cleburne County",{"$nulls":4},"Illinois","IL-520","Southern Illinois CoC"]
["Arkansas","Cleveland County",{"$nulls":4},"Indiana","IN-502","Indiana Balance of State CoC"]
["Arkansas","Columbia County",{"$nulls":4},"Indiana","IN-503","Indianapolis CoC"]
["Arkansas","Conway County",{"$nulls":4},"Iowa","IA-500","Sioux City/Dakota, Woodbury Counties CoC"]
["Arkansas","Craighead County",{"$nulls":4},"Iowa","IA-501","Iowa Balance of State CoC"]
["Arkansas","Crawford County",{"$nulls":4},"Iowa","IA-502","Des Moines/Polk County CoC"]
["Arkansas","Crittenden County",{"$nulls":4},"Kansas","KS-502","Wichita/Sedgwick County CoC"]
["Arkansas","Cross County",{"$nulls":4},"Kansas","KS-503","Topeka/Shawnee County CoC"]
["Arkansas","Dallas County",{"$nulls":4},"Kansas","KS-505","Overland Park, Shawnee/Johnson County CoC"]
["Arkansas","Desha County",{"$nulls":4},"Kansas","KS-507","Kansas Balance of State CoC"]
["Arkansas","Drew County",{"$nulls":4},"Kentucky","KY-500","Kentucky Balance of State CoC"]
["Arkansas","Faulkner County",{"$nulls":4},"Kentucky","KY-501","Louisville-Jefferson County CoC"]
["Arkansas","Franklin County",{"$nulls":4},"Kentucky","KY-502","Lexington-Fayette County CoC"]
["Arkansas","Fulton County",{"$nulls":4},"Louisiana","LA-500","Lafayette/Acadiana Regional CoC"]
["Arkansas","Garland County",{"$nulls":4},"Louisiana","LA-502","Shreveport/Bossier/Northwest Louisiana CoC"]
["Arkansas","Grant County",{"$nulls":4},"Louisiana","LA-503","New Orleans/Jefferson Parish CoC"]
["Arkansas","Greene County",{"$nulls":4},"Louisiana","LA-505","Monroe/Northeast Louisiana CoC"]
["Arkansas","Hempstead County",{"$nulls":4},"Louisiana","LA-506","Slidell/Southeast Louisiana CoC"]
["Arkansas","Hot Spring County",{"$nulls":4},"Louisiana","LA-507","Alexandria/Central Louisiana CoC"]
["Arkansas","Howard County",{"$nulls":4},"Louisiana","LA-508","Houma-Terrebonne, Thibodaux CoC"]
["Arkansas","Independence County",{"$nulls":4},"Louisiana","LA-509","Louisiana Balance of State CoC"]
["Arkansas","Izard County",{"$nulls":4},"Maine","ME-500","Maine Statewide CoC"]
["Arkansas","Jackson County",{"$nulls":4},"Maryland","MD-500","Cumberland/Allegany County CoC"]
["Arkansas","Jefferson County",{"$nulls":4},"Maryland","MD-501","Baltimore CoC"]
["Arkansas","Johnson County",{"$nulls":4},"Maryland","MD-502","Harford County CoC"]
["Arkansas","Lafayette County",{"$nulls":4},"Maryland","MD-503","Annapolis/Anne Arundel County CoC"]
["Arkansas","Lawrence County",{"$nulls":4},"Maryland","MD-504","Howard County CoC"]
["Arkansas","Lee County",{"$nulls":4},"Maryland","MD-505","Baltimore County CoC"]
["Arkansas","Lincoln County",{"$nulls":4},"Maryland","MD-506","Carroll County CoC"]
["Arkansas","Little River County",{"$nulls":4},"Maryland","MD-507","Cecil County CoC"]
["Arkansas","Logan County",{"$nulls":4},"Maryland","MD-508","Charles, Calvert, Saint Mary's Counties CoC"]
["Arkansas","Lonoke County",{"$nulls":4},"Maryland","MD-509","Frederick City and County CoC"]
["Arkansas","Madison County",{"$nulls":4},"Maryland","MD-510","Garrett County CoC"]
["Arkansas","Marion County",{"$nulls":4},"Maryland","MD-511","Mid-Shore Regional CoC"]
["Arkansas","Miller County",{"$nulls":4},"Maryland","MD-512","Hagerstown/Washington County CoC"]
["Arkansas","Mississippi County",{"$nulls":4},"Maryland","MD-513","Wicomico, Somerset, Worcester Counties CoC"]
["Arkansas","Monroe County",{"$nulls":4},"Maryland","MD-600","Prince George's County CoC"]
["Arkansas","Montgomery County",{"$nulls":4},"Maryland","MD-601","Montgomery County CoC"]
["Arkansas","Nevada County",{"$nulls":4},"Massachusetts","MA-500","Boston CoC"]
["Arkansas","Newton County",{"$nulls":4},"Massachusetts","MA-502","Lynn CoC"]
["Arkansas","Ouachita County",{"$nulls":4},"Massachusetts","MA-503","Cape Cod Islands CoC"]
["Arkansas","Perry County",{"$nulls":4},"Massachusetts","MA-504","Springfield/Hampden County CoC"]
["Arkansas","Phillips County",{"$nulls":4},"Massachusetts","MA-505","New Bedford CoC"]
["Arkansas","Pike County",{"$nulls":4},"Massachusetts","MA-506","Worcester City and County CoC"]
["Arkansas","Poinsett County",{"$nulls":4},"Massachusetts","MA-507","Pittsfield/Berkshire, Franklin, Hampshire Counties CoC"]
["Arkansas","Polk County",{"$nulls":4},"Massachusetts","MA-508","Lowell CoC"]
["Arkansas","Pope County",{"$nulls":4},"Massachusetts","MA-509","Cambridge CoC"]
["Arkansas","Prairie County",{"$nulls":4},"Massachusetts","MA-510","Gloucester, Haverhill, Salem/Essex County CoC"]
["Arkansas","Pulaski County",{"$nulls":4},"Massachusetts","MA-511","Quincy, Brockton, Weymouth, Plymouth City and County CoC"]
["Arkansas","Randolph County",{"$nulls":4},"Massachusetts","MA-515","Fall River CoC"]
["Arkansas","Saline County",{"$nulls":4},"Massachusetts","MA-516","Massachusetts Balance of State CoC"]
["Arkansas","Scott County",{"$nulls":4},"Massachusetts","MA-517","Somerville CoC"]
["Arkansas","Searcy County",{"$nulls":4},"Massachusetts","MA-519","Attleboro, Taunton/Bristol County CoC"]
["Arkansas","Sebastian County",{"$nulls":4},"Michigan","MI-500","Michigan Balance of State CoC"]
["Arkansas","Sevier County",{"$nulls":4},"Michigan","MI-501","Detroit CoC"]
["Arkansas","Sharp County",{"$nulls":4},"Michigan","MI-502","Dearborn, Dearborn Heights, Westland/Wayne County CoC"]
["Arkansas","St. Francis County",{"$nulls":4},"Michigan","MI-503","Saint Clair Shores, Warren/Macomb County CoC"]
["Arkansas","Stone County",{"$nulls":4},"Michigan","MI-504","Pontiac, Royal Oak/Oakland County CoC"]
["Arkansas","Union County",{"$nulls":4},"Michigan","MI-505","Flint/Genesee County CoC"]
["Arkansas","Van Buren County",{"$nulls":4},"Michigan","MI-506","Grand Rapids/Wyoming/Kent County CoC"]
["Arkansas","Washington County",{"$nulls":4},"Michigan","MI-507","Portage, Kalamazoo City and County CoC"]
["Arkansas","White County",{"$nulls":4},"Michigan","MI-508","Lansing, East Lansing/Ingham County CoC"]
["Arkansas","Woodruff County",{"$nulls":4},"Michigan","MI-509","Washtenaw County CoC"]
["Arkansas","Yell County",{"$nulls":4},"Michigan","MI-510","Saginaw City and County CoC"]
["California","*Entire State*",{"$nulls":4},"Michigan","MI-511","Lenawee County CoC"]
["California","Alameda County",{"$nulls":4},"Michigan","MI-512","Grand Traverse, Antrim, Leelanau Counties CoC"]
["California","Alpine County",{"$nulls":4},"Michigan","MI-513","Marquette, Alger Counties CoC"]
["California","Amador County",{"$nulls":4},"Michigan","MI-514","Battle Creek/Calhoun County CoC"]
["California","Butte County",{"$nulls":4},"Michigan","MI-515","Monroe City and County CoC"]
["California","Calaveras County",{"$nulls":4},"Michigan","MI-516","Norton Shores, Muskegon City and County CoC"]
["California","Colusa County",{"$nulls":4},"Michigan","MI-517","Jackson City and County CoC"]
["California","Contra Costa County",{"$nulls":4},"Michigan","MI-518","Livingston County CoC"]
["California","Del Norte County",{"$nulls":4},"Michigan","MI-519","Holland/Ottawa County CoC"]
["California","El Dorado County",{"$nulls":4},"Michigan","MI-523","Eaton County CoC"]
["California","Fresno County",{"$nulls":4},"Minnesota","MN-500","Minneapolis/Hennepin County CoC"]
["California","Glenn County",{"$nulls":4},"Minnesota","MN-501","Saint Paul/Ramsey County CoC"]
["California","Humboldt County",{"$nulls":4},"Minnesota","MN-502","Rochester/Southeast Minnesota CoC"]
["California","Imperial County",{"$nulls":4},"Minnesota","MN-503","Dakota, Anoka, Washington, Scott, Carver Counties CoC"]
["California","Inyo County",{"$nulls":4},"Minnesota","MN-504","Northeast Minnesota CoC"]
["California","Kern County",{"$nulls":4},"Minnesota","MN-505","Saint Cloud/Central Minnesota CoC"]
["California","Kings County",{"$nulls":4},"Minnesota","MN-506","Northwest Minnesota CoC"]
["California","Lake County",{"$nulls":4},"Minnesota","MN-508","Moorhead/West Central Minnesota CoC"]
["California","Lassen County",{"$nulls":4},"Minnesota","MN-509","Duluth/Saint Louis County CoC"]
["California","Los Angeles County",{"$nulls":4},"Minnesota","MN-511","Southwest Minnesota CoC"]
["California","Madera County",{"$nulls":4},"Mississippi","MS-500","Jackson/Rankin, Madison Counties CoC"]
["California","Marin County",{"$nulls":4},"Mississippi","MS-501","Mississippi Balance of State CoC"]
["California","Mariposa County",{"$nulls":4},"Mississippi","MS-503","Gulf Port/Gulf Coast Regional CoC"]
["California","Mendocino County",{"$nulls":4},"Missouri","MO-500","Saint Louis County CoC"]
["California","Merced County",{"$nulls":4},"Missouri","MO-501","Saint Louis CoC"]
["California","Modoc County",{"$nulls":4},"Missouri","MO-503","Saint Charles City and County, Lincoln, Warren Counties CoC"]
["California","Mono County",{"$nulls":4},"Missouri","MO-600","Springfield/Greene, Christian, Webster Counties CoC"]
["California","Monterey County",{"$nulls":4},"Missouri","MO-602","Joplin/Jasper, Newton Counties CoC"]
["California","Napa County",{"$nulls":4},"Missouri","MO-603","Saint Joseph/Andrew, Buchanan, DeKalb Counties CoC"]
["California","Nevada County",{"$nulls":4},"Missouri","MO-604","Kansas City, Independence, Lee's Summit/Jackson, Wyandotte Counties CoC"]
["California","Orange County",{"$nulls":4},"Missouri","MO-606","Missouri Balance of State CoC"]
["California","Placer County",{"$nulls":4},"Montana","MT-500","Montana Statewide CoC"]
["California","Plumas County",{"$nulls":4},"Nebraska","NE-500","Nebraska Balance of State CoC"]
["California","Riverside County",{"$nulls":4},"Nebraska","NE-501","Omaha, Council Bluffs CoC"]
["California","Sacramento County",{"$nulls":4},"Nebraska","NE-502","Lincoln CoC"]
["California","San Benito County",{"$nulls":4},"Nevada","NV-500","Las Vegas/Clark County CoC"]
["California","San Bernardino County",{"$nulls":4},"Nevada","NV-501","Reno, Sparks/Washoe County CoC"]
["California","San Diego County",{"$nulls":4},"Nevada","NV-502","Nevada Balance of State CoC"]
["California","San Francisco, City and County of",{"$nulls":4},"New Hampshire","NH-500","New Hampshire Balance of State CoC"]
["California","San Joaquin County",{"$nulls":4},"New Hampshire","NH-501","Manchester CoC"]
["California","San Luis Obispo County",{"$nulls":4},"New Hampshire","NH-502","Nashua/Hillsborough County CoC"]
["California","San Mateo County",{"$nulls":4},"New Jersey","NJ-500","Atlantic City and County CoC"]
["California","Santa Barbara County",{"$nulls":4},"New Jersey","NJ-501","Bergen County CoC"]
["California","Santa Clara County",{"$nulls":4},"New Jersey","NJ-502","Burlington County CoC"]
["California","Santa Cruz County",{"$nulls":4},"New Jersey","NJ-503","Camden City and County/Gloucester, Cape May, Cumberland Counties CoC"]
["California","Shasta County",{"$nulls":4},"New Jersey","NJ-504","Newark/Essex County CoC"]
["California","Sierra County",{"$nulls":4},"New Jersey","NJ-506","Jersey City, Bayonne/Hudson County CoC"]
["California","Siskiyou County",{"$nulls":4},"New Jersey","NJ-507","New Brunswick/Middlesex County CoC"]
["California","Solano County",{"$nulls":4},"New Jersey","NJ-508","Monmouth County CoC"]
["California","Sonoma County",{"$nulls":4},"New Jersey","NJ-509","Morris County CoC"]
["California","Stanislaus County",{"$nulls":4},"New Jersey","NJ-510","Lakewood Township/Ocean County CoC"]
["California","Sutter County",{"$nulls":4},"New Jersey","NJ-511","Paterson/Passaic County CoC"]
["California","Tehama County",{"$nulls":4},"New Jersey","NJ-512","Salem County CoC"]
["California","Trinity County",{"$nulls":4},"New Jersey","NJ-513","Somerset County CoC"]
["California","Tulare County",{"$nulls":4},"New Jersey","NJ-514","Trenton/Mercer County CoC"]
["California","Tuolumne County",{"$nulls":4},"New Jersey","NJ-515","Elizabeth/Union County CoC"]
["California","Ventura County",{"$nulls":4},"New Jersey","NJ-516","Warren, Sussex, Hunterdon Counties CoC"]
["California","Yolo County",{"$nulls":4},"New Mexico","NM-500","Albuquerque CoC"]
["California","Yuba County",{"$nulls":4},"New Mexico","NM-501","New Mexico Balance of State CoC"]
["Colorado","*Entire State*",{"$nulls":4},"New York","NY-501","Elmira/Steuben, Allegany, Livingston, Chemung, Schuyler Counties CoC"]
["Colorado","Adams County",{"$nulls":4},"New York","NY-503","Albany City and County CoC"]
["Colorado","Alamosa County",{"$nulls":4},"New York","NY-504","Cattaraugus County CoC"]
["Colorado","Arapahoe County",{"$nulls":4},"New York","NY-505","Syracuse, Auburn/Onondaga, Oswego, Cayuga Counties CoC"]
["Colorado","Archuleta County",{"$nulls":4},"New York","NY-507","Schenectady City and County CoC"]
["Colorado","Baca County",{"$nulls":4},"New York","NY-508","Buffalo, Niagara Falls/Erie, Niagara, Orleans, Genesee, Wyoming Counties CoC"]
["Colorado","Bent County",{"$nulls":4},"New York","NY-510","Ithaca/Tompkins County CoC"]
["Colorado","Boulder County",{"$nulls":4},"New York","NY-511","Binghamton, Union Town/Broome, Otsego, Chenango, Delaware, Cortland, Tioga Counties CoC"]
["Colorado","Broomfield, City and County of",{"$nulls":4},"New York","NY-512","Troy/Rensselaer County CoC"]
["Colorado","Chaffee County",{"$nulls":4},"New York","NY-513","Wayne, Ontario, Seneca, Yates Counties CoC"]
["Colorado","Cheyenne County",{"$nulls":4},"New York","NY-514","Jamestown, Dunkirk/Chautauqua County CoC"]
["Colorado","Clear Creek County",{"$nulls":4},"New York","NY-516","Clinton County CoC"]
["Colorado","Conejos County",{"$nulls":4},"New York","NY-518","Utica, Rome/Oneida, Madison Counties CoC"]
["Colorado","Costilla County",{"$nulls":4},"New York","NY-519","Columbia, Greene Counties CoC"]
["Colorado","Crowley County",{"$nulls":4},"New York","NY-520","Franklin, Essex Counties CoC"]
["Colorado","Custer County",{"$nulls":4},"New York","NY-522","Jefferson, Lewis, Saint Lawrence Counties CoC"]
["Colorado","Delta County",{"$nulls":4},"New York","NY-523","Glens Falls, Saratoga Springs/Saratoga, Washington, Warren, Hamilton Counties CoC"]
["Colorado","Denver, City and County of",{"$nulls":4},"New York","NY-600","New York City CoC"]
["Colorado","Dolores County",{"$nulls":4},"New York","NY-601","Poughkeepsie/Dutchess County CoC"]
["Colorado","Douglas County",{"$nulls":4},"New York","NY-602","Newburgh, Middletown/Orange County CoC"]
["Colorado","Eagle County",{"$nulls":4},"New York","NY-603","Nassau, Suffolk Counties CoC"]
["Colorado","El Paso County",{"$nulls":4},"New York","NY-604","Yonkers, Mount Vernon/Westchester County CoC"]
["Colorado","Elbert County",{"$nulls":4},"New York","NY-606","Rockland County CoC"]
["Colorado","Fremont County",{"$nulls":4},"New York","NY-607","Sullivan County CoC"]
["Colorado","Garfield County",{"$nulls":4},"New York","NY-608","Kingston/Ulster County CoC"]
["Colorado","Gilpin County",{"$nulls":4},"New York","NY-500","Rochester, Irondequoit, Greece/Monroe County CoC"]
["Colorado","Grand County",{"$nulls":4},"North Carolina","NC-500","Winston-Salem/Forsyth County CoC"]
["Colorado","Gunnison County",{"$nulls":4},"North Carolina","NC-501","Asheville/Buncombe County CoC"]
["Colorado","Hinsdale County",{"$nulls":4},"North Carolina","NC-502","Durham City and County CoC"]
["Colorado","Huerfano County",{"$nulls":4},"North Carolina","NC-503","North Carolina Balance of State CoC"]
["Colorado","Jackson County",{"$nulls":4},"North Carolina","NC-504","Greensboro, High Point CoC"]
["Colorado","Jefferson County",{"$nulls":4},"North Carolina","NC-505","Charlotte/Mecklenburg County CoC"]
["Colorado","Kiowa County",{"$nulls":4},"North Carolina","NC-506","Wilmington/Brunswick, New Hanover, Pender Counties CoC"]
["Colorado","Kit Carson County",{"$nulls":4},"North Carolina","NC-507","Raleigh/Wake County CoC"]
["Colorado","La Plata County",{"$nulls":4},"North Carolina","NC-509","Gastonia/Cleveland, Gaston, Lincoln Counties CoC"]
["Colorado","Lake County",{"$nulls":4},"North Carolina","NC-511","Fayetteville/Cumberland County CoC"]
["Colorado","Larimer County",{"$nulls":4},"North Carolina","NC-513","Chapel Hill/Orange County CoC"]
["Colorado","Las Animas County",{"$nulls":4},"North Carolina","NC-516","Northwest North Carolina CoC"]
["Colorado","Lincoln County",{"$nulls":4},"North Dakota","ND-500","North Dakota Statewide CoC"]
["Colorado","Logan County",{"$nulls":4},"Ohio","OH-500","Cincinnati/Hamilton County CoC"]
["Colorado","Mesa County",{"$nulls":4},"Ohio","OH-501","Toledo/Lucas County CoC"]
["Colorado","Mineral County",{"$nulls":4},"Ohio","OH-502","Cleveland/Cuyahoga County CoC"]
["Colorado","Moffat County",{"$nulls":4},"Ohio","OH-503","Columbus/Franklin County CoC"]
["Colorado","Montezuma County",{"$nulls":4},"Ohio","OH-504","Youngstown/Mahoning County CoC"]
["Colorado","Montrose County",{"$nulls":4},"Ohio","OH-505","Dayton, Kettering/Montgomery County CoC"]
["Colorado","Morgan County",{"$nulls":4},"Ohio","OH-506","Akron, Barberton/Summit County CoC"]
["Colorado","Otero County",{"$nulls":4},"Ohio","OH-507","Ohio Balance of State CoC"]
["Colorado","Ouray County",{"$nulls":4},"Ohio","OH-508","Canton, Massillon, Alliance/Stark County CoC"]
["Colorado","Park County",{"$nulls":4},"Oklahoma","OK-500","North Central Oklahoma CoC"]
["Colorado","Phillips County",{"$nulls":4},"Oklahoma","OK-501","Tulsa City and County CoC"]
["Colorado","Pitkin County",{"$nulls":4},"Oklahoma","OK-502","Oklahoma City CoC"]
["Colorado","Prowers County",{"$nulls":4},"Oklahoma","OK-503","Oklahoma Balance of State CoC"]
["Colorado","Pueblo County",{"$nulls":4},"Oklahoma","OK-504","Norman/Cleveland County CoC"]
["Colorado","Rio Blanco County",{"$nulls":4},"Oklahoma","OK-505","Northeast Oklahoma CoC"]
["Colorado","Rio Grande County",{"$nulls":4},"Oklahoma","OK-506","Southwest Oklahoma Regional CoC"]
["Colorado","Routt County",{"$nulls":4},"Oklahoma","OK-507","Southeastern Oklahoma Regional CoC"]
["Colorado","Saguache County",{"$nulls":4},"Oregon","OR-500","Eugene, Springfield/Lane County CoC"]
["Colorado","San Juan County",{"$nulls":4},"Oregon","OR-501","Portland, Gresham/Multnomah County CoC"]
["Colorado","San Miguel County",{"$nulls":4},"Oregon","OR-502","Medford, Ashland/Jackson County CoC"]
["Colorado","Sedgwick County",{"$nulls":4},"Oregon","OR-503","Central Oregon CoC"]
["Colorado","Summit County",{"$nulls":4},"Oregon","OR-505","Oregon Balance of State CoC"]
["Colorado","Teller County",{"$nulls":4},"Oregon","OR-506","Hillsboro, Beaverton/Washington County CoC"]
["Colorado","Washington County",{"$nulls":4},"Oregon","OR-507","Clackamas County CoC"]
["Colorado","Weld County",{"$nulls":4},"Pennsylvania","PA-500","Philadelphia CoC"]
["Colorado","Yuma County",{"$nulls":4},"Pennsylvania","PA-501","Harrisburg/Dauphin County CoC"]
["Connecticut","*Entire State*",{"$nulls":4},"Pennsylvania","PA-502","Upper Darby, Chester, Haverford/Delaware County CoC"]
["Connecticut","Fairfield County",{"$nulls":4},"Pennsylvania","PA-503","Wilkes-Barre, Hazleton, Luzerne County CoC"]
["Connecticut","Hartford County",{"$nulls":4},"Pennsylvania","PA-504","Lower Merion, Norristown, Abington/Montgomery County CoC"]
["Connecticut","Litchfield County",{"$nulls":4},"Pennsylvania","PA-505","Chester County CoC"]
["Connecticut","Middlesex County",{"$nulls":4},"Pennsylvania","PA-506","Reading/Berks County CoC"]
["Connecticut","New Haven County",{"$nulls":4},"Pennsylvania","PA-508","Scranton/Lackawanna County CoC"]
["Connecticut","New London County",{"$nulls":4},"Pennsylvania","PA-509","Eastern Pennsylvania CoC"]
["Connecticut","Tolland County",{"$nulls":4},"Pennsylvania","PA-510","Lancaster City and County CoC"]
["Connecticut","Windham County",{"$nulls":4},"Pennsylvania","PA-511","Bristol, Bensalem/Bucks County CoC"]
["Delaware","*Entire State*",{"$nulls":4},"Pennsylvania","PA-512","York City and County CoC"]
["Delaware","Kent County",{"$nulls":4},"Pennsylvania","PA-600","Pittsburgh, McKeesport, Penn Hills/Allegheny County CoC"]
["Delaware","New Castle County",{"$nulls":4},"Pennsylvania","PA-601","Western Pennsylvania CoC"]
["Delaware","Sussex County",{"$nulls":4},"Pennsylvania","PA-603","Beaver County CoC"]
["District of Columbia","District of Columbia",{"$nulls":4},"Pennsylvania","PA-605","Erie City and County CoC"]
["Florida","*Entire State*",{"$nulls":4},"Puerto Rico","PR-502","Puerto Rico Balance of Commonwealth CoC"]
["Florida","Alachua County",{"$nulls":4},"Puerto Rico","PR-503","South-Southeast Puerto Rico CoC"]
["Florida","Baker County",{"$nulls":4},"Rhode Island","RI-500","Rhode Island Statewide CoC"]
["Florida","Bay County",{"$nulls":4},"South Carolina","SC-500","Charleston/Low Country CoC"]
["Florida","Bradford County",{"$nulls":4},"South Carolina","SC-501","Greenville, Anderson, Spartanburg/Upstate CoC"]
["Florida","Brevard County",{"$nulls":4},"South Carolina","SC-502","Columbia/Midlands CoC"]
["Florida","Broward County",{"$nulls":4},"South Carolina","SC-503","Myrtle Beach, Sumter City and County CoC"]
["Florida","Calhoun County",{"$nulls":4},"South Dakota","SD-500","South Dakota Statewide CoC"]
["Florida","Charlotte County",{"$nulls":4},"Tennessee","TN-500","Chattanooga/Southeast Tennessee CoC"]
["Florida","Citrus County",{"$nulls":4},"Tennessee","TN-501","Memphis/Shelby County CoC"]
["Florida","Clay County",{"$nulls":4},"Tennessee","TN-502","Knoxville/Knox County CoC"]
["Florida","Collier County",{"$nulls":4},"Tennessee","TN-503","Central Tennessee CoC"]
["Florida","Columbia County",{"$nulls":4},"Tennessee","TN-504","Nashville-Davidson County CoC"]
["Florida","DeSoto County",{"$nulls":4},"Tennessee","TN-506","Upper Cumberland CoC"]
["Florida","Dixie County",{"$nulls":4},"Tennessee","TN-507","Jackson/West Tennessee CoC"]
["Florida","Duval County",{"$nulls":4},"Tennessee","TN-509","Appalachian Regional CoC"]
["Florida","Escambia County",{"$nulls":4},"Tennessee","TN-510","Murfreesboro/Rutherford County CoC"]
["Florida","Flagler County",{"$nulls":4},"Tennessee","TN-512","Morristown/Blount, Sevier, Campbell, Cocke Counties CoC"]
["Florida","Franklin County",{"$nulls":4},"Texas","TX-500","San Antonio/Bexar County CoC"]
["Florida","Gadsden County",{"$nulls":4},"Texas","TX-503","Austin/Travis County CoC"]
["Florida","Gilchrist County",{"$nulls":4},"Texas","TX-600","Dallas City and County, Irving CoC"]
["Florida","Glades County",{"$nulls":4},"Texas","TX-601","Fort Worth, Arlington/Tarrant County CoC"]
["Florida","Gulf County",{"$nulls":4},"Texas","TX-603","El Paso City and County CoC"]
["Florida","Hamilton County",{"$nulls":4},"Texas","TX-604","Waco/McLennan County CoC"]
["Florida","Hardee County",{"$nulls":4},"Texas","TX-607","Texas Balance of State CoC"]
["Florida","Hendry County",{"$nulls":4},"Texas","TX-611","Amarillo CoC"]
["Florida","Hernando County",{"$nulls":4},"Texas","TX-624","Wichita Falls/Wise, Palo Pinto, Wichita, Archer Counties CoC"]
["Florida","Highlands County",{"$nulls":4},"Texas","TX-700","Houston, Pasadena, Conroe/Harris, Fort Bend, Montgomery Counties CoC"]
["Florida","Hillsborough County",{"$nulls":4},"Texas","TX-701","Bryan, College Station/Brazos Valley CoC"]
["Florida","Holmes County",{"$nulls":4},"Utah","UT-500","Salt Lake City and County CoC"]
["Florida","Indian River County",{"$nulls":4},"Utah","UT-503","Utah Balance of State CoC"]
["Florida","Jackson County",{"$nulls":4},"Utah","UT-504","Provo/Mountainland CoC"]
["Florida","Jefferson County",{"$nulls":4},"Vermont","VT-500","Vermont Balance of State CoC"]
["Florida","Lafayette County",{"$nulls":4},"Vermont","VT-501","Burlington/Chittenden County CoC"]
["Florida","Lake County",{"$nulls":4},"Virgin Islands (U.S.)","VI-500","Virgin Islands CoC"]
["Florida","Lee County",{"$nulls":4},"Virginia","VA-500","Richmond/Henrico, Chesterfield, Hanover Counties CoC"]
["Florida","Leon County",{"$nulls":4},"Virginia","VA-501","Norfolk, Chesapeake, Suffolk/Isle of Wight, Southampton Counties CoC"]
["Florida","Levy County",{"$nulls":4},"Virginia","VA-502","Roanoke City and County, Salem CoC"]
["Florida","Liberty County",{"$nulls":4},"Virginia","VA-503","Virginia Beach CoC"]
["Florida","Madison County",{"$nulls":4},"Virginia","VA-504","Charlottesville CoC"]
["Florida","Manatee County",{"$nulls":4},"Virginia","VA-505","Newport News, Hampton/Virginia Peninsula CoC"]
["Florida","Marion County",{"$nulls":4},"Virginia","VA-507","Portsmouth CoC"]
["Florida","Martin County",{"$nulls":4},"Virginia","VA-508","Lynchburg CoC"]
["Florida","Miami-Dade County",{"$nulls":4},"Virginia","VA-513","Harrisonburg, Winchester/Western Virginia CoC"]
["Florida","Monroe County",{"$nulls":4},"Virginia","VA-514","Fredericksburg/Spotsylvania, Stafford Counties CoC"]
["Florida","Nassau County",{"$nulls":4},"Virginia","VA-521","Virginia Balance of State CoC"]
["Florida","Okaloosa County",{"$nulls":4},"Virginia","VA-600","Arlington County CoC"]
["Florida","Okeechobee County",{"$nulls":4},"Virginia","VA-601","Fairfax County CoC"]
["Florida","Orange County",{"$nulls":4},"Virginia","VA-602","Loudoun County CoC"]
["Florida","Osceola County",{"$nulls":4},"Virginia","VA-603","Alexandria CoC"]
["Florida","Palm Beach County",{"$nulls":4},"Virginia","VA-604","Prince William County CoC"]
["Florida","Pasco County",{"$nulls":4},"Washington","WA-500","Seattle/King County CoC"]
["Florida","Pinellas County",{"$nulls":4},"Washington","WA-501","Washington Balance of State CoC"]
["Florida","Polk County",{"$nulls":4},"Washington","WA-502","Spokane City and County CoC"]
["Florida","Putnam County",{"$nulls":4},"Washington","WA-503","Tacoma, Lakewood/Pierce County CoC"]
["Florida","Santa Rosa County",{"$nulls":4},"Washington","WA-504","Everett/Snohomish County CoC"]
["Florida","Sarasota County",{"$nulls":4},"Washington","WA-507","Yakima City and County CoC"]
["Florida","Seminole County",{"$nulls":4},"Washington","WA-508","Vancouver/Clark County CoC"]
["Florida","St. Johns County",{"$nulls":4},"West Virginia","WV-500","Wheeling, Weirton Area CoC"]
["Florida","St. Lucie County",{"$nulls":4},"West Virginia","WV-501","Huntington/Cabell, Wayne Counties CoC"]
["Florida","Sumter County",{"$nulls":4},"West Virginia","WV-503","Charleston/Kanawha, Putnam, Boone, Clay Counties CoC"]
["Florida","Suwannee County",{"$nulls":4},"West Virginia","WV-508","West Virginia Balance of State CoC"]
["Florida","Taylor County",{"$nulls":4},"Wisconsin","WI-500","Wisconsin Balance of State CoC"]
["Florida","Union County",{"$nulls":4},"Wisconsin","WI-501","Milwaukee City and County CoC"]
["Florida","Volusia County",{"$nulls":4},"Wisconsin","WI-502","Racine City and County CoC"]
["Florida","Wakulla County",{"$nulls":4},"Wisconsin","WI-503","Madison/Dane County CoC"]
["Florida","Walton County",{"$nulls":4},"Wyoming","WY-500","Wyoming Statewide CoC"]
["Florida","Washington County"]
["Georgia","*Entire State*"]
["Georgia","Appling County"]
["Georgia","Atkinson County"]
["Georgia","Bacon County"]
["Georgia","Baker County"]
["Georgia","Baldwin County"]
["Georgia","Banks County"]
["Georgia","Barrow County"]
["Georgia","Bartow County"]
["Georgia","Ben Hill County"]
["Georgia","Berrien County"]
["Georgia","Bibb County"]
["Georgia","Bleckley County"]
["Georgia","Brantley County"]
["Georgia","Brooks County"]
["Georgia","Bryan County"]
["Georgia","Bulloch County"]
["Georgia","Burke County"]
["Georgia","Butts County"]
["Georgia","Calhoun County"]
["Georgia","Camden County"]
["Georgia","Candler County"]
["Georgia","Carroll County"]
["Georgia","Catoosa County"]
["Georgia","Charlton County"]
["Georgia","Chatham County"]
["Georgia","Chattahoochee County"]
["Georgia","Chattooga County"]
["Georgia","Cherokee County"]
["Georgia","Clarke County"]
["Georgia","Clay County"]
["Georgia","Clayton County"]
["Georgia","Clinch County"]
["Georgia","Cobb County"]
["Georgia","Coffee County"]
["Georgia","Colquitt County"]
["Georgia","Columbia County"]
["Georgia","Cook County"]
["Georgia","Coweta County"]
["Georgia","Crawford County"]
["Georgia","Crisp County"]
["Georgia","Dade County"]
["Georgia","Dawson County"]
["Georgia","Decatur County"]
["Georgia","DeKalb County"]
["Georgia","Dodge County"]
["Georgia","Dooly County"]
["Georgia","Dougherty County"]
["Georgia","Douglas County"]
["Georgia","Early County"]
["Georgia","Echols County"]
["Georgia","Effingham County"]
["Georgia","Elbert County"]
["Georgia","Emanuel County"]
["Georgia","Evans County"]
["Georgia","Fannin County"]
["Georgia","Fayette County"]
["Georgia","Floyd County"]
["Georgia","Forsyth County"]
["Georgia","Franklin County"]
["Georgia","Fulton County"]
["Georgia","Gilmer County"]
["Georgia","Glascock County"]
["Georgia","Glynn County"]
["Georgia","Gordon County"]
["Georgia","Grady County"]
["Georgia","Greene County"]
["Georgia","Gwinnett County"]
["Georgia","Habersham County"]
["Georgia","Hall County"]
["Georgia","Hancock County"]
["Georgia","Haralson County"]
["Georgia","Harris County"]
["Georgia","Hart County"]
["Georgia","Heard County"]
["Georgia","Henry County"]
["Georgia","Houston County"]
["Georgia","Irwin County"]
["Georgia","Jackson County"]
["Georgia","Jasper County"]
["Georgia","Jeff Davis County"]
["Georgia","Jefferson County"]
["Georgia","Jenkins County"]
["Georgia","Johnson County"]
["Georgia","Jones County"]
["Georgia","Lamar County"]
["Georgia","Lanier County"]
["Georgia","Laurens County"]
["Georgia","Lee County"]
["Georgia","Liberty County"]
["Georgia","Lincoln County"]
["Georgia","Long County"]
["Georgia","Lowndes County"]
["Georgia","Lumpkin County"]
["Georgia","Macon County"]
["Georgia","Madison County"]
["Georgia","Marion County"]
["Georgia","McDuffie County"]
["Georgia","McIntosh County"]
["Georgia","Meriwether County"]
["Georgia","Miller County"]
["Georgia","Mitchell County"]
["Georgia","Monroe County"]
["Georgia","Montgomery County"]
["Georgia","Morgan County"]
["Georgia","Murray County"]
["Georgia","Muscogee County"]
["Georgia","Newton County"]
["Georgia","Oconee County"]
["Georgia","Oglethorpe County"]
["Georgia","Paulding County"]
["Georgia","Peach County"]
["Georgia","Pickens County"]
["Georgia","Pierce County"]
["Georgia","Pike County"]
["Georgia","Polk County"]
["Georgia","Pulaski County"]
["Georgia","Putnam County"]
["Georgia","Quitman County"]
["Georgia","Rabun County"]
["Georgia","Randolph County"]
["Georgia","Richmond County"]
["Georgia","Rockdale County"]
["Georgia","Schley County"]
["Georgia","Screven County"]
["Georgia","Seminole County"]
["Georgia","Spalding County"]
["Georgia","Stephens County"]
["Georgia","Stewart County"]
["Georgia","Sumter County"]
["Georgia","Talbot County"]
["Georgia","Taliaferro County"]
["Georgia","Tattnall County"]
["Georgia","Taylor County"]
["Georgia","Telfair County"]
["Georgia","Terrell County"]
["Georgia","Thomas County"]
["Georgia","Tift County"]
["Georgia","Toombs County"]
["Georgia","Towns County"]
["Georgia","Treutlen County"]
["Georgia","Troup County"]
["Georgia","Turner County"]
["Georgia","Twiggs County"]
["Georgia","Union County"]
["Georgia","Upson County"]
["Georgia","Walker County"]
["Georgia","Walton County"]
["Georgia","Ware County"]
["Georgia","Warren County"]
["Georgia","Washington County"]
["Georgia","Wayne County"]
["Georgia","Webster County"]
["Georgia","Wheeler County"]
["Georgia","White County"]
["Georgia","Whitfield County"]
["Georgia","Wilcox County"]
["Georgia","Wilkes County"]
["Georgia","Wilkinson County"]
["Georgia","Worth County"]
["Hawaiʻi","*Entire State*"]
["Hawaiʻi","Hawaii County"]
["Hawaiʻi","Honolulu, City and County of"]
["Hawaiʻi","Kalawao County"]
["Hawaiʻi","Kauai County"]
["Hawaiʻi","Maui County"]
["Idaho","*Entire State*"]
["Idaho","Ada County"]
["Idaho","Adams County"]
["Idaho","Bannock County"]
["Idaho","Bear Lake County"]
["Idaho","Benewah County"]
["Idaho","Bingham County"]
["Idaho","Blaine County"]
["Idaho","Boise County"]
["Idaho","Bonner County"]
["Idaho","Bonneville County"]
["Idaho","Boundary County"]
["Idaho","Butte County"]
["Idaho","Camas County"]
["Idaho","Canyon County"]
["Idaho","Caribou County"]
["Idaho","Cassia County"]
["Idaho","Clark County"]
["Idaho","Clearwater County"]
["Idaho","Custer County"]
["Idaho","Elmore County"]
["Idaho","Franklin County"]
["Idaho","Fremont County"]
["Idaho","Gem County"]
["Idaho","Gooding County"]
["Idaho","Idaho County"]
["Idaho","Jefferson County"]
["Idaho","Jerome County"]
["Idaho","Kootenai County"]
["Idaho","Latah County"]
["Idaho","Lemhi County"]
["Idaho","Lewis County"]
["Idaho","Lincoln County"]
["Idaho","Madison County"]
["Idaho","Minidoka County"]
["Idaho","Nez Perce County"]
["Idaho","Oneida County"]
["Idaho","Owyhee County"]
["Idaho","Payette County"]
["Idaho","Power County"]
["Idaho","Shoshone County"]
["Idaho","Teton County"]
["Idaho","Twin Falls County"]
["Idaho","Valley County"]
["Idaho","Washington County"]
["Illinois","*Entire State*"]
["Illinois","Adams County"]
["Illinois","Alexander County"]
["Illinois","Bond County"]
["Illinois","Boone County"]
["Illinois","Brown County"]
["Illinois","Bureau County"]
["Illinois","Calhoun County"]
["Illinois","Carroll County"]
["Illinois","Cass County"]
["Illinois","Champaign County"]
["Illinois","Christian County"]
["Illinois","Clark County"]
["Illinois","Clay County"]
["Illinois","Clinton County"]
["Illinois","Coles County"]
["Illinois","Cook County"]
["Illinois","Crawford County"]
["Illinois","Cumberland County"]
["Illinois","De Witt County"]
["Illinois","DeKalb County"]
["Illinois","Douglas County"]
["Illinois","DuPage County"]
["Illinois","Edgar County"]
["Illinois","Edwards County"]
["Illinois","Effingham County"]
["Illinois","Fayette County"]
["Illinois","Ford County"]
["Illinois","Franklin County"]
["Illinois","Fulton County"]
["Illinois","Gallatin County"]
["Illinois","Greene County"]
["Illinois","Grundy County"]
["Illinois","Hamilton County"]
["Illinois","Hancock County"]
["Illinois","Hardin County"]
["Illinois","Henderson County"]
["Illinois","Henry County"]
["Illinois","Iroquois County"]
["Illinois","Jackson County"]
["Illinois","Jasper County"]
["Illinois","Jefferson County"]
["Illinois","Jersey County"]
["Illinois","Jo Daviess County"]
["Illinois","Johnson County"]
["Illinois","Kane County"]
["Illinois","Kankakee County"]
["Illinois","Kendall County"]
["Illinois","Knox County"]
["Illinois","Lake County"]
["Illinois","LaSalle County"]
["Illinois","Lawrence County"]
["Illinois","Lee County"]
["Illinois","Livingston County"]
["Illinois","Logan County"]
["Illinois","Macon County"]
["Illinois","Macoupin County"]
["Illinois","Madison County"]
["Illinois","Marion County"]
["Illinois","Marshall County"]
["Illinois","Mason County"]
["Illinois","Massac County"]
["Illinois","McDonough County"]
["Illinois","McHenry County"]
["Illinois","McLean County"]
["Illinois","Menard County"]
["Illinois","Mercer County"]
["Illinois","Monroe County"]
["Illinois","Montgomery County"]
["Illinois","Morgan County"]
["Illinois","Moultrie County"]
["Illinois","Ogle County"]
["Illinois","Peoria County"]
["Illinois","Perry County"]
["Illinois","Piatt County"]
["Illinois","Pike County"]
["Illinois","Pope County"]
["Illinois","Pulaski County"]
["Illinois","Putnam County"]
["Illinois","Randolph County"]
["Illinois","Richland County"]
["Illinois","Rock Island County"]
["Illinois","Saline County"]
["Illinois","Sangamon County"]
["Illinois","Schuyler County"]
["Illinois","Scott County"]
["Illinois","Shelby County"]
["Illinois","St. Clair County"]
["Illinois","Stark County"]
["Illinois","Stephenson County"]
["Illinois","Tazewell County"]
["Illinois","Union County"]
["Illinois","Vermilion County"]
["Illinois","Wabash County"]
["Illinois","Warren County"]
["Illinois","Washington County"]
["Illinois","Wayne County"]
["Illinois","White County"]
["Illinois","Whiteside County"]
["Illinois","Will County"]
["Illinois","Williamson County"]
["Illinois","Winnebago County"]
["Illinois","Woodford County"]
["Indiana","*Entire State*"]
["Indiana","Adams County"]
["Indiana","Allen County"]
["Indiana","Bartholomew County"]
["Indiana","Benton County"]
["Indiana","Blackford County"]
["Indiana","Boone County"]
["Indiana","Brown County"]
["Indiana","Carroll County"]
["Indiana","Cass County"]
["Indiana","Clark County"]
["Indiana","Clay County"]
["Indiana","Clinton County"]
["Indiana","Crawford County"]
["Indiana","Daviess County"]
["Indiana","Dearborn County"]
["Indiana","Decatur County"]
["Indiana","DeKalb County"]
["Indiana","Delaware County"]
["Indiana","Dubois County"]
["Indiana","Elkhart County"]
["Indiana","Fayette County"]
["Indiana","Floyd County"]
["Indiana","Fountain County"]
["Indiana","Franklin County"]
["Indiana","Fulton County"]
["Indiana","Gibson County"]
["Indiana","Grant County"]
["Indiana","Greene County"]
["Indiana","Hamilton County"]
["Indiana","Hancock County"]
["Indiana","Harrison County"]
["Indiana","Hendricks County"]
["Indiana","Henry County"]
["Indiana","Howard County"]
["Indiana","Huntington County"]
["Indiana","Jackson County"]
["Indiana","Jasper County"]
["Indiana","Jay County"]
["Indiana","Jefferson County"]
["Indiana","Jennings County"]
["Indiana","Johnson County"]
["Indiana","Knox County"]
["Indiana","Kosciusko County"]
["Indiana","LaGrange County"]
["Indiana","Lake County"]
["Indiana","LaPorte County"]
["Indiana","Lawrence County"]
["Indiana","Madison County"]
["Indiana","Marion County"]
["Indiana","Marshall County"]
["Indiana","Martin County"]
["Indiana","Miami County"]
["Indiana","Monroe County"]
["Indiana","Montgomery County"]
["Indiana","Morgan County"]
["Indiana","Newton County"]
["Indiana","Noble County"]
["Indiana","Ohio County"]
["Indiana","Orange County"]
["Indiana","Owen County"]
["Indiana","Parke County"]
["Indiana","Perry County"]
["Indiana","Pike County"]
["Indiana","Porter County"]
["Indiana","Posey County"]
["Indiana","Pulaski County"]
["Indiana","Putnam County"]
["Indiana","Randolph County"]
["Indiana","Ripley County"]
["Indiana","Rush County"]
["Indiana","Scott County"]
["Indiana","Shelby County"]
["Indiana","Spencer County"]
["Indiana","St. Joseph County"]
["Indiana","Starke County"]
["Indiana","Steuben County"]
["Indiana","Sullivan County"]
["Indiana","Switzerland County"]
["Indiana","Tippecanoe County"]
["Indiana","Tipton County"]
["Indiana","Union County"]
["Indiana","Vanderburgh County"]
["Indiana","Vermillion County"]
["Indiana","Vigo County"]
["Indiana","Wabash County"]
["Indiana","Warren County"]
["Indiana","Warrick County"]
["Indiana","Washington County"]
["Indiana","Wayne County"]
["Indiana","Wells County"]
["Indiana","White County"]
["Indiana","Whitley County"]
["Iowa","*Entire State*"]
["Iowa","Adair County"]
["Iowa","Adams County"]
["Iowa","Allamakee County"]
["Iowa","Appanoose County"]
["Iowa","Audubon County"]
["Iowa","Benton County"]
["Iowa","Black Hawk County"]
["Iowa","Boone County"]
["Iowa","Bremer County"]
["Iowa","Buchanan County"]
["Iowa","Buena Vista County"]
["Iowa","Butler County"]
["Iowa","Calhoun County"]
["Iowa","Carroll County"]
["Iowa","Cass County"]
["Iowa","Cedar County"]
["Iowa","Cerro Gordo County"]
["Iowa","Cherokee County"]
["Iowa","Chickasaw County"]
["Iowa","Clarke County"]
["Iowa","Clay County"]
["Iowa","Clayton County"]
["Iowa","Clinton County"]
["Iowa","Crawford County"]
["Iowa","Dallas County"]
["Iowa","Davis County"]
["Iowa","Decatur County"]
["Iowa","Delaware County"]
["Iowa","Des Moines County"]
["Iowa","Dickinson County"]
["Iowa","Dubuque County"]
["Iowa","Emmet County"]
["Iowa","Fayette County"]
["Iowa","Floyd County"]
["Iowa","Franklin County"]
["Iowa","Fremont County"]
["Iowa","Greene County"]
["Iowa","Grundy County"]
["Iowa","Guthrie County"]
["Iowa","Hamilton County"]
["Iowa","Hancock County"]
["Iowa","Hardin County"]
["Iowa","Harrison County"]
["Iowa","Henry County"]
["Iowa","Howard County"]
["Iowa","Humboldt County"]
["Iowa","Ida County"]
["Iowa","Iowa County"]
["Iowa","Jackson County"]
["Iowa","Jasper County"]
["Iowa","Jefferson County"]
["Iowa","Johnson County"]
["Iowa","Jones County"]
["Iowa","Keokuk County"]
["Iowa","Kossuth County"]
["Iowa","Lee County"]
["Iowa","Linn County"]
["Iowa","Louisa County"]
["Iowa","Lucas County"]
["Iowa","Lyon County"]
["Iowa","Madison County"]
["Iowa","Mahaska County"]
["Iowa","Marion County"]
["Iowa","Marshall County"]
["Iowa","Mills County"]
["Iowa","Mitchell County"]
["Iowa","Monona County"]
["Iowa","Monroe County"]
["Iowa","Montgomery County"]
["Iowa","Muscatine County"]
["Iowa","O'Brien County"]
["Iowa","Osceola County"]
["Iowa","Page County"]
["Iowa","Palo Alto County"]
["Iowa","Plymouth County"]
["Iowa","Pocahontas County"]
["Iowa","Polk County"]
["Iowa","Pottawattamie County"]
["Iowa","Poweshiek County"]
["Iowa","Ringgold County"]
["Iowa","Sac County"]
["Iowa","Scott County"]
["Iowa","Shelby County"]
["Iowa","Sioux County"]
["Iowa","Story County"]
["Iowa","Tama County"]
["Iowa","Taylor County"]
["Iowa","Union County"]
["Iowa","Van Buren County"]
["Iowa","Wapello County"]
["Iowa","Warren County"]
["Iowa","Washington County"]
["Iowa","Wayne County"]
["Iowa","Webster County"]
["Iowa","Winnebago County"]
["Iowa","Winneshiek County"]
["Iowa","Woodbury County"]
["Iowa","Worth County"]
["Iowa","Wright County"]
["Kansas","*Entire State*"]
["Kansas","Allen County"]
["Kansas","Anderson County"]
["Kansas","Atchison County"]
["Kansas","Barber County"]
["Kansas","Barton County"]
["Kansas","Bourbon County"]
["Kansas","Brown County"]
["Kansas","Butler County"]
["Kansas","Chase County"]
["Kansas","Chautauqua County"]
["Kansas","Cherokee County"]
["Kansas","Cheyenne County"]
["Kansas","Clark County"]
["Kansas","Clay County"]
["Kansas","Cloud County"]
["Kansas","Coffey County"]
["Kansas","Comanche County"]
["Kansas","Cowley County"]
["Kansas","Crawford County"]
["Kansas","Decatur County"]
["Kansas","Dickinson County"]
["Kansas","Doniphan County"]
["Kansas","Douglas County"]
["Kansas","Edwards County"]
["Kansas","Elk County"]
["Kansas","Ellis County"]
["Kansas","Ellsworth County"]
["Kansas","Finney County"]
["Kansas","Ford County"]
["Kansas","Franklin County"]
["Kansas","Geary County"]
["Kansas","Gove County"]
["Kansas","Graham County"]
["Kansas","Grant County"]
["Kansas","Gray County"]
["Kansas","Greeley County"]
["Kansas","Greenwood County"]
["Kansas","Hamilton County"]
["Kansas","Harper County"]
["Kansas","Harvey County"]
["Kansas","Haskell County"]
["Kansas","Hodgeman County"]
["Kansas","Jackson County"]
["Kansas","Jefferson County"]
["Kansas","Jewell County"]
["Kansas","Johnson County"]
["Kansas","Kearny County"]
["Kansas","Kingman County"]
["Kansas","Kiowa County"]
["Kansas","Labette County"]
["Kansas","Lane County"]
["Kansas","Leavenworth County"]
["Kansas","Lincoln County"]
["Kansas","Linn County"]
["Kansas","Logan County"]
["Kansas","Lyon County"]
["Kansas","Marion County"]
["Kansas","Marshall County"]
["Kansas","McPherson County"]
["Kansas","Meade County"]
["Kansas","Miami County"]
["Kansas","Mitchell County"]
["Kansas","Montgomery County"]
["Kansas","Morris County"]
["Kansas","Morton County"]
["Kansas","Nemaha County"]
["Kansas","Neosho County"]
["Kansas","Ness County"]
["Kansas","Norton County"]
["Kansas","Osage County"]
["Kansas","Osborne County"]
["Kansas","Ottawa County"]
["Kansas","Pawnee County"]
["Kansas","Phillips County"]
["Kansas","Pottawatomie County"]
["Kansas","Pratt County"]
["Kansas","Rawlins County"]
["Kansas","Reno County"]
["Kansas","Republic County"]
["Kansas","Rice County"]
["Kansas","Riley County"]
["Kansas","Rooks County"]
["Kansas","Rush County"]
["Kansas","Russell County"]
["Kansas","Saline County"]
["Kansas","Scott County"]
["Kansas","Sedgwick County"]
["Kansas","Seward County"]
["Kansas","Shawnee County"]
["Kansas","Sheridan County"]
["Kansas","Sherman County"]
["Kansas","Smith County"]
["Kansas","Stafford County"]
["Kansas","Stanton County"]
["Kansas","Stevens County"]
["Kansas","Sumner County"]
["Kansas","Thomas County"]
["Kansas","Trego County"]
["Kansas","Wabaunsee County"]
["Kansas","Wallace County"]
["Kansas","Washington County"]
["Kansas","Wichita County"]
["Kansas","Wilson County"]
["Kansas","Woodson County"]
["Kansas","Wyandotte County"]
["Kentucky","*Entire State*"]
["Kentucky","Adair County"]
["Kentucky","Allen County"]
["Kentucky","Anderson County"]
["Kentucky","Ballard County"]
["Kentucky","Barren County"]
["Kentucky","Bath County"]
["Kentucky","Bell County"]
["Kentucky","Boone County"]
["Kentucky","Bourbon County"]
["Kentucky","Boyd County"]
["Kentucky","Boyle County"]
["Kentucky","Bracken County"]
["Kentucky","Breathitt County"]
["Kentucky","Breckinridge County"]
["Kentucky","Bullitt County"]
["Kentucky","Butler County"]
["Kentucky","Caldwell County"]
["Kentucky","Calloway County"]
["Kentucky","Campbell County"]
["Kentucky","Carlisle County"]
["Kentucky","Carroll County"]
["Kentucky","Carter County"]
["Kentucky","Casey County"]
["Kentucky","Christian County"]
["Kentucky","Clark County"]
["Kentucky","Clay County"]
["Kentucky","Clinton County"]
["Kentucky","Crittenden County"]
["Kentucky","Cumberland County"]
["Kentucky","Daviess County"]
["Kentucky","Edmonson County"]
["Kentucky","Elliott County"]
["Kentucky","Estill County"]
["Kentucky","Fayette County"]
["Kentucky","Fleming County"]
["Kentucky","Floyd County"]
["Kentucky","Franklin County"]
["Kentucky","Fulton County"]
["Kentucky","Gallatin County"]
["Kentucky","Garrard County"]
["Kentucky","Grant County"]
["Kentucky","Graves County"]
["Kentucky","Grayson County"]
["Kentucky","Green County"]
["Kentucky","Greenup County"]
["Kentucky","Hancock County"]
["Kentucky","Hardin County"]
["Kentucky","Harlan County"]
["Kentucky","Harrison County"]
["Kentucky","Hart County"]
["Kentucky","Henderson County"]
["Kentucky","Henry County"]
["Kentucky","Hickman County"]
["Kentucky","Hopkins County"]
["Kentucky","Jackson County"]
["Kentucky","Jefferson County"]
["Kentucky","Jessamine County"]
["Kentucky","Johnson County"]
["Kentucky","Kenton County"]
["Kentucky","Knott County"]
["Kentucky","Knox County"]
["Kentucky","LaRue County"]
["Kentucky","Laurel County"]
["Kentucky","Lawrence County"]
["Kentucky","Lee County"]
["Kentucky","Leslie County"]
["Kentucky","Letcher County"]
["Kentucky","Lewis County"]
["Kentucky","Lincoln County"]
["Kentucky","Livingston County"]
["Kentucky","Logan County"]
["Kentucky","Lyon County"]
["Kentucky","Madison County"]
["Kentucky","Magoffin County"]
["Kentucky","Marion County"]
["Kentucky","Marshall County"]
["Kentucky","Martin County"]
["Kentucky","Mason County"]
["Kentucky","McCracken County"]
["Kentucky","McCreary County"]
["Kentucky","McLean County"]
["Kentucky","Meade County"]
["Kentucky","Menifee County"]
["Kentucky","Mercer County"]
["Kentucky","Metcalfe County"]
["Kentucky","Monroe County"]
["Kentucky","Montgomery County"]
["Kentucky","Morgan County"]
["Kentucky","Muhlenberg County"]
["Kentucky","Nelson County"]
["Kentucky","Nicholas County"]
["Kentucky","Ohio County"]
["Kentucky","Oldham County"]
["Kentucky","Owen County"]
["Kentucky","Owsley County"]
["Kentucky","Pendleton County"]
["Kentucky","Perry County"]
["Kentucky","Pike County"]
["Kentucky","Powell County"]
["Kentucky","Pulaski County"]
["Kentucky","Robertson County"]
["Kentucky","Rockcastle County"]
["Kentucky","Rowan County"]
["Kentucky","Russell County"]
["Kentucky","Scott County"]
["Kentucky","Shelby County"]
["Kentucky","Simpson County"]
["Kentucky","Spencer County"]
["Kentucky","Taylor County"]
["Kentucky","Todd County"]
["Kentucky","Trigg County"]
["Kentucky","Trimble County"]
["Kentucky","Union County"]
["Kentucky","Warren County"]
["Kentucky","Washington County"]
["Kentucky","Wayne County"]
["Kentucky","Webster County"]
["Kentucky","Whitley County"]
["Kentucky","Wolfe County"]
["Kentucky","Woodford County"]
["Louisiana","*Entire State*"]
["Louisiana","Acadia Parish"]
["Louisiana","Allen Parish"]
["Louisiana","Ascension Parish"]
["Louisiana","Assumption Parish"]
["Louisiana","Avoyelles Parish"]
["Louisiana","Beauregard Parish"]
["Louisiana","Bienville Parish"]
["Louisiana","Bossier Parish"]
["Louisiana","Caddo Parish"]
["Louisiana","Calcasieu Parish"]
["Louisiana","Caldwell Parish"]
["Louisiana","Cameron Parish"]
["Louisiana","Catahoula Parish"]
["Louisiana","Claiborne Parish"]
["Louisiana","Concordia Parish"]
["Louisiana","De Soto Parish"]
["Louisiana","East Baton Rouge Parish"]
["Louisiana","East Carroll Parish"]
["Louisiana","East Feliciana Parish"]
["Louisiana","Evangeline Parish"]
["Louisiana","Franklin Parish"]
["Louisiana","Grant Parish"]
["Louisiana","Iberia Parish"]
["Louisiana","Iberville Parish"]
["Louisiana","Jackson Parish"]
["Louisiana","Jefferson Davis Parish"]
["Louisiana","Jefferson Parish"]
["Louisiana","Lafayette Parish"]
["Louisiana","Lafourche Parish"]
["Louisiana","LaSalle Parish"]
["Louisiana","Lincoln Parish"]
["Louisiana","Livingston Parish"]
["Louisiana","Madison Parish"]
["Louisiana","Morehouse Parish"]
["Louisiana","Natchitoches Parish"]
["Louisiana","Orleans Parish"]
["Louisiana","Ouachita Parish"]
["Louisiana","Plaquemines Parish"]
["Louisiana","Pointe Coupee Parish"]
["Louisiana","Rapides Parish"]
["Louisiana","Red River Parish"]
["Louisiana","Richland Parish"]
["Louisiana","Sabine Parish"]
["Louisiana","St. Bernard Parish"]
["Louisiana","St. Charles Parish"]
["Louisiana","St. Helena Parish"]
["Louisiana","St. James Parish"]
["Louisiana","St. John the Baptist Parish"]
["Louisiana","St. Landry Parish"]
["Louisiana","St. Martin Parish"]
["Louisiana","St. Mary Parish"]
["Louisiana","St. Tammany Parish"]
["Louisiana","Tangipahoa Parish"]
["Louisiana","Tensas Parish"]
["Louisiana","Terrebonne Parish"]
["Louisiana","Union Parish"]
["Louisiana","Vermilion Parish"]
["Louisiana","Vernon Parish"]
["Louisiana","Washington Parish"]
["Louisiana","Webster Parish"]
["Louisiana","West Baton Rouge Parish"]
["Louisiana","West Carroll Parish"]
["Louisiana","West Feliciana Parish"]
["Louisiana","Winn Parish"]
["Maine","*Entire State*"]
["Maine","Androscoggin County"]
["Maine","Aroostook County"]
["Maine","Cumberland County"]
["Maine","Franklin County"]
["Maine","Hancock County"]
["Maine","Kennebec County"]
["Maine","Knox County"]
["Maine","Lincoln County"]
["Maine","Oxford County"]
["Maine","Penobscot County"]
["Maine","Piscataquis County"]
["Maine","Sagadahoc County"]
["Maine","Somerset County"]
["Maine","Waldo County"]
["Maine","Washington County"]
["Maine","York County"]
["Maryland","*Entire State*"]
["Maryland","Allegany County"]
["Maryland","Anne Arundel County"]
["Maryland","Baltimore City"]
["Maryland","Baltimore County"]
["Maryland","Calvert County"]
["Maryland","Caroline County"]
["Maryland","Carroll County"]
["Maryland","Cecil County"]
["Maryland","Charles County"]
["Maryland","Dorchester County"]
["Maryland","Frederick County"]
["Maryland","Garrett County"]
["Maryland","Harford County"]
["Maryland","Howard County"]
["Maryland","Kent County"]
["Maryland","Montgomery County"]
["Maryland","Prince George's County"]
["Maryland","Queen Anne's County"]
["Maryland","Somerset County"]
["Maryland","St. Mary's County"]
["Maryland","Talbot County"]
["Maryland","Washington County"]
["Maryland","Wicomico County"]
["Maryland","Worcester County"]
["Massachusetts","*Entire State*"]
["Massachusetts","Barnstable County"]
["Massachusetts","Berkshire County"]
["Massachusetts","Bristol County"]
["Massachusetts","Dukes County"]
["Massachusetts","Essex County"]
["Massachusetts","Franklin County"]
["Massachusetts","Hampden County"]
["Massachusetts","Hampshire County"]
["Massachusetts","Middlesex County"]
["Massachusetts","Nantucket, Town and County of"]
["Massachusetts","Norfolk County"]
["Massachusetts","Plymouth County"]
["Massachusetts","Suffolk County"]
["Massachusetts","Worcester County"]
["Michigan","*Entire State*"]
["Michigan","Alcona County"]
["Michigan","Alger County"]
["Michigan","Allegan County"]
["Michigan","Alpena County"]
["Michigan","Antrim County"]
["Michigan","Arenac County"]
["Michigan","Baraga County"]
["Michigan","Barry County"]
["Michigan","Bay County"]
["Michigan","Benzie County"]
["Michigan","Berrien County"]
["Michigan","Branch County"]
["Michigan","Calhoun County"]
["Michigan","Cass County"]
["Michigan","Charlevoix County"]
["Michigan","Cheboygan County"]
["Michigan","Chippewa County"]
["Michigan","Clare County"]
["Michigan","Clinton County"]
["Michigan","Crawford County"]
["Michigan","Delta County"]
["Michigan","Dickinson County"]
["Michigan","Eaton County"]
["Michigan","Emmet County"]
["Michigan","Genesee County"]
["Michigan","Gladwin County"]
["Michigan","Gogebic County"]
["Michigan","Grand Traverse County"]
["Michigan","Gratiot County"]
["Michigan","Hillsdale County"]
["Michigan","Houghton County"]
["Michigan","Huron County"]
["Michigan","Ingham County"]
["Michigan","Ionia County"]
["Michigan","Iosco County"]
["Michigan","Iron County"]
["Michigan","Isabella County"]
["Michigan","Jackson County"]
["Michigan","Kalamazoo County"]
["Michigan","Kalkaska County"]
["Michigan","Kent County"]
["Michigan","Keweenaw County"]
["Michigan","Lake County"]
["Michigan","Lapeer County"]
["Michigan","Leelanau County"]
["Michigan","Lenawee County"]
["Michigan","Livingston County"]
["Michigan","Luce County"]
["Michigan","Mackinac County"]
["Michigan","Macomb County"]
["Michigan","Manistee County"]
["Michigan","Marquette County"]
["Michigan","Mason County"]
["Michigan","Mecosta County"]
["Michigan","Menominee County"]
["Michigan","Midland County"]
["Michigan","Missaukee County"]
["Michigan","Monroe County"]
["Michigan","Montcalm County"]
["Michigan","Montmorency County"]
["Michigan","Muskegon County"]
["Michigan","Newaygo County"]
["Michigan","Oakland County"]
["Michigan","Oceana County"]
["Michigan","Ogemaw County"]
["Michigan","Ontonagon County"]
["Michigan","Osceola County"]
["Michigan","Oscoda County"]
["Michigan","Otsego County"]
["Michigan","Ottawa County"]
["Michigan","Presque Isle County"]
["Michigan","Roscommon County"]
["Michigan","Saginaw County"]
["Michigan","Sanilac County"]
["Michigan","Schoolcraft County"]
["Michigan","Shiawassee County"]
["Michigan","St. Clair County"]
["Michigan","St. Joseph County"]
["Michigan","Tuscola County"]
["Michigan","Van Buren County"]
["Michigan","Washtenaw County"]
["Michigan","Wayne County"]
["Michigan","Wexford County"]
["Minnesota","*Entire State*"]
["Minnesota","Aitkin County"]
["Minnesota","Anoka County"]
["Minnesota","Becker County"]
["Minnesota","Beltrami County"]
["Minnesota","Benton County"]
["Minnesota","Big Stone County"]
["Minnesota","Blue Earth County"]
["Minnesota","Brown County"]
["Minnesota","Carlton County"]
["Minnesota","Carver County"]
["Minnesota","Cass County"]
["Minnesota","Chippewa County"]
["Minnesota","Chisago County"]
["Minnesota","Clay County"]
["Minnesota","Clearwater County"]
["Minnesota","Cook County"]
["Minnesota","Cottonwood County"]
["Minnesota","Crow Wing County"]
["Minnesota","Dakota County"]
["Minnesota","Dodge County"]
["Minnesota","Douglas County"]
["Minnesota","Faribault County"]
["Minnesota","Fillmore County"]
["Minnesota","Freeborn County"]
["Minnesota","Goodhue County"]
["Minnesota","Grant County"]
["Minnesota","Hennepin County"]
["Minnesota","Houston County"]
["Minnesota","Hubbard County"]
["Minnesota","Isanti County"]
["Minnesota","Itasca County"]
["Minnesota","Jackson County"]
["Minnesota","Kanabec County"]
["Minnesota","Kandiyohi County"]
["Minnesota","Kittson County"]
["Minnesota","Koochiching County"]
["Minnesota","Lac qui Parle County"]
["Minnesota","Lake County"]
["Minnesota","Lake of the Woods County"]
["Minnesota","Le Sueur County"]
["Minnesota","Lincoln County"]
["Minnesota","Lyon County"]
["Minnesota","Mahnomen County"]
["Minnesota","Marshall County"]
["Minnesota","Martin County"]
["Minnesota","McLeod County"]
["Minnesota","Meeker County"]
["Minnesota","Mille Lacs County"]
["Minnesota","Morrison County"]
["Minnesota","Mower County"]
["Minnesota","Murray County"]
["Minnesota","Nicollet County"]
["Minnesota","Nobles County"]
["Minnesota","Norman County"]
["Minnesota","Olmsted County"]
["Minnesota","Otter Tail County"]
["Minnesota","Pennington County"]
["Minnesota","Pine County"]
["Minnesota","Pipestone County"]
["Minnesota","Polk County"]
["Minnesota","Pope County"]
["Minnesota","Ramsey County"]
["Minnesota","Red Lake County"]
["Minnesota","Redwood County"]
["Minnesota","Renville County"]
["Minnesota","Rice County"]
["Minnesota","Rock County"]
["Minnesota","Roseau County"]
["Minnesota","Scott County"]
["Minnesota","Sherburne County"]
["Minnesota","Sibley County"]
["Minnesota","St. Louis County"]
["Minnesota","Stearns County"]
["Minnesota","Steele County"]
["Minnesota","Stevens County"]
["Minnesota","Swift County"]
["Minnesota","Todd County"]
["Minnesota","Traverse County"]
["Minnesota","Wabasha County"]
["Minnesota","Wadena County"]
["Minnesota","Waseca County"]
["Minnesota","Washington County"]
["Minnesota","Watonwan County"]
["Minnesota","Wilkin County"]
["Minnesota","Winona County"]
["Minnesota","Wright County"]
["Minnesota","Yellow Medicine County"]
["Mississippi","*Entire State*"]
["Mississippi","Adams County"]
["Mississippi","Alcorn County"]
["Mississippi","Amite County"]
["Mississippi","Attala County"]
["Mississippi","Benton County"]
["Mississippi","Bolivar County"]
["Mississippi","Calhoun County"]
["Mississippi","Carroll County"]
["Mississippi","Chickasaw County"]
["Mississippi","Choctaw County"]
["Mississippi","Claiborne County"]
["Mississippi","Clarke County"]
["Mississippi","Clay County"]
["Mississippi","Coahoma County"]
["Mississippi","Copiah County"]
["Mississippi","Covington County"]
["Mississippi","DeSoto County"]
["Mississippi","Forrest County"]
["Mississippi","Franklin County"]
["Mississippi","George County"]
["Mississippi","Greene County"]
["Mississippi","Grenada County"]
["Mississippi","Hancock County"]
["Mississippi","Harrison County"]
["Mississippi","Hinds County"]
["Mississippi","Holmes County"]
["Mississippi","Humphreys County"]
["Mississippi","Issaquena County"]
["Mississippi","Itawamba County"]
["Mississippi","Jackson County"]
["Mississippi","Jasper County"]
["Mississippi","Jefferson County"]
["Mississippi","Jefferson Davis County"]
["Mississippi","Jones County"]
["Mississippi","Kemper County"]
["Mississippi","Lafayette County"]
["Mississippi","Lamar County"]
["Mississippi","Lauderdale County"]
["Mississippi","Lawrence County"]
["Mississippi","Leake County"]
["Mississippi","Lee County"]
["Mississippi","Leflore County"]
["Mississippi","Lincoln County"]
["Mississippi","Lowndes County"]
["Mississippi","Madison County"]
["Mississippi","Marion County"]
["Mississippi","Marshall County"]
["Mississippi","Monroe County"]
["Mississippi","Montgomery County"]
["Mississippi","Neshoba County"]
["Mississippi","Newton County"]
["Mississippi","Noxubee County"]
["Mississippi","Oktibbeha County"]
["Mississippi","Panola County"]
["Mississippi","Pearl River County"]
["Mississippi","Perry County"]
["Mississippi","Pike County"]
["Mississippi","Pontotoc County"]
["Mississippi","Prentiss County"]
["Mississippi","Quitman County"]
["Mississippi","Rankin County"]
["Mississippi","Scott County"]
["Mississippi","Sharkey County"]
["Mississippi","Simpson County"]
["Mississippi","Smith County"]
["Mississippi","Stone County"]
["Mississippi","Sunflower County"]
["Mississippi","Tallahatchie County"]
["Mississippi","Tate County"]
["Mississippi","Tippah County"]
["Mississippi","Tishomingo County"]
["Mississippi","Tunica County"]
["Mississippi","Union County"]
["Mississippi","Walthall County"]
["Mississippi","Warren County"]
["Mississippi","Washington County"]
["Mississippi","Wayne County"]
["Mississippi","Webster County"]
["Mississippi","Wilkinson County"]
["Mississippi","Winston County"]
["Mississippi","Yalobusha County"]
["Mississippi","Yazoo County"]
["Missouri","*Entire State*"]
["Missouri","Adair County"]
["Missouri","Andrew County"]
["Missouri","Atchison County"]
["Missouri","Audrain County"]
["Missouri","Barry County"]
["Missouri","Barton County"]
["Missouri","Bates County"]
["Missouri","Benton County"]
["Missouri","Bollinger County"]
["Missouri","Boone County"]
["Missouri","Buchanan County"]
["Missouri","Butler County"]
["Missouri","Caldwell County"]
["Missouri","Callaway County"]
["Missouri","Camden County"]
["Missouri","Cape Girardeau County"]
["Missouri","Carroll County"]
["Missouri","Carter County"]
["Missouri","Cass County"]
["Missouri","Cedar County"]
["Missouri","Chariton County"]
["Missouri","Christian County"]
["Missouri","Clark County"]
["Missouri","Clay County"]
["Missouri","Clinton County"]
["Missouri","Cole County"]
["Missouri","Cooper County"]
["Missouri","Crawford County"]
["Missouri","Dade County"]
["Missouri","Dallas County"]
["Missouri","Daviess County"]
["Missouri","DeKalb County"]
["Missouri","Dent County"]
["Missouri","Douglas County"]
["Missouri","Dunklin County"]
["Missouri","Franklin County"]
["Missouri","Gasconade County"]
["Missouri","Gentry County"]
["Missouri","Greene County"]
["Missouri","Grundy County"]
["Missouri","Harrison County"]
["Missouri","Henry County"]
["Missouri","Hickory County"]
["Missouri","Holt County"]
["Missouri","Howard County"]
["Missouri","Howell County"]
["Missouri","Iron County"]
["Missouri","Jackson County"]
["Missouri","Jasper County"]
["Missouri","Jefferson County"]
["Missouri","Johnson County"]
["Missouri","Knox County"]
["Missouri","Laclede County"]
["Missouri","Lafayette County"]
["Missouri","Lawrence County"]
["Missouri","Lewis County"]
["Missouri","Lincoln County"]
["Missouri","Linn County"]
["Missouri","Livingston County"]
["Missouri","Macon County"]
["Missouri","Madison County"]
["Missouri","Maries County"]
["Missouri","Marion County"]
["Missouri","McDonald County"]
["Missouri","Mercer County"]
["Missouri","Miller County"]
["Missouri","Mississippi County"]
["Missouri","Moniteau County"]
["Missouri","Monroe County"]
["Missouri","Montgomery County"]
["Missouri","Morgan County"]
["Missouri","New Madrid County"]
["Missouri","Newton County"]
["Missouri","Nodaway County"]
["Missouri","Oregon County"]
["Missouri","Osage County"]
["Missouri","Ozark County"]
["Missouri","Pemiscot County"]
["Missouri","Perry County"]
["Missouri","Pettis County"]
["Missouri","Phelps County"]
["Missouri","Pike County"]
["Missouri","Platte County"]
["Missouri","Polk County"]
["Missouri","Pulaski County"]
["Missouri","Putnam County"]
["Missouri","Ralls County"]
["Missouri","Randolph County"]
["Missouri","Ray County"]
["Missouri","Reynolds County"]
["Missouri","Ripley County"]
["Missouri","Saline County"]
["Missouri","Schuyler County"]
["Missouri","Scotland County"]
["Missouri","Scott County"]
["Missouri","Shannon County"]
["Missouri","Shelby County"]
["Missouri","St. Charles County"]
["Missouri","St. Clair County"]
["Missouri","St. Francois County"]
["Missouri","St. Louis County"]
["Missouri","St. Louis, City of"]
["Missouri","Ste. Genevieve County"]
["Missouri","Stoddard County"]
["Missouri","Stone County"]
["Missouri","Sullivan County"]
["Missouri","Taney County"]
["Missouri","Texas County"]
["Missouri","Vernon County"]
["Missouri","Warren County"]
["Missouri","Washington County"]
["Missouri","Wayne County"]
["Missouri","Webster County"]
["Missouri","Worth County"]
["Missouri","Wright County"]
["Montana","*Entire State*"]
["Montana","Beaverhead County"]
["Montana","Big Horn County"]
["Montana","Blaine County"]
["Montana","Broadwater County"]
["Montana","Carbon County"]
["Montana","Carter County"]
["Montana","Cascade County"]
["Montana","Chouteau County"]
["Montana","Custer County"]
["Montana","Daniels County"]
["Montana","Dawson County"]
["Montana","Deer Lodge County"]
["Montana","Fallon County"]
["Montana","Fergus County"]
["Montana","Flathead County"]
["Montana","Gallatin County"]
["Montana","Garfield County"]
["Montana","Glacier County"]
["Montana","Golden Valley County"]
["Montana","Granite County"]
["Montana","Hill County"]
["Montana","Jefferson County"]
["Montana","Judith Basin County"]
["Montana","Lake County"]
["Montana","Lewis and Clark County"]
["Montana","Liberty County"]
["Montana","Lincoln County"]
["Montana","Madison County"]
["Montana","McCone County"]
["Montana","Meagher County"]
["Montana","Mineral County"]
["Montana","Missoula County"]
["Montana","Musselshell County"]
["Montana","Park County"]
["Montana","Petroleum County"]
["Montana","Phillips County"]
["Montana","Pondera County"]
["Montana","Powder River County"]
["Montana","Powell County"]
["Montana","Prairie County"]
["Montana","Ravalli County"]
["Montana","Richland County"]
["Montana","Roosevelt County"]
["Montana","Rosebud County"]
["Montana","Sanders County"]
["Montana","Sheridan County"]
["Montana","Silver Bow County"]
["Montana","Stillwater County"]
["Montana","Sweet Grass County"]
["Montana","Teton County"]
["Montana","Toole County"]
["Montana","Treasure County"]
["Montana","Valley County"]
["Montana","Wheatland County"]
["Montana","Wibaux County"]
["Montana","Yellowstone County"]
["Nebraska","*Entire State*"]
["Nebraska","Adams County"]
["Nebraska","Antelope County"]
["Nebraska","Arthur County"]
["Nebraska","Banner County"]
["Nebraska","Blaine County"]
["Nebraska","Boone County"]
["Nebraska","Box Butte County"]
["Nebraska","Boyd County"]
["Nebraska","Brown County"]
["Nebraska","Buffalo County"]
["Nebraska","Burt County"]
["Nebraska","Butler County"]
["Nebraska","Cass County"]
["Nebraska","Cedar County"]
["Nebraska","Chase County"]
["Nebraska","Cherry County"]
["Nebraska","Cheyenne County"]
["Nebraska","Clay County"]
["Nebraska","Colfax County"]
["Nebraska","Cuming County"]
["Nebraska","Custer County"]
["Nebraska","Dakota County"]
["Nebraska","Dawes County"]
["Nebraska","Dawson County"]
["Nebraska","Deuel County"]
["Nebraska","Dixon County"]
["Nebraska","Dodge County"]
["Nebraska","Douglas County"]
["Nebraska","Dundy County"]
["Nebraska","Fillmore County"]
["Nebraska","Franklin County"]
["Nebraska","Frontier County"]
["Nebraska","Furnas County"]
["Nebraska","Gage County"]
["Nebraska","Garden County"]
["Nebraska","Garfield County"]
["Nebraska","Gosper County"]
["Nebraska","Grant County"]
["Nebraska","Greeley County"]
["Nebraska","Hall County"]
["Nebraska","Hamilton County"]
["Nebraska","Harlan County"]
["Nebraska","Hayes County"]
["Nebraska","Hitchcock County"]
["Nebraska","Holt County"]
["Nebraska","Hooker County"]
["Nebraska","Howard County"]
["Nebraska","Jefferson County"]
["Nebraska","Johnson County"]
["Nebraska","Kearney County"]
["Nebraska","Keith County"]
["Nebraska","Keya Paha County"]
["Nebraska","Kimball County"]
["Nebraska","Knox County"]
["Nebraska","Lancaster County"]
["Nebraska","Lincoln County"]
["Nebraska","Logan County"]
["Nebraska","Loup County"]
["Nebraska","Madison County"]
["Nebraska","McPherson County"]
["Nebraska","Merrick County"]
["Nebraska","Morrill County"]
["Nebraska","Nance County"]
["Nebraska","Nemaha County"]
["Nebraska","Nuckolls County"]
["Nebraska","Otoe County"]
["Nebraska","Pawnee County"]
["Nebraska","Perkins County"]
["Nebraska","Phelps County"]
["Nebraska","Pierce County"]
["Nebraska","Platte County"]
["Nebraska","Polk County"]
["Nebraska","Red Willow County"]
["Nebraska","Richardson County"]
["Nebraska","Rock County"]
["Nebraska","Saline County"]
["Nebraska","Sarpy County"]
["Nebraska","Saunders County"]
["Nebraska","Scotts Bluff County"]
["Nebraska","Seward County"]
["Nebraska","Sheridan County"]
["Nebraska","Sherman County"]
["Nebraska","Sioux County"]
["Nebraska","Stanton County"]
["Nebraska","Thayer County"]
["Nebraska","Thomas County"]
["Nebraska","Thurston County"]
["Nebraska","Valley County"]
["Nebraska","Washington County"]
["Nebraska","Wayne County"]
["Nebraska","Webster County"]
["Nebraska","Wheeler County"]
["Nebraska","York County"]
["Nevada","*Entire State*"]
["Nevada","Carson City, Consolidated Municipality of"]
["Nevada","Churchill County"]
["Nevada","Clark County"]
["Nevada","Douglas County"]
["Nevada","Elko County"]
["Nevada","Esmeralda County"]
["Nevada","Eureka County"]
["Nevada","Humboldt County"]
["Nevada","Lander County"]
["Nevada","Lincoln County"]
["Nevada","Lyon County"]
["Nevada","Mineral County"]
["Nevada","Nye County"]
["Nevada","Pershing County"]
["Nevada","Storey County"]
["Nevada","Washoe County"]
["Nevada","White Pine County"]
["New Hampshire","*Entire State*"]
["New Hampshire","Belknap County"]
["New Hampshire","Carroll County"]
["New Hampshire","Cheshire County"]
["New Hampshire","Coos County"]
["New Hampshire","Grafton County"]
["New Hampshire","Hillsborough County"]
["New Hampshire","Merrimack County"]
["New Hampshire","Rockingham County"]
["New Hampshire","Strafford County"]
["New Hampshire","Sullivan County"]
["New Jersey","*Entire State*"]
["New Jersey","Atlantic County"]
["New Jersey","Bergen County"]
["New Jersey","Burlington County"]
["New Jersey","Camden County"]
["New Jersey","Cape May County"]
["New Jersey","Cumberland County"]
["New Jersey","Essex County"]
["New Jersey","Gloucester County"]
["New Jersey","Hudson County"]
["New Jersey","Hunterdon County"]
["New Jersey","Mercer County"]
["New Jersey","Middlesex County"]
["New Jersey","Monmouth County"]
["New Jersey","Morris County"]
["New Jersey","Ocean County"]
["New Jersey","Passaic County"]
["New Jersey","Salem County"]
["New Jersey","Somerset County"]
["New Jersey","Sussex County"]
["New Jersey","Union County"]
["New Jersey","Warren County"]
["New Mexico","*Entire State*"]
["New Mexico","Bernalillo County"]
["New Mexico","Catron County"]
["New Mexico","Chaves County"]
["New Mexico","Cibola County"]
["New Mexico","Colfax County"]
["New Mexico","Curry County"]
["New Mexico","De Baca County"]
["New Mexico","Doña Ana County"]
["New Mexico","Eddy County"]
["New Mexico","Grant County"]
["New Mexico","Guadalupe County"]
["New Mexico","Harding County"]
["New Mexico","Hidalgo County"]
["New Mexico","Lea County"]
["New Mexico","Lincoln County"]
["New Mexico","Los Alamos County"]
["New Mexico","Luna County"]
["New Mexico","McKinley County"]
["New Mexico","Mora County"]
["New Mexico","Otero County"]
["New Mexico","Quay County"]
["New Mexico","Rio Arriba County"]
["New Mexico","Roosevelt County"]
["New Mexico","San Juan County"]
["New Mexico","San Miguel County"]
["New Mexico","Sandoval County"]
["New Mexico","Santa Fe County"]
["New Mexico","Sierra County"]
["New Mexico","Socorro County"]
["New Mexico","Taos County"]
["New Mexico","Torrance County"]
["New Mexico","Union County"]
["New Mexico","Valencia County"]
["New York","*Entire State*"]
["New York","Albany County"]
["New York","Allegany County"]
["New York","Bronx County"]
["New York","Broome County"]
["New York","Cattaraugus County"]
["New York","Cayuga County"]
["New York","Chautauqua County"]
["New York","Chemung County"]
["New York","Chenango County"]
["New York","Clinton County"]
["New York","Columbia County"]
["New York","Cortland County"]
["New York","Delaware County"]
["New York","Dutchess County"]
["New York","Erie County"]
["New York","Essex County"]
["New York","Franklin County"]
["New York","Fulton County"]
["New York","Genesee County"]
["New York","Greene County"]
["New York","Hamilton County"]
["New York","Herkimer County"]
["New York","Jefferson County"]
["New York","Kings County"]
["New York","Lewis County"]
["New York","Livingston County"]
["New York","Madison County"]
["New York","Monroe County"]
["New York","Montgomery County"]
["New York","Nassau County"]
["New York","New York County"]
["New York","Niagara County"]
["New York","Oneida County"]
["New York","Onondaga County"]
["New York","Ontario County"]
["New York","Orange County"]
["New York","Orleans County"]
["New York","Oswego County"]
["New York","Otsego County"]
["New York","Putnam County"]
["New York","Queens County"]
["New York","Rensselaer County"]
["New York","Richmond County"]
["New York","Rockland County"]
["New York","Saratoga County"]
["New York","Schenectady County"]
["New York","Schoharie County"]
["New York","Schuyler County"]
["New York","Seneca County"]
["New York","St. Lawrence County"]
["New York","Steuben County"]
["New York","Suffolk County"]
["New York","Sullivan County"]
["New York","Tioga County"]
["New York","Tompkins County"]
["New York","Ulster County"]
["New York","Warren County"]
["New York","Washington County"]
["New York","Wayne County"]
["New York","Westchester County"]
["New York","Wyoming County"]
["New York","Yates County"]
["North Carolina","*Entire State*"]
["North Carolina","Alamance County"]
["North Carolina","Alexander County"]
["North Carolina","Alleghany County"]
["North Carolina","Anson County"]
["North Carolina","Ashe County"]
["North Carolina","Avery County"]
["North Carolina","Beaufort County"]
["North Carolina","Bertie County"]
["North Carolina","Bladen County"]
["North Carolina","Brunswick County"]
["North Carolina","Buncombe County"]
["North Carolina","Burke County"]
["North Carolina","Cabarrus County"]
["North Carolina","Caldwell County"]
["North Carolina","Camden County"]
["North Carolina","Carteret County"]
["North Carolina","Caswell County"]
["North Carolina","Catawba County"]
["North Carolina","Chatham County"]
["North Carolina","Cherokee County"]
["North Carolina","Chowan County"]
["North Carolina","Clay County"]
["North Carolina","Cleveland County"]
["North Carolina","Columbus County"]
["North Carolina","Craven County"]
["North Carolina","Cumberland County"]
["North Carolina","Currituck County"]
["North Carolina","Dare County"]
["North Carolina","Davidson County"]
["North Carolina","Davie County"]
["North Carolina","Duplin County"]
["North Carolina","Durham County"]
["North Carolina","Edgecombe County"]
["North Carolina","Forsyth County"]
["North Carolina","Franklin County"]
["North Carolina","Gaston County"]
["North Carolina","Gates County"]
["North Carolina","Graham County"]
["North Carolina","Granville County"]
["North Carolina","Greene County"]
["North Carolina","Guilford County"]
["North Carolina","Halifax County"]
["North Carolina","Harnett County"]
["North Carolina","Haywood County"]
["North Carolina","Henderson County"]
["North Carolina","Hertford County"]
["North Carolina","Hoke County"]
["North Carolina","Hyde County"]
["North Carolina","Iredell County"]
["North Carolina","Jackson County"]
["North Carolina","Johnston County"]
["North Carolina","Jones County"]
["North Carolina","Lee County"]
["North Carolina","Lenoir County"]
["North Carolina","Lincoln County"]
["North Carolina","Macon County"]
["North Carolina","Madison County"]
["North Carolina","Martin County"]
["North Carolina","McDowell County"]
["North Carolina","Mecklenburg County"]
["North Carolina","Mitchell County"]
["North Carolina","Montgomery County"]
["North Carolina","Moore County"]
["North Carolina","Nash County"]
["North Carolina","New Hanover County"]
["North Carolina","Northampton County"]
["North Carolina","Onslow County"]
["North Carolina","Orange County"]
["North Carolina","Pamlico County"]
["North Carolina","Pasquotank County"]
["North Carolina","Pender County"]
["North Carolina","Perquimans County"]
["North Carolina","Person County"]
["North Carolina","Pitt County"]
["North Carolina","Polk County"]
["North Carolina","Randolph County"]
["North Carolina","Richmond County"]
["North Carolina","Robeson County"]
["North Carolina","Rockingham County"]
["North Carolina","Rowan County"]
["North Carolina","Rutherford County"]
["North Carolina","Sampson County"]
["North Carolina","Scotland County"]
["North Carolina","Stanly County"]
["North Carolina","Stokes County"]
["North Carolina","Surry County"]
["North Carolina","Swain County"]
["North Carolina","Transylvania County"]
["North Carolina","Tyrrell County"]
["North Carolina","Union County"]
["North Carolina","Vance County"]
["North Carolina","Wake County"]
["North Carolina","Warren County"]
["North Carolina","Washington County"]
["North Carolina","Watauga County"]
["North Carolina","Wayne County"]
["North Carolina","Wilkes County"]
["North Carolina","Wilson County"]
["North Carolina","Yadkin County"]
["North Carolina","Yancey County"]
["North Dakota","*Entire State*"]
["North Dakota","Adams County"]
["North Dakota","Barnes County"]
["North Dakota","Benson County"]
["North Dakota","Billings County"]
["North Dakota","Bottineau County"]
["North Dakota","Bowman County"]
["North Dakota","Burke County"]
["North Dakota","Burleigh County"]
["North Dakota","Cass County"]
["North Dakota","Cavalier County"]
["North Dakota","Dickey County"]
["North Dakota","Divide County"]
["North Dakota","Dunn County"]
["North Dakota","Eddy County"]
["North Dakota","Emmons County"]
["North Dakota","Foster County"]
["North Dakota","Golden Valley County"]
["North Dakota","Grand Forks County"]
["North Dakota","Grant County"]
["North Dakota","Griggs County"]
["North Dakota","Hettinger County"]
["North Dakota","Kidder County"]
["North Dakota","LaMoure County"]
["North Dakota","Logan County"]
["North Dakota","McHenry County"]
["North Dakota","McIntosh County"]
["North Dakota","McKenzie County"]
["North Dakota","McLean County"]
["North Dakota","Mercer County"]
["North Dakota","Morton County"]
["North Dakota","Mountrail County"]
["North Dakota","Nelson County"]
["North Dakota","Oliver County"]
["North Dakota","Pembina County"]
["North Dakota","Pierce County"]
["North Dakota","Ramsey County"]
["North Dakota","Ransom County"]
["North Dakota","Renville County"]
["North Dakota","Richland County"]
["North Dakota","Rolette County"]
["North Dakota","Sargent County"]
["North Dakota","Sheridan County"]
["North Dakota","Sioux County"]
["North Dakota","Slope County"]
["North Dakota","Stark County"]
["North Dakota","Steele County"]
["North Dakota","Stutsman County"]
["North Dakota","Towner County"]
["North Dakota","Traill County"]
["North Dakota","Walsh County"]
["North Dakota","Ward County"]
["North Dakota","Wells County"]
["North Dakota","Williams County"]
["Ohio","*Entire State*"]
["Ohio","Adams County"]
["Ohio","Allen County"]
["Ohio","Ashland County"]
["Ohio","Ashtabula County"]
["Ohio","Athens County"]
["Ohio","Auglaize County"]
["Ohio","Belmont County"]
["Ohio","Brown County"]
["Ohio","Butler County"]
["Ohio","Carroll County"]
["Ohio","Champaign County"]
["Ohio","Clark County"]
["Ohio","Clermont County"]
["Ohio","Clinton County"]
["Ohio","Columbiana County"]
["Ohio","Coshocton County"]
["Ohio","Crawford County"]
["Ohio","Cuyahoga County"]
["Ohio","Darke County"]
["Ohio","Defiance County"]
["Ohio","Delaware County"]
["Ohio","Erie County"]
["Ohio","Fairfield County"]
["Ohio","Fayette County"]
["Ohio","Franklin County"]
["Ohio","Fulton County"]
["Ohio","Gallia County"]
["Ohio","Geauga County"]
["Ohio","Greene County"]
["Ohio","Guernsey County"]
["Ohio","Hamilton County"]
["Ohio","Hancock County"]
["Ohio","Hardin County"]
["Ohio","Harrison County"]
["Ohio","Henry County"]
["Ohio","Highland County"]
["Ohio","Hocking County"]
["Ohio","Holmes County"]
["Ohio","Huron County"]
["Ohio","Jackson County"]
["Ohio","Jefferson County"]
["Ohio","Knox County"]
["Ohio","Lake County"]
["Ohio","Lawrence County"]
["Ohio","Licking County"]
["Ohio","Logan County"]
["Ohio","Lorain County"]
["Ohio","Lucas County"]
["Ohio","Madison County"]
["Ohio","Mahoning County"]
["Ohio","Marion County"]
["Ohio","Medina County"]
["Ohio","Meigs County"]
["Ohio","Mercer County"]
["Ohio","Miami County"]
["Ohio","Monroe County"]
["Ohio","Montgomery County"]
["Ohio","Morgan County"]
["Ohio","Morrow County"]
["Ohio","Muskingum County"]
["Ohio","Noble County"]
["Ohio","Ottawa County"]
["Ohio","Paulding County"]
["Ohio","Perry County"]
["Ohio","Pickaway County"]
["Ohio","Pike County"]
["Ohio","Portage County"]
["Ohio","Preble County"]
["Ohio","Putnam County"]
["Ohio","Richland County"]
["Ohio","Ross County"]
["Ohio","Sandusky County"]
["Ohio","Scioto County"]
["Ohio","Seneca County"]
["Ohio","Shelby County"]
["Ohio","Stark County"]
["Ohio","Summit County"]
["Ohio","Trumbull County"]
["Ohio","Tuscarawas County"]
["Ohio","Union County"]
["Ohio","Van Wert County"]
["Ohio","Vinton County"]
["Ohio","Warren County"]
["Ohio","Washington County"]
["Ohio","Wayne County"]
["Ohio","Williams County"]
["Ohio","Wood County"]
["Ohio","Wyandot County"]
["Oklahoma","*Entire State*"]
["Oklahoma","Adair County"]
["Oklahoma","Alfalfa County"]
["Oklahoma","Atoka County"]
["Oklahoma","Beaver County"]
["Oklahoma","Beckham County"]
["Oklahoma","Blaine County"]
["Oklahoma","Bryan County"]
["Oklahoma","Caddo County"]
["Oklahoma","Canadian County"]
["Oklahoma","Carter County"]
["Oklahoma","Cherokee County"]
["Oklahoma","Choctaw County"]
["Oklahoma","Cimarron County"]
["Oklahoma","Cleveland County"]
["Oklahoma","Coal County"]
["Oklahoma","Comanche County"]
["Oklahoma","Cotton County"]
["Oklahoma","Craig County"]
["Oklahoma","Creek County"]
["Oklahoma","Custer County"]
["Oklahoma","Delaware County"]
["Oklahoma","Dewey County"]
["Oklahoma","Ellis County"]
["Oklahoma","Garfield County"]
["Oklahoma","Garvin County"]
["Oklahoma","Grady County"]
["Oklahoma","Grant County"]
["Oklahoma","Greer County"]
["Oklahoma","Harmon County"]
["Oklahoma","Harper County"]
["Oklahoma","Haskell County"]
["Oklahoma","Hughes County"]
["Oklahoma","Jackson County"]
["Oklahoma","Jefferson County"]
["Oklahoma","Johnston County"]
["Oklahoma","Kay County"]
["Oklahoma","Kingfisher County"]
["Oklahoma","Kiowa County"]
["Oklahoma","Latimer County"]
["Oklahoma","Le Flore County"]
["Oklahoma","Lincoln County"]
["Oklahoma","Logan County"]
["Oklahoma","Love County"]
["Oklahoma","Major County"]
["Oklahoma","Marshall County"]
["Oklahoma","Mayes County"]
["Oklahoma","McClain County"]
["Oklahoma","McCurtain County"]
["Oklahoma","McIntosh County"]
["Oklahoma","Murray County"]
["Oklahoma","Muskogee County"]
["Oklahoma","Noble County"]
["Oklahoma","Nowata County"]
["Oklahoma","Okfuskee County"]
["Oklahoma","Oklahoma County"]
["Oklahoma","Okmulgee County"]
["Oklahoma","Osage County"]
["Oklahoma","Ottawa County"]
["Oklahoma","Pawnee County"]
["Oklahoma","Payne County"]
["Oklahoma","Pittsburg County"]
["Oklahoma","Pontotoc County"]
["Oklahoma","Pottawatomie County"]
["Oklahoma","Pushmataha County"]
["Oklahoma","Roger Mills County"]
["Oklahoma","Rogers County"]
["Oklahoma","Seminole County"]
["Oklahoma","Sequoyah County"]
["Oklahoma","Stephens County"]
["Oklahoma","Texas County"]
["Oklahoma","Tillman County"]
["Oklahoma","Tulsa County"]
["Oklahoma","Wagoner County"]
["Oklahoma","Washington County"]
["Oklahoma","Washita County"]
["Oklahoma","Woods County"]
["Oklahoma","Woodward County"]
["Oregon","*Entire State*"]
["Oregon","Baker County"]
["Oregon","Benton County"]
["Oregon","Clackamas County"]
["Oregon","Clatsop County"]
["Oregon","Columbia County"]
["Oregon","Coos County"]
["Oregon","Crook County"]
["Oregon","Curry County"]
["Oregon","Deschutes County"]
["Oregon","Douglas County"]
["Oregon","Gilliam County"]
["Oregon","Grant County"]
["Oregon","Harney County"]
["Oregon","Hood River County"]
["Oregon","Jackson County"]
["Oregon","Jefferson County"]
["Oregon","Josephine County"]
["Oregon","Klamath County"]
["Oregon","Lake County"]
["Oregon","Lane County"]
["Oregon","Lincoln County"]
["Oregon","Linn County"]
["Oregon","Malheur County"]
["Oregon","Marion County"]
["Oregon","Morrow County"]
["Oregon","Multnomah County"]
["Oregon","Polk County"]
["Oregon","Sherman County"]
["Oregon","Tillamook County"]
["Oregon","Umatilla County"]
["Oregon","Union County"]
["Oregon","Wallowa County"]
["Oregon","Wasco County"]
["Oregon","Washington County"]
["Oregon","Wheeler County"]
["Oregon","Yamhill County"]
["Pennsylvania","*Entire State*"]
["Pennsylvania","Adams County"]
["Pennsylvania","Allegheny County"]
["Pennsylvania","Armstrong County"]
["Pennsylvania","Beaver County"]
["Pennsylvania","Bedford County"]
["Pennsylvania","Berks County"]
["Pennsylvania","Blair County"]
["Pennsylvania","Bradford County"]
["Pennsylvania","Bucks County"]
["Pennsylvania","Butler County"]
["Pennsylvania","Cambria County"]
["Pennsylvania","Cameron County"]
["Pennsylvania","Carbon County"]
["Pennsylvania","Centre County"]
["Pennsylvania","Chester County"]
["Pennsylvania","Clarion County"]
["Pennsylvania","Clearfield County"]
["Pennsylvania","Clinton County"]
["Pennsylvania","Columbia County"]
["Pennsylvania","Crawford County"]
["Pennsylvania","Cumberland County"]
["Pennsylvania","Dauphin County"]
["Pennsylvania","Delaware County"]
["Pennsylvania","Elk County"]
["Pennsylvania","Erie County"]
["Pennsylvania","Fayette County"]
["Pennsylvania","Forest County"]
["Pennsylvania","Franklin County"]
["Pennsylvania","Fulton County"]
["Pennsylvania","Greene County"]
["Pennsylvania","Huntingdon County"]
["Pennsylvania","Indiana County"]
["Pennsylvania","Jefferson County"]
["Pennsylvania","Juniata County"]
["Pennsylvania","Lackawanna County"]
["Pennsylvania","Lancaster County"]
["Pennsylvania","Lawrence County"]
["Pennsylvania","Lebanon County"]
["Pennsylvania","Lehigh County"]
["Pennsylvania","Luzerne County"]
["Pennsylvania","Lycoming County"]
["Pennsylvania","McKean County"]
["Pennsylvania","Mercer County"]
["Pennsylvania","Mifflin County"]
["Pennsylvania","Monroe County"]
["Pennsylvania","Montgomery County"]
["Pennsylvania","Montour County"]
["Pennsylvania","Northampton County"]
["Pennsylvania","Northumberland County"]
["Pennsylvania","Perry County"]
["Pennsylvania","Philadelphia County"]
["Pennsylvania","Pike County"]
["Pennsylvania","Potter County"]
["Pennsylvania","Schuylkill County"]
["Pennsylvania","Snyder County"]
["Pennsylvania","Somerset County"]
["Pennsylvania","Sullivan County"]
["Pennsylvania","Susquehanna County"]
["Pennsylvania","Tioga County"]
["Pennsylvania","Union County"]
["Pennsylvania","Venango County"]
["Pennsylvania","Warren County"]
["Pennsylvania","Washington County"]
["Pennsylvania","Wayne County"]
["Pennsylvania","Westmoreland County"]
["Pennsylvania","Wyoming County"]
["Pennsylvania","York County"]
["Rhode Island","*Entire State*"]
["Rhode Island","Bristol County"]
["Rhode Island","Kent County"]
["Rhode Island","Newport County"]
["Rhode Island","Providence County"]
["Rhode Island","Washington County"]
["South Carolina","*Entire State*"]
["South Carolina","Abbeville County"]
["South Carolina","Aiken County"]
["South Carolina","Allendale County"]
["South Carolina","Anderson County"]
["South Carolina","Bamberg County"]
["South Carolina","Barnwell County"]
["South Carolina","Beaufort County"]
["South Carolina","Berkeley County"]
["South Carolina","Calhoun County"]
["South Carolina","Charleston County"]
["South Carolina","Cherokee County"]
["South Carolina","Chester County"]
["South Carolina","Chesterfield County"]
["South Carolina","Clarendon County"]
["South Carolina","Colleton County"]
["South Carolina","Darlington County"]
["South Carolina","Dillon County"]
["South Carolina","Dorchester County"]
["South Carolina","Edgefield County"]
["South Carolina","Fairfield County"]
["South Carolina","Florence County"]
["South Carolina","Georgetown County"]
["South Carolina","Greenville County"]
["South Carolina","Greenwood County"]
["South Carolina","Hampton County"]
["South Carolina","Horry County"]
["South Carolina","Jasper County"]
["South Carolina","Kershaw County"]
["South Carolina","Lancaster County"]
["South Carolina","Laurens County"]
["South Carolina","Lee County"]
["South Carolina","Lexington County"]
["South Carolina","Marion County"]
["South Carolina","Marlboro County"]
["South Carolina","McCormick County"]
["South Carolina","Newberry County"]
["South Carolina","Oconee County"]
["South Carolina","Orangeburg County"]
["South Carolina","Pickens County"]
["South Carolina","Richland County"]
["South Carolina","Saluda County"]
["South Carolina","Spartanburg County"]
["South Carolina","Sumter County"]
["South Carolina","Union County"]
["South Carolina","Williamsburg County"]
["South Carolina","York County"]
["South Dakota","*Entire State*"]
["South Dakota","Aurora County"]
["South Dakota","Beadle County"]
["South Dakota","Bennett County"]
["South Dakota","Bon Homme County"]
["South Dakota","Brookings County"]
["South Dakota","Brown County"]
["South Dakota","Brule County"]
["South Dakota","Buffalo County"]
["South Dakota","Butte County"]
["South Dakota","Campbell County"]
["South Dakota","Charles Mix County"]
["South Dakota","Clark County"]
["South Dakota","Clay County"]
["South Dakota","Codington County"]
["South Dakota","Corson County"]
["South Dakota","Custer County"]
["South Dakota","Davison County"]
["South Dakota","Day County"]
["South Dakota","Deuel County"]
["South Dakota","Dewey County"]
["South Dakota","Douglas County"]
["South Dakota","Edmunds County"]
["South Dakota","Fall River County"]
["South Dakota","Faulk County"]
["South Dakota","Grant County"]
["South Dakota","Gregory County"]
["South Dakota","Haakon County"]
["South Dakota","Hamlin County"]
["South Dakota","Hand County"]
["South Dakota","Hanson County"]
["South Dakota","Harding County"]
["South Dakota","Hughes County"]
["South Dakota","Hutchinson County"]
["South Dakota","Hyde County"]
["South Dakota","Jackson County"]
["South Dakota","Jerauld County"]
["South Dakota","Jones County"]
["South Dakota","Kingsbury County"]
["South Dakota","Lake County"]
["South Dakota","Lawrence County"]
["South Dakota","Lincoln County"]
["South Dakota","Lyman County"]
["South Dakota","Marshall County"]
["South Dakota","McCook County"]
["South Dakota","McPherson County"]
["South Dakota","Meade County"]
["South Dakota","Mellette County"]
["South Dakota","Miner County"]
["South Dakota","Minnehaha County"]
["South Dakota","Moody County"]
["South Dakota","Oglala Lakota County"]
["South Dakota","Pennington County"]
["South Dakota","Perkins County"]
["South Dakota","Potter County"]
["South Dakota","Roberts County"]
["South Dakota","Sanborn County"]
["South Dakota","Spink County"]
["South Dakota","Stanley County"]
["South Dakota","Sully County"]
["South Dakota","Todd County"]
["South Dakota","Tripp County"]
["South Dakota","Turner County"]
["South Dakota","Union County"]
["South Dakota","Walworth County"]
["South Dakota","Yankton County"]
["South Dakota","Ziebach County"]
["Tennessee","*Entire State*"]
["Tennessee","Anderson County"]
["Tennessee","Bedford County"]
["Tennessee","Benton County"]
["Tennessee","Bledsoe County"]
["Tennessee","Blount County"]
["Tennessee","Bradley County"]
["Tennessee","Campbell County"]
["Tennessee","Cannon County"]
["Tennessee","Carroll County"]
["Tennessee","Carter County"]
["Tennessee","Cheatham County"]
["Tennessee","Chester County"]
["Tennessee","Claiborne County"]
["Tennessee","Clay County"]
["Tennessee","Cocke County"]
["Tennessee","Coffee County"]
["Tennessee","Crockett County"]
["Tennessee","Cumberland County"]
["Tennessee","Davidson County"]
["Tennessee","Decatur County"]
["Tennessee","DeKalb County"]
["Tennessee","Dickson County"]
["Tennessee","Dyer County"]
["Tennessee","Fayette County"]
["Tennessee","Fentress County"]
["Tennessee","Franklin County"]
["Tennessee","Gibson County"]
["Tennessee","Giles County"]
["Tennessee","Grainger County"]
["Tennessee","Greene County"]
["Tennessee","Grundy County"]
["Tennessee","Hamblen County"]
["Tennessee","Hamilton County"]
["Tennessee","Hancock County"]
["Tennessee","Hardeman County"]
["Tennessee","Hardin County"]
["Tennessee","Hawkins County"]
["Tennessee","Haywood County"]
["Tennessee","Henderson County"]
["Tennessee","Henry County"]
["Tennessee","Hickman County"]
["Tennessee","Houston County"]
["Tennessee","Humphreys County"]
["Tennessee","Jackson County"]
["Tennessee","Jefferson County"]
["Tennessee","Johnson County"]
["Tennessee","Knox County"]
["Tennessee","Lake County"]
["Tennessee","Lauderdale County"]
["Tennessee","Lawrence County"]
["Tennessee","Lewis County"]
["Tennessee","Lincoln County"]
["Tennessee","Loudon County"]
["Tennessee","Macon County"]
["Tennessee","Madison County"]
["Tennessee","Marion County"]
["Tennessee","Marshall County"]
["Tennessee","Maury County"]
["Tennessee","McMinn County"]
["Tennessee","McNairy County"]
["Tennessee","Meigs County"]
["Tennessee","Monroe County"]
["Tennessee","Montgomery County"]
["Tennessee","Moore County"]
["Tennessee","Morgan County"]
["Tennessee","Obion County"]
["Tennessee","Overton County"]
["Tennessee","Perry County"]
["Tennessee","Pickett County"]
["Tennessee","Polk County"]
["Tennessee","Putnam County"]
["Tennessee","Rhea County"]
["Tennessee","Roane County"]
["Tennessee","Robertson County"]
["Tennessee","Rutherford County"]
["Tennessee","Scott County"]
["Tennessee","Sequatchie County"]
["Tennessee","Sevier County"]
["Tennessee","Shelby County"]
["Tennessee","Smith County"]
["Tennessee","Stewart County"]
["Tennessee","Sullivan County"]
["Tennessee","Sumner County"]
["Tennessee","Tipton County"]
["Tennessee","Trousdale County"]
["Tennessee","Unicoi County"]
["Tennessee","Union County"]
["Tennessee","Van Buren County"]
["Tennessee","Warren County"]
["Tennessee","Washington County"]
["Tennessee","Wayne County"]
["Tennessee","Weakley County"]
["Tennessee","White County"]
["Tennessee","Williamson County"]
["Tennessee","Wilson County"]
["Texas","*Entire State*"]
["Texas","Anderson County"]
["Texas","Andrews County"]
["Texas","Angelina County"]
["Texas","Aransas County"]
["Texas","Archer County"]
["Texas","Armstrong County"]
["Texas","Atascosa County"]
["Texas","Austin County"]
["Texas","Bailey County"]
["Texas","Bandera County"]
["Texas","Bastrop County"]
["Texas","Baylor County"]
["Texas","Bee County"]
["Texas","Bell County"]
["Texas","Bexar County"]
["Texas","Blanco County"]
["Texas","Borden County"]
["Texas","Bosque County"]
["Texas","Bowie County"]
["Texas","Brazoria County"]
["Texas","Brazos County"]
["Texas","Brewster County"]
["Texas","Briscoe County"]
["Texas","Brooks County"]
["Texas","Brown County"]
["Texas","Burleson County"]
["Texas","Burnet County"]
["Texas","Caldwell County"]
["Texas","Calhoun County"]
["Texas","Callahan County"]
["Texas","Cameron County"]
["Texas","Camp County"]
["Texas","Carson County"]
["Texas","Cass County"]
["Texas","Castro County"]
["Texas","Chambers County"]
["Texas","Cherokee County"]
["Texas","Childress County"]
["Texas","Clay County"]
["Texas","Cochran County"]
["Texas","Coke County"]
["Texas","Coleman County"]
["Texas","Collin County"]
["Texas","Collingsworth County"]
["Texas","Colorado County"]
["Texas","Comal County"]
["Texas","Comanche County"]
["Texas","Concho County"]
["Texas","Cooke County"]
["Texas","Coryell County"]
["Texas","Cottle County"]
["Texas","Crane County"]
["Texas","Crockett County"]
["Texas","Crosby County"]
["Texas","Culberson County"]
["Texas","Dallam County"]
["Texas","Dallas County"]
["Texas","Dawson County"]
["Texas","Deaf Smith County"]
["Texas","Delta County"]
["Texas","Denton County"]
["Texas","DeWitt County"]
["Texas","Dickens County"]
["Texas","Dimmit County"]
["Texas","Donley County"]
["Texas","Duval County"]
["Texas","Eastland County"]
["Texas","Ector County"]
["Texas","Edwards County"]
["Texas","El Paso County"]
["Texas","Ellis County"]
["Texas","Erath County"]
["Texas","Falls County"]
["Texas","Fannin County"]
["Texas","Fayette County"]
["Texas","Fisher County"]
["Texas","Floyd County"]
["Texas","Foard County"]
["Texas","Fort Bend County"]
["Texas","Franklin County"]
["Texas","Freestone County"]
["Texas","Frio County"]
["Texas","Gaines County"]
["Texas","Galveston County"]
["Texas","Garza County"]
["Texas","Gillespie County"]
["Texas","Glasscock County"]
["Texas","Goliad County"]
["Texas","Gonzales County"]
["Texas","Gray County"]
["Texas","Grayson County"]
["Texas","Gregg County"]
["Texas","Grimes County"]
["Texas","Guadalupe County"]
["Texas","Hale County"]
["Texas","Hall County"]
["Texas","Hamilton County"]
["Texas","Hansford County"]
["Texas","Hardeman County"]
["Texas","Hardin County"]
["Texas","Harris County"]
["Texas","Harrison County"]
["Texas","Hartley County"]
["Texas","Haskell County"]
["Texas","Hays County"]
["Texas","Hemphill County"]
["Texas","Henderson County"]
["Texas","Hidalgo County"]
["Texas","Hill County"]
["Texas","Hockley County"]
["Texas","Hood County"]
["Texas","Hopkins County"]
["Texas","Houston County"]
["Texas","Howard County"]
["Texas","Hudspeth County"]
["Texas","Hunt County"]
["Texas","Hutchinson County"]
["Texas","Irion County"]
["Texas","Jack County"]
["Texas","Jackson County"]
["Texas","Jasper County"]
["Texas","Jeff Davis County"]
["Texas","Jefferson County"]
["Texas","Jim Hogg County"]
["Texas","Jim Wells County"]
["Texas","Johnson County"]
["Texas","Jones County"]
["Texas","Karnes County"]
["Texas","Kaufman County"]
["Texas","Kendall County"]
["Texas","Kenedy County"]
["Texas","Kent County"]
["Texas","Kerr County"]
["Texas","Kimble County"]
["Texas","King County"]
["Texas","Kinney County"]
["Texas","Kleberg County"]
["Texas","Knox County"]
["Texas","La Salle County"]
["Texas","Lamar County"]
["Texas","Lamb County"]
["Texas","Lampasas County"]
["Texas","Lavaca County"]
["Texas","Lee County"]
["Texas","Leon County"]
["Texas","Liberty County"]
["Texas","Limestone County"]
["Texas","Lipscomb County"]
["Texas","Live Oak County"]
["Texas","Llano County"]
["Texas","Loving County"]
["Texas","Lubbock County"]
["Texas","Lynn County"]
["Texas","Madison County"]
["Texas","Marion County"]
["Texas","Martin County"]
["Texas","Mason County"]
["Texas","Matagorda County"]
["Texas","Maverick County"]
["Texas","McCulloch County"]
["Texas","McLennan County"]
["Texas","McMullen County"]
["Texas","Medina County"]
["Texas","Menard County"]
["Texas","Midland County"]
["Texas","Milam County"]
["Texas","Mills County"]
["Texas","Mitchell County"]
["Texas","Montague County"]
["Texas","Montgomery County"]
["Texas","Moore County"]
["Texas","Morris County"]
["Texas","Motley County"]
["Texas","Nacogdoches County"]
["Texas","Navarro County"]
["Texas","Newton County"]
["Texas","Nolan County"]
["Texas","Nueces County"]
["Texas","Ochiltree County"]
["Texas","Oldham County"]
["Texas","Orange County"]
["Texas","Palo Pinto County"]
["Texas","Panola County"]
["Texas","Parker County"]
["Texas","Parmer County"]
["Texas","Pecos County"]
["Texas","Polk County"]
["Texas","Potter County"]
["Texas","Presidio County"]
["Texas","Rains County"]
["Texas","Randall County"]
["Texas","Reagan County"]
["Texas","Real County"]
["Texas","Red River County"]
["Texas","Reeves County"]
["Texas","Refugio County"]
["Texas","Roberts County"]
["Texas","Robertson County"]
["Texas","Rockwall County"]
["Texas","Runnels County"]
["Texas","Rusk County"]
["Texas","Sabine County"]
["Texas","San Augustine County"]
["Texas","San Jacinto County"]
["Texas","San Patricio County"]
["Texas","San Saba County"]
["Texas","Schleicher County"]
["Texas","Scurry County"]
["Texas","Shackelford County"]
["Texas","Shelby County"]
["Texas","Sherman County"]
["Texas","Smith County"]
["Texas","Somervell County"]
["Texas","Starr County"]
["Texas","Stephens County"]
["Texas","Sterling County"]
["Texas","Stonewall County"]
["Texas","Sutton County"]
["Texas","Swisher County"]
["Texas","Tarrant County"]
["Texas","Taylor County"]
["Texas","Terrell County"]
["Texas","Terry County"]
["Texas","Throckmorton County"]
["Texas","Titus County"]
["Texas","Tom Green County"]
["Texas","Travis County"]
["Texas","Trinity County"]
["Texas","Tyler County"]
["Texas","Upshur County"]
["Texas","Upton County"]
["Texas","Uvalde County"]
["Texas","Val Verde County"]
["Texas","Van Zandt County"]
["Texas","Victoria County"]
["Texas","Walker County"]
["Texas","Waller County"]
["Texas","Ward County"]
["Texas","Washington County"]
["Texas","Webb County"]
["Texas","Wharton County"]
["Texas","Wheeler County"]
["Texas","Wichita County"]
["Texas","Wilbarger County"]
["Texas","Willacy County"]
["Texas","Williamson County"]
["Texas","Wilson County"]
["Texas","Winkler County"]
["Texas","Wise County"]
["Texas","Wood County"]
["Texas","Yoakum County"]
["Texas","Young County"]
["Texas","Zapata County"]
["Texas","Zavala County"]
["Utah","*Entire State*"]
["Utah","Beaver County"]
["Utah","Box Elder County"]
["Utah","Cache County"]
["Utah","Carbon County"]
["Utah","Daggett County"]
["Utah","Davis County"]
["Utah","Duchesne County"]
["Utah","Emery County"]
["Utah","Garfield County"]
["Utah","Grand County"]
["Utah","Iron County"]
["Utah","Juab County"]
["Utah","Kane County"]
["Utah","Millard County"]
["Utah","Morgan County"]
["Utah","Piute County"]
["Utah","Rich County"]
["Utah","Salt Lake County"]
["Utah","San Juan County"]
["Utah","Sanpete County"]
["Utah","Sevier County"]
["Utah","Summit County"]
["Utah","Tooele County"]
["Utah","Uintah County"]
["Utah","Utah County"]
["Utah","Wasatch County"]
["Utah","Washington County"]
["Utah","Wayne County"]
["Utah","Weber County"]
["Vermont","*Entire State*"]
["Vermont","Addison County"]
["Vermont","Bennington County"]
["Vermont","Caledonia County"]
["Vermont","Chittenden County"]
["Vermont","Essex County"]
["Vermont","Franklin County"]
["Vermont","Grand Isle County"]
["Vermont","Lamoille County"]
["Vermont","Orange County"]
["Vermont","Orleans County"]
["Vermont","Rutland County"]
["Vermont","Washington County"]
["Vermont","Windham County"]
["Vermont","Windsor County"]
["Virginia","*Entire State*"]
["Virginia","Accomack County"]
["Virginia","Albemarle County"]
["Virginia","Alexandria, City of"]
["Virginia","Alleghany County"]
["Virginia","Amelia County"]
["Virginia","Amherst County"]
["Virginia","Appomattox County"]
["Virginia","Arlington County"]
["Virginia","Augusta County"]
["Virginia","Bath County"]
["Virginia","Bedford County"]
["Virginia","Bland County"]
["Virginia","Botetourt County"]
["Virginia","Bristol, City of"]
["Virginia","Brunswick County"]
["Virginia","Buchanan County"]
["Virginia","Buckingham County"]
["Virginia","Buena Vista, City of"]
["Virginia","Campbell County"]
["Virginia","Caroline County"]
["Virginia","Carroll County"]
["Virginia","Charles City County"]
["Virginia","Charlotte County"]
["Virginia","Charlottesville, City of"]
["Virginia","Chesapeake, City of"]
["Virginia","Chesterfield County"]
["Virginia","Clarke County"]
["Virginia","Colonial Heights, City of"]
["Virginia","Covington, City of"]
["Virginia","Craig County"]
["Virginia","Culpeper County"]
["Virginia","Cumberland County"]
["Virginia","Danville, City of"]
["Virginia","Dickenson County"]
["Virginia","Dinwiddie County"]
["Virginia","Emporia, City of"]
["Virginia","Essex County"]
["Virginia","Fairfax County"]
["Virginia","Fairfax, City of"]
["Virginia","Falls Church, City of"]
["Virginia","Fauquier County"]
["Virginia","Floyd County"]
["Virginia","Fluvanna County"]
["Virginia","Franklin County"]
["Virginia","Franklin, City of"]
["Virginia","Frederick County"]
["Virginia","Fredericksburg, City of"]
["Virginia","Galax, City of"]
["Virginia","Giles County"]
["Virginia","Gloucester County"]
["Virginia","Goochland County"]
["Virginia","Grayson County"]
["Virginia","Greene County"]
["Virginia","Greensville County"]
["Virginia","Halifax County"]
["Virginia","Hampton, City of"]
["Virginia","Hanover County"]
["Virginia","Harrisonburg, City of"]
["Virginia","Henrico County"]
["Virginia","Henry County"]
["Virginia","Highland County"]
["Virginia","Hopewell, City of"]
["Virginia","Isle of Wight County"]
["Virginia","James City County"]
["Virginia","King and Queen County"]
["Virginia","King George County"]
["Virginia","King William County"]
["Virginia","Lancaster County"]
["Virginia","Lee County"]
["Virginia","Lexington, City of"]
["Virginia","Loudoun County"]
["Virginia","Louisa County"]
["Virginia","Lunenburg County"]
["Virginia","Lynchburg, City of"]
["Virginia","Madison County"]
["Virginia","Manassas Park, City of"]
["Virginia","Manassas, City of"]
["Virginia","Martinsville, City of"]
["Virginia","Mathews County"]
["Virginia","Mecklenburg County"]
["Virginia","Middlesex County"]
["Virginia","Montgomery County"]
["Virginia","Nelson County"]
["Virginia","New Kent County"]
["Virginia","Newport News, City of"]
["Virginia","Norfolk, City of"]
["Virginia","Northampton County"]
["Virginia","Northumberland County"]
["Virginia","Norton, City of"]
["Virginia","Nottoway County"]
["Virginia","Orange County"]
["Virginia","Page County"]
["Virginia","Patrick County"]
["Virginia","Petersburg, City of"]
["Virginia","Pittsylvania County"]
["Virginia","Poquoson, City of"]
["Virginia","Portsmouth, City of"]
["Virginia","Powhatan County"]
["Virginia","Prince Edward County"]
["Virginia","Prince George County"]
["Virginia","Prince William County"]
["Virginia","Pulaski County"]
["Virginia","Radford, City of"]
["Virginia","Rappahannock County"]
["Virginia","Richmond County"]
["Virginia","Richmond, City of"]
["Virginia","Roanoke County"]
["Virginia","Roanoke, City of"]
["Virginia","Rockbridge County"]
["Virginia","Rockingham County"]
["Virginia","Russell County"]
["Virginia","Salem, City of"]
["Virginia","Scott County"]
["Virginia","Shenandoah County"]
["Virginia","Smyth County"]
["Virginia","Southampton County"]
["Virginia","Spotsylvania County"]
["Virginia","Stafford County"]
["Virginia","Staunton, City of"]
["Virginia","Suffolk, City of"]
["Virginia","Surry County"]
["Virginia","Sussex County"]
["Virginia","Tazewell County"]
["Virginia","Virginia Beach, City of"]
["Virginia","Warren County"]
["Virginia","Washington County"]
["Virginia","Waynesboro, City of"]
["Virginia","Westmoreland County"]
["Virginia","Williamsburg, City of"]
["Virginia","Winchester, City of"]
["Virginia","Wise County"]
["Virginia","Wythe County"]
["Virginia","York County"]
["Washington","*Entire State*"]
["Washington","Adams County"]
["Washington","Asotin County"]
["Washington","Benton County"]
["Washington","Chelan County"]
["Washington","Clallam County"]
["Washington","Clark County"]
["Washington","Columbia County"]
["Washington","Cowlitz County"]
["Washington","Douglas County"]
["Washington","Ferry County"]
["Washington","Franklin County"]
["Washington","Garfield County"]
["Washington","Grant County"]
["Washington","Grays Harbor County"]
["Washington","Island County"]
["Washington","Jefferson County"]
["Washington","King County"]
["Washington","Kitsap County"]
["Washington","Kittitas County"]
["Washington","Klickitat County"]
["Washington","Lewis County"]
["Washington","Lincoln County"]
["Washington","Mason County"]
["Washington","Okanogan County"]
["Washington","Pacific County"]
["Washington","Pend Oreille County"]
["Washington","Pierce County"]
["Washington","San Juan County"]
["Washington","Skagit County"]
["Washington","Skamania County"]
["Washington","Snohomish County"]
["Washington","Spokane County"]
["Washington","Stevens County"]
["Washington","Thurston County"]
["Washington","Wahkiakum County"]
["Washington","Walla Walla County"]
["Washington","Whatcom County"]
["Washington","Whitman County"]
["Washington","Yakima County"]
["West Virginia","*Entire State*"]
["West Virginia","Barbour County"]
["West Virginia","Berkeley County"]
["West Virginia","Boone County"]
["West Virginia","Braxton County"]
["West Virginia","Brooke County"]
["West Virginia","Cabell County"]
["West Virginia","Calhoun County"]
["West Virginia","Clay County"]
["West Virginia","Doddridge County"]
["West Virginia","Fayette County"]
["West Virginia","Gilmer County"]
["West Virginia","Grant County"]
["West Virginia","Greenbrier County"]
["West Virginia","Hampshire County"]
["West Virginia","Hancock County"]
["West Virginia","Hardy County"]
["West Virginia","Harrison County"]
["West Virginia","Jackson County"]
["West Virginia","Jefferson County"]
["West Virginia","Kanawha County"]
["West Virginia","Lewis County"]
["West Virginia","Lincoln County"]
["West Virginia","Logan County"]
["West Virginia","Marion County"]
["West Virginia","Marshall County"]
["West Virginia","Mason County"]
["West Virginia","McDowell County"]
["West Virginia","Mercer County"]
["West Virginia","Mineral County"]
["West Virginia","Mingo County"]
["West Virginia","Monongalia County"]
["West Virginia","Monroe County"]
["West Virginia","Morgan County"]
["West Virginia","Nicholas County"]
["West Virginia","Ohio County"]
["West Virginia","Pendleton County"]
["West Virginia","Pleasants County"]
["West Virginia","Pocahontas County"]
["West Virginia","Preston County"]
["West Virginia","Putnam County"]
["West Virginia","Raleigh County"]
["West Virginia","Randolph County"]
["West Virginia","Ritchie County"]
["West Virginia","Roane County"]
["West Virginia","Summers County"]
["West Virginia","Taylor County"]
["West Virginia","Tucker County"]
["West Virginia","Tyler County"]
["West Virginia","Upshur County"]
["West Virginia","Wayne County"]
["West Virginia","Webster County"]
["West Virginia","Wetzel County"]
["West Virginia","Wirt County"]
["West Virginia","Wood County"]
["West Virginia","Wyoming County"]
["Wisconsin","*Entire State*"]
["Wisconsin","Adams County"]
["Wisconsin","Ashland County"]
["Wisconsin","Barron County"]
["Wisconsin","Bayfield County"]
["Wisconsin","Brown County"]
["Wisconsin","Buffalo County"]
["Wisconsin","Burnett County"]
["Wisconsin","Calumet County"]
["Wisconsin","Chippewa County"]
["Wisconsin","Clark County"]
["Wisconsin","Columbia County"]
["Wisconsin","Crawford County"]
["Wisconsin","Dane County"]
["Wisconsin","Dodge County"]
["Wisconsin","Door County"]
["Wisconsin","Douglas County"]
["Wisconsin","Dunn County"]
["Wisconsin","Eau Claire County"]
["Wisconsin","Florence County"]
["Wisconsin","Fond du Lac County"]
["Wisconsin","Forest County"]
["Wisconsin","Grant County"]
["Wisconsin","Green County"]
["Wisconsin","Green Lake County"]
["Wisconsin","Iowa County"]
["Wisconsin","Iron County"]
["Wisconsin","Jackson County"]
["Wisconsin","Jefferson County"]
["Wisconsin","Juneau County"]
["Wisconsin","Kenosha County"]
["Wisconsin","Kewaunee County"]
["Wisconsin","La Crosse County"]
["Wisconsin","Lafayette County"]
["Wisconsin","Langlade County"]
["Wisconsin","Lincoln County"]
["Wisconsin","Manitowoc County"]
["Wisconsin","Marathon County"]
["Wisconsin","Marinette County"]
["Wisconsin","Marquette County"]
["Wisconsin","Menominee County"]
["Wisconsin","Milwaukee County"]
["Wisconsin","Monroe County"]
["Wisconsin","Oconto County"]
["Wisconsin","Oneida County"]
["Wisconsin","Outagamie County"]
["Wisconsin","Ozaukee County"]
["Wisconsin","Pepin County"]
["Wisconsin","Pierce County"]
["Wisconsin","Polk County"]
["Wisconsin","Portage County"]
["Wisconsin","Price County"]
["Wisconsin","Racine County"]
["Wisconsin","Richland County"]
["Wisconsin","Rock County"]
["Wisconsin","Rusk County"]
["Wisconsin","Sauk County"]
["Wisconsin","Sawyer County"]
["Wisconsin","Shawano County"]
["Wisconsin","Sheboygan County"]
["Wisconsin","St. Croix County"]
["Wisconsin","Taylor County"]
["Wisconsin","Trempealeau County"]
["Wisconsin","Vernon County"]
["Wisconsin","Vilas County"]
["Wisconsin","Walworth County"]
["Wisconsin","Washburn County"]
["Wisconsin","Washington County"]
["Wisconsin","Waukesha County"]
["Wisconsin","Waupaca County"]
["Wisconsin","Waushara County"]
["Wisconsin","Winnebago County"]
["Wisconsin","Wood County"]
["Wyoming","*Entire State*"]
["Wyoming","Albany County"]
["Wyoming","Big Horn County"]
["Wyoming","Campbell County"]
["Wyoming","Carbon County"]
["Wyoming","Converse County"]
["Wyoming","Crook County"]
["Wyoming","Fremont County"]
["Wyoming","Goshen County"]
["Wyoming","Hot Springs County"]
["Wyoming","Johnson County"]
["Wyoming","Laramie County"]
["Wyoming","Lincoln County"]
["Wyoming","Natrona County"]
["Wyoming","Niobrara County"]
["Wyoming","Park County"]
["Wyoming","Platte County"]
["Wyoming","Sheridan County"]
["Wyoming","Sublette County"]
["Wyoming","Sweetwater County"]
["Wyoming","Teton County"]
["Wyoming","Uinta County"]
["Wyoming","Washakie County"]
["Wyoming","Weston County"]
["*Other Territories*"]
["American Samoa","*Entire Territory*"]
["American Samoa","Eastern District"]
["American Samoa","Manu'a District"]
["American Samoa","Rose Atoll (Rose Island)"]
["American Samoa","Swains Island"]
["American Samoa","Western District"]
["Guam","Guam"]
["Northern Mariana Islands","*Entire Territory*"]
["Northern Mariana Islands","Northern Islands Municipality"]
["Northern Mariana Islands","Rota Municipality"]
["Northern Mariana Islands","Saipan Municipality"]
["Northern Mariana Islands","Tinian Municipality"]
["Puerto Rico","*Entire Territory*"]
["Puerto Rico","Adjuntas Municipality"]
["Puerto Rico","Aguada Municipality"]
["Puerto Rico","Aguadilla Municipality"]
["Puerto Rico","Aguas Buenas Municipality"]
["Puerto Rico","Aibonito Municipality"]
["Puerto Rico","Añasco Municipality"]
["Puerto Rico","Arecibo Municipality"]
["Puerto Rico","Arroyo Municipality"]
["Puerto Rico","Barceloneta Municipality"]
["Puerto Rico","Barranquitas Municipality"]
["Puerto Rico","Bayamón Municipality"]
["Puerto Rico","Cabo Rojo Municipality"]
["Puerto Rico","Caguas Municipality"]
["Puerto Rico","Camuy Municipality"]
["Puerto Rico","Canóvanas Municipality"]
["Puerto Rico","Carolina Municipality"]
["Puerto Rico","Cataño Municipality"]
["Puerto Rico","Cayey Municipality"]
["Puerto Rico","Ceiba Municipality"]
["Puerto Rico","Ciales Municipality"]
["Puerto Rico","Cidra Municipality"]
["Puerto Rico","Coamo Municipality"]
["Puerto Rico","Comerío Municipality"]
["Puerto Rico","Corozal Municipality"]
["Puerto Rico","Culebra Municipality"]
["Puerto Rico","Dorado Municipality"]
["Puerto Rico","Fajardo Municipality"]
["Puerto Rico","Florida Municipality"]
["Puerto Rico","Guánica Municipality"]
["Puerto Rico","Guayama Municipality"]
["Puerto Rico","Guayanilla Municipality"]
["Puerto Rico","Guaynabo Municipality"]
["Puerto Rico","Gurabo Municipality"]
["Puerto Rico","Hatillo Municipality"]
["Puerto Rico","Hormigueros Municipality"]
["Puerto Rico","Humacao Municipality"]
["Puerto Rico","Isabela Municipality"]
["Puerto Rico","Jayuya Municipality"]
["Puerto Rico","Juana Díaz Municipality"]
["Puerto Rico","Juncos Municipality"]
["Puerto Rico","Lajas Municipality"]
["Puerto Rico","Lares Municipality"]
["Puerto Rico","Las Marías Municipality"]
["Puerto Rico","Las Piedras Municipality"]
["Puerto Rico","Loíza Municipality"]
["Puerto Rico","Luquillo Municipality"]
["Puerto Rico","Manatí Municipality"]
["Puerto Rico","Maricao Municipality"]
["Puerto Rico","Maunabo Municipality"]
["Puerto Rico","Mayagüez Municipality"]
["Puerto Rico","Moca Municipality"]
["Puerto Rico","Morovis Municipality"]
["Puerto Rico","Naguabo Municipality"]
["Puerto Rico","Naranjito Municipality"]
["Puerto Rico","Orocovis Municipality"]
["Puerto Rico","Patillas Municipality"]
["Puerto Rico","Peñuelas Municipality"]
["Puerto Rico","Ponce Municipality"]
["Puerto Rico","Quebradillas Municipality"]
["Puerto Rico","Rincón Municipality"]
["Puerto Rico","Río Grande Municipality"]
["Puerto Rico","Sabana Grande Municipality"]
["Puerto Rico","Salinas Municipality"]
["Puerto Rico","San Germán Municipality"]
["Puerto Rico","San Juan Municipality"]
["Puerto Rico","San Lorenzo Municipality"]
["Puerto Rico","San Sebastián Municipality"]
["Puerto Rico","Santa Isabel Municipality"]
["Puerto Rico","Toa Alta Municipality"]
["Puerto Rico","Toa Baja Municipality"]
["Puerto Rico","Trujillo Alto Municipality"]
["Puerto Rico","Utuado Municipality"]
["Puerto Rico","Vega Alta Municipality"]
["Puerto Rico","Vega Baja Municipality"]
["Puerto Rico","Vieques Municipality"]
["Puerto Rico","Villalba Municipality"]
["Puerto Rico","Yabucoa Municipality"]
["Puerto Rico","Yauco Municipality"]
["U.S. Minor Outlying Islands","*Entire Territory*"]
["U.S. Minor Outlying Islands","Baker Island"]
["U.S. Minor Outlying Islands","Howland Island"]
["U.S. Minor Outlying Islands","Jarvis Island"]
["U.S. Minor Outlying Islands","Johnston Atoll"]
["U.S. Minor Outlying Islands","Kingman Reef"]
["U.S. Minor Outlying Islands","Midway Islands"]
["U.S. Minor Outlying Islands","Navassa Island"]
["U.S. Minor Outlying Islands","Palmyra Atoll"]
["U.S. Minor Outlying Islands","Wake Island"]
["Virgin Islands (U.S.)","*Entire Territory*"]
["Virgin Islands (U.S.)","Saint Croix Island"]
["Virgin Islands (U.S.)","Saint John Island"]
["Virgin Islands (U.S.)","Saint Thomas Island"]

{"sheet":"dropdowns","index":9,"n_rows":59,"n_cols":7,"rows_kept":59,"hidden":true}
["YesNo",null,"Priority List",null,null,"State or equivalent","ST"]
["Yes",null,"Category 1 (HVRP)",null,null,"Alabama","AL"]
["No",null,"Category 2 (HFVVWF)",null,null,"Alaska","AK"]
[null,null,"Category 3 (IVTP)",null,null,"Arizona","AZ"]
[{"$nulls":5},"Arkansas","AR"]
[{"$nulls":5},"California","CA"]
["ServiceArea",{"$nulls":4},"Colorado","CO"]
["Urban",{"$nulls":4},"Connecticut","CT"]
["Rural",{"$nulls":4},"Delaware","DE"]
[{"$nulls":5},"District of Columbia","DC"]
[{"$nulls":5},"Florida","FL"]
[{"$nulls":5},"Georgia","GA"]
[{"$nulls":5},"Hawaiʻi","HI"]
[{"$nulls":5},"Idaho","ID"]
[{"$nulls":5},"Illinois","IL"]
[{"$nulls":5},"Indiana","IN"]
[{"$nulls":5},"Iowa","IA"]
[{"$nulls":5},"Kansas","KS"]
[{"$nulls":5},"Kentucky","KY"]
[{"$nulls":5},"Louisiana","LA"]
[{"$nulls":5},"Maine","ME"]
[{"$nulls":5},"Maryland","MD"]
[{"$nulls":5},"Massachusetts","MA"]
[{"$nulls":5},"Michigan","MI"]
[{"$nulls":5},"Minnesota","MN"]
[{"$nulls":5},"Mississippi","MS"]
[{"$nulls":5},"Missouri","MO"]
[{"$nulls":5},"Montana","MT"]
[{"$nulls":5},"Nebraska","NE"]
[{"$nulls":5},"Nevada","NV"]
[{"$nulls":5},"New Hampshire","NH"]
[{"$nulls":5},"New Jersey","NJ"]
[{"$nulls":5},"New Mexico","NM"]
[{"$nulls":5},"New York","NY"]
[{"$nulls":5},"North Carolina","NC"]
[{"$nulls":5},"North Dakota","ND"]
[{"$nulls":5},"Ohio","OH"]
[{"$nulls":5},"Oklahoma","OK"]
[{"$nulls":5},"Oregon","OR"]
[{"$nulls":5},"Pennsylvania","PA"]
[{"$nulls":5},"Rhode Island","RI"]
[{"$nulls":5},"South Carolina","SC"]
[{"$nulls":5},"South Dakota","SD"]
[{"$nulls":5},"Tennessee","TN"]
[{"$nulls":5},"Texas","TX"]
[{"$nulls":5},"Utah","UT"]
[{"$nulls":5},"Vermont","VT"]
[{"$nulls":5},"Virginia","VA"]
[{"$nulls":5},"Washington","WA"]
[{"$nulls":5},"West Virginia","WV"]
[{"$nulls":5},"Wisconsin","WI"]
[{"$nulls":5},"Wyoming","WY"]
[{"$nulls":5},"*Other Territories*","NA"]
[{"$nulls":5},"American Samoa","AS"]
[{"$nulls":5},"Guam","GU"]
[{"$nulls":5},"Northern Mariana Islands","NI"]
[{"$nulls":5},"Puerto Rico","PR"]
[{"$nulls":5},"U.S. Minor Outlying Islands","OI"]
[{"$nulls":5},"Virgin Islands (U.S.)","VI"]