{"text_format":"3","workbook":"xlsx","n_sheets":9,"sheets":["Introduction","Product","Question","ProductIngredient","Ingredient","Sheet3","Sheet4","Sheet5","Sheet6"],"not_rendered":{"macros":1,"external_links":1,"defined_names":113,"comments":2},"read":"row_number_cap","date_system":"1900"}

{"sheet":"Introduction","index":0,"n_rows":23,"n_cols":8,"rows_kept":23,"merged":[[0,0,0,1],[1,0,1,1],[1,2,1,3],[1,7,1,12],[2,0,2,1],[2,2,16,3],[22,0,26,3]]}
["Unique Identifying Information for New Tobacco Products",null,null,"DRAFT FORM"]
["Instructions:\n1.  You MUST enter the Applicant Name, Product Category and Product Subcategory as required by 21 CFR § 1114.7(c)(3) on this page.   \n2.  Enter values for the applicable product properties specified in Table 1 to 21 CFR § 1114.7(c)(3)(iii) in Product Tab. \n3.  Verify Completion before saving as XLS or XLSX.  You must save as XLS or XLSX for eSubmitter. ",null,"Additional Comments",{"$nulls":4},"OMB Control No. 0910-0879\nExpiration Date: xx/xx/xxxx\nSee PRA Statement on bottom of page"]
["Product Information",null,"\nSaving as an .xls or .xlsx will cause all drop down menus to disappear, so be certain you are completely finished.  Your data will be saved, but you will not have drop down functions if you must re-open.  \n\nContinue through the errors and save the file as \"Tobacco_Product_list.xls\" or \"Tobacco_Product_list.xlsx\". If there are multiple product files, save the files as \"Tobacco_Product_list_n.xls\"  or \"Tobacco_Product_list_n.xlsx\"(where n=1,2,3,etc.)\n\nUsing \"Additional Property\" to differentiate the products if all the other unique product properties are exactly same.                                                                       "]
["Applicant Name"]
["Product Category"]
["Product Subcategory"]
["Product Category, If other"]
["Product Subcategory, if Other"]
{"$rows_empty":11}
["Version: 12.0 Microsoft Excel"]
["Release Date: 11/17/2019"]
[]
["This section applies only to requirements of the Paperwork Reduction Act of 1995.\n*DO NOT SEND YOUR COMPLETED FORM TO THE PRA STAFF ADDRESS BELOW.*\nThe burden time for this collection of information is estimated to average 4 hours per response, including the time to review instructions, search existing data sources, gather and maintain the data needed and complete and review the collection of information. Send comments regarding this burden estimate or any other aspect of this information collection, including suggestions for reducing this burden, to the following email address:\nFor PRA questions:\nPRAStaff@fda.hhs.gov\nOMB Statement: “An agency may not conduct or sponsor and a person is not required to respond to, a collection of information unless it displays a currently valid OMB number.”"]

{"sheet":"Product","index":1,"n_rows":6,"n_cols":67,"rows_kept":6,"merged":[[0,0,0,3]]}
["When you complete the data entry for unique product properties, please click the button on the right:"]
["Product Name","Package Type","Package Type, if Other","Package Quantity Numeric Value","Units (Package Quantity)","Units, if Other (Package Quantity)","Package Quantity Mass Numeric Value","Units (Package Quantity Mass)","Units, if Other (Package Quantity Mass)","Characterizing Flavor","Characterizing Flavor, If other","Tobacco Cut Size Desciption  ","Tobacco Cut Size Description, if Other","Tobacco Cut Size Numeric Value","Units (Tobacco Cut Size)","Portion Count Numeric Value","Units (Portion Count)","Units, if Other (Portion Count)","Portion Mass Numeric Value","Units (Portion Mass)","Length Description","Length Description, if Other","Length Numeric Value","Units (Length)","Width Numeric Value","Units (Width)","Diameter Description","Diameter Description, if Other","Diameter Format","Diameter Numeric Value","Units (Diameter)","Portion Thickness Numeric Value","Units (Portion Thickness)","Ventilation","E-liquid Volume","E-liquid Volume Units","Nicotine Concentration","Nicotine Concentration Units","Units, if Other (Nicotine Concentration)","PG Numeric Value","VG Numeric Value","PG/VG                     Not Applicable","Wattage Numeric Value","Units (Wattage)","Units, if Other (Wattage)","Battery Capacity Numeric Value","Units (Battery Capacity)","Units, if Other (Battery Capacity)","Tip Type","Tip Type, if Other","Wrapper Material","Wrapper Material, if Other","Number of Hose ","Source of Energy ","Source of Energy, if Other","Additional Property","Product/ Component","Product/Component Subcategory",{"$nulls":8},"FDATOBPDT"]
[{"$nulls":66},"Closed E-Cigarette"]
[]
[{"$nulls":66},"Cigarette"]
[{"$nulls":66},"Combusted, Filtered"]

{"sheet":"Question","index":2,"n_rows":2,"n_cols":17,"rows_kept":2,"hidden":true,"merged":[[0,0,0,3],[0,4,0,11]],"read":"row_number_cap"}
["When you complete the data entry for unique product questions, please click the button on the right:"]
["Product Name","Row Number in Product Tab","Are you still waiting on some information to come in (such as HPHC test results, stability testing, clinical studies, or research studies)?","Will you submit electronically?","Does your product contain a characterizing flavor?"," Is the product currently on the market, previously marketed, or never been marketed?","Was your product introduced or delivered for introduction into interstate commerce for commercial distribution in the United States on August 8, 2016? ","Is the product UL 8139 certified or does it meet any battery standards?","What is the maximum temperature that the product can achieve?","Is the maximum temperature electronically limited?","What percentage of the additives are USP grade?","What is the acetaldehyde level in the aerosol?","What is the diacetyl level in the e-liquid?","Does your application include an abuse liability study (nicotine abuse) specific to the submitted product?","Does your application include an actual use study specific to the submitted product?","Is your product child tamper resistant?","Is your product able to be refilled by the user, If it is ENDS? "]

{"sheet":"ProductIngredient","index":3,"n_rows":5003,"n_cols":60,"rows_kept":5003,"hidden":true,"merged":[[0,0,2,0],[0,1,2,1],[0,2,2,2],[0,3,2,3],[0,4,2,4],[0,5,2,5],[0,6,2,6],[0,7,2,7],[0,8,2,8],[0,9,2,9],[0,10,2,10],[0,11,0,27],[0,28,0,32],[0,33,0,56],[1,11,1,18],[1,19,1,24],[1,25,1,27],[1,28,1,32],[1,33,1,35],[1,37,1,42],[1,43,1,54],[1,55,1,56],[1,57,2,57]]}
["Product Name *","Row Number in Product Tab","Component Type *","If \"Other\" component type, specify","Component Name","Manufacturer Name and Manufacturer's Uniquely Identifying Component Name and/or Number *\n\nSeparate each entry using a semicolon (;)","Ingredient Name* ","Ingredient Number (IN#)*","Type of Ingredient *","Type of Additive Change","Date of Change","PART 1. INGREDIENT IDENTIFICATION (COMPLETE ONLY A, B, OR C, AS APPROPRIATE)",{"$nulls":16},"PART 2. INGREDIENT DETAILS (OR COMPONENT SPECIFICATIONS) *",{"$nulls":4},"PART 3. QUANTITY *",{"$nulls":23},"Part 4. Comments"]
[{"$nulls":11},"A. Single Chemical Substance ",{"$nulls":7},"B. Leaf Tobacco ",{"$nulls":5},"B. Complex Purchased Ingredients (e.g., flavor extracts, tobacco lead blends, reconstituted tobacco, spices, fruit juice, adhesives, charcoal)",null,null,"Applicable to “Single Chemical Substance” and “Complex Ingredient” only. Skip Part 2\nfor “Leaf Tobacco”. You may also skip Part 2 if you are eliminating the ingredient or reporting an increase or decrease in\nthe quantity of the ingredient as you have indicated in Question 1.",{"$nulls":4},"Quantity *",null,null,"Amount Calculated","Amount Tested",{"$nulls":5},"Amount to Achieve an Outcome",{"$nulls":11},"Residual Amount",null,"Any additional Information or Comments Regarding this Ingredient "]
[{"$nulls":11},"Unique Scientific Name*","Type of Name*","If \"Other…\" Type of Name, Specify","Registry Code* ","Type of Code*","If \"Other…\" Type of Code. Specify","Is this Ingredient a Reaction Product?*","If this ingredient is a Reaction Product, enter all ingredients known or intended to form this product.\nSeparate each entry using a semicolon (;)","Tobacco Type* (e.g., Burley, Bright, Oriental)","Variety*","Cure Method*","If \"Other…\" Cure Method, Specify","Heat Source* (e.g., propane, wood)","DNA recombinant technology used to engineer the tobacco?*","Enter the manufacturer's name and the unique identifying item name and/or number used by the manufacturer*\nSeparate each entry using a semicolon (;)","Is Ingredient Custom-Made to Your Specifications?*","If Custom-made, enter each specified ingredient*\nSeparate each entry using a semicolon (;)","Quality - Unit of Measure*","If \"Other…\" Unit of Measure, Specify Units "," Quality Value (e.g., % purity, applicable public standard) of the ingredient ","Expected Functions ","If \"Other…\" Function, Specify "," Unit of Measure*","Reported per*","Type of Quantity* ","Singular Quantity\nSeparate each entry using a semicolon (;)\n\n* Required field if Type of Quantity = Amount Calculated","Mean Quantity\n\n* Required field if Type of Quantity = Amount Tested","Variability\n\nSelect only one then enter value(s) in Single Value, Lower Limit, and Upper Limit as approprate","If \"Other…\" Variability, Specify\n\n* Required field if Variability = Other","Single Value\n\n* Required field if Variability is Standard Error or Other","Lower Limit\n\n* Required field if Variability is Confidence Interval","Upper Limit\n\n* Required field if Variability is Confidence Interval","Target Outcome Type","If \"Other…\" Target Outcome Type, Specify ","Target Outcome Units and Values","If \"Other…\" Target Outcome Units and Values Specify ","Value\n\n* Required if Target Outcome Units and Values is pH units, Grams of Total Sugars per Unit of Use, Grams of Total Sugars per Gram of Product, or Other","CIE L* Value\n\n* Required if Target Outcome Units and Values is CIE L*a*b*","CIE A* Value\n\n* Required if Target Outcome Units and Values is CIE L*a*b*","CIE B* Value\n\n* Required if Target Outcome Units and Values is CIE L*a*b*","Reporting Value\n\n* Required field if Type of Quantity = Amount to Achieve an Outcome","Typical Quantity (if Reporting Value is Typical Quantity)\n\n* Required field if Reporting Value = Typical Quantity","Minimum Quantity\n\n* Required field if Reporting Value = Range","Maximum Quantity\n\n* Required field if Reporting Value = Range","Residual Quantity","Limit of Detection"]
[{"$nulls":59},{"$f":"$A4&$B4","v":""}]
[{"$nulls":59},""]
[{"$nulls":59},""]
[{"$nulls":59},""]
[{"$nulls":59},""]
[{"$nulls":59},""]
[{"$nulls":59},""]
[{"$nulls":59},""]
[{"$nulls":59},""]
[{"$nulls":59},""]
[{"$nulls":59},""]
[{"$nulls":59},""]
[{"$nulls":59},""]
[{"$nulls":59},""]
[{"$nulls":59},""]
[{"$nulls":59},""]
[{"$nulls":59},""]
[{"$nulls":59},""]
[{"$nulls":59},""]
[{"$nulls":59},""]
[{"$nulls":59},""]
[{"$nulls":59},""]
[{"$nulls":59},""]
[{"$nulls":59},""]
[{"$nulls":59},""]
[{"$nulls":59},""]
[{"$nulls":59},""]
[{"$nulls":59},""]
[{"$nulls":59},""]
[{"$nulls":59},""]
[{"$nulls":59},""]
[{"$nulls":59},""]
[{"$nulls":59},""]
[{"$nulls":59},""]
[{"$nulls":59},""]
[{"$nulls":59},""]
[{"$nulls":59},""]
{"$rows_left_out":4964}
{"sheet":"Ingredient","index":4,"n_rows":2,"n_cols":103,"rows_kept":2,"hidden":true,"merged":[[0,0,1,0],[0,1,1,1],[0,2,1,2],[0,3,0,7],[0,8,0,12],[0,13,0,17],[0,18,0,22],[0,23,0,27],[0,28,0,32],[0,33,0,37],[0,38,0,42],[0,43,0,47],[0,48,0,52],[0,53,0,57],[0,58,0,62],[0,63,0,67],[0,68,0,72],[0,73,0,77],[0,78,0,82],[0,83,0,87],[0,88,0,92],[0,93,0,97],[0,98,0,102]]}
["Product Name","Submission Tracking Number (STN) for the TI submissions if the ingredient of product is submitted in TI ","Component/ Complex Ingredient (CI) Name, if it is component or CI ","Ingredient 1",{"$nulls":4},"Ingredient 2",{"$nulls":4},"Ingredient 3",{"$nulls":4},"Ingredient 4",{"$nulls":4},"Ingredient 5",{"$nulls":4},"Ingredient 6",{"$nulls":4},"Ingredient 7",{"$nulls":4},"Ingredient 8",{"$nulls":4},"Ingredient 9",{"$nulls":4},"Ingredient 10",{"$nulls":4},"Ingredient 11",{"$nulls":4},"Ingredient 12",{"$nulls":4},"Ingredient 13",{"$nulls":4},"Ingredient 14",{"$nulls":4},"Ingredient 15",{"$nulls":4},"Ingredient 16",{"$nulls":4},"Ingredient 17",{"$nulls":4},"Ingredient 18",{"$nulls":4},"Ingredient 19",{"$nulls":4},"Ingredient 20"]
[{"$nulls":3},"Ingredient Name","Manufacturer of the Ingredient","Ingredient Type ","Mass/Volume Numeric Value","Units (Mass/Volume)","Ingredient Name","Manufacturer of the Ingredient","Ingredient Type ","Mass/Volume Numeric Value","Units (Mass/Volume)","Ingredient Name","Manufacturer of the Ingredient","Ingredient Type ","Mass/Volume Numeric Value","Units (Mass/Volume)","Ingredient Name","Manufacturer of the Ingredient","Ingredient Type ","Mass/Volume Numeric Value","Units (Mass/Volume)","Ingredient Name","Manufacturer of the Ingredient","Ingredient Type ","Mass/Volume Numeric Value","Units (Mass/Volume)","Ingredient Name","Manufacturer of the Ingredient","Ingredient Type ","Mass/Volume Numeric Value","Units (Mass/Volume)","Ingredient Name","Manufacturer of the Ingredient","Ingredient Type ","Mass/Volume Numeric Value","Units (Mass/Volume)","Ingredient Name","Manufacturer of the Ingredient","Ingredient Type ","Mass/Volume Numeric Value","Units (Mass/Volume)","Ingredient Name","Manufacturer of the Ingredient","Ingredient Type ","Mass/Volume Numeric Value","Units (Mass/Volume)","Ingredient Name","Manufacturer of the Ingredient","Ingredient Type ","Mass/Volume Numeric Value","Units (Mass/Volume)","Ingredient Name","Manufacturer of the Ingredient","Ingredient Type ","Mass/Volume Numeric Value","Units (Mass/Volume)","Ingredient Name","Manufacturer of the Ingredient","Ingredient Type ","Mass/Volume Numeric Value","Units (Mass/Volume)","Ingredient Name","Manufacturer of the Ingredient","Ingredient Type ","Mass/Volume Numeric Value","Units (Mass/Volume)","Ingredient Name","Manufacturer of the Ingredient","Ingredient Type ","Mass/Volume Numeric Value","Units (Mass/Volume)","Ingredient Name","Manufacturer of the Ingredient","Ingredient Type ","Mass/Volume Numeric Value","Units (Mass/Volume)","Ingredient Name","Manufacturer of the Ingredient","Ingredient Type ","Mass/Volume Numeric Value","Units (Mass/Volume)","Ingredient Name","Manufacturer of the Ingredient","Ingredient Type ","Mass/Volume Numeric Value","Units (Mass/Volume)","Ingredient Name","Manufacturer of the Ingredient","Ingredient Type ","Mass/Volume Numeric Value","Units (Mass/Volume)","Ingredient Name","Manufacturer of the Ingredient","Ingredient Type ","Mass/Volume Numeric Value","Units (Mass/Volume)","Ingredient Name","Manufacturer of the Ingredient","Ingredient Type ","Mass/Volume Numeric Value","Units (Mass/Volume)"]

{"sheet":"Sheet3","index":5,"n_rows":109,"n_cols":11,"rows_kept":109,"hidden":true}
["Category","CategoryLookup","ComponentLookUp","Look up values: category",{"$f":"INDEX(Sheet3!B2:B9, MATCH(Introduction!B5, Sheet3!A2:A9,0 ))","v":{"$error":"#N/A"}}]
["Cigarette","Cigarette","CCigarette","flavor",{"$f":"INDEX(Sheet5!D2:D60, MATCH(Introduction!B5 & Introduction!B6,Sheet5!A2:A60,0 ))","v":{"$error":"#N/A"}}]
["Cigar","Cigars","CCigars","Package Type",{"$f":"INDEX(Sheet5!B2:B60, MATCH(Introduction!B5 & Introduction!B6,Sheet5!A2:A60,0 ))","v":{"$error":"#N/A"}}]
["ENDS","ENDS","CENDS","Package Quantity Unit",{"$f":"INDEX(Sheet5!C2:C60, MATCH(Introduction!B5 & Introduction!B6,Sheet5!A2:A60,0 ))","v":{"$error":"#N/A"}}]
["Pipe","PipeTobaccoProduct","CPipeTobaccoProduct","DiameterFormat",{"$f":"INDEX(Sheet4!B2:B9, MATCH(Introduction!B5, Sheet4!A2:A9,0 ))","v":{"$error":"#N/A"}}]
["Roll-Your-Own","RollYourOwn","CRollYourOwn","PortionCount",{"$f":"INDEX(Sheet4!C2:C9, MATCH(Introduction!B5, Sheet4!A2:A9,0 ))","v":{"$error":"#N/A"}}]
["Smokeless","Smokeless","CSmokeless","Component",{"$f":"INDEX(Sheet3!C2:C9, MATCH(Introduction!B5, Sheet3!A2:A9,0 ))","v":{"$error":"#N/A"}}]
["Waterpipe","WaterpipeTobaccoProduct","CWaterpipeTobaccoProduct"]
["Other","Other","COther"]
[]
[]
["Subcategory"]
["Cigarette","Cigars","ENDS","PipeTobaccoProduct","RollYourOwn","Smokeless","WaterpipeTobaccoProduct","Other"]
["Cigarette Co-Package","Cigar Co-Package","Closed E-Cigarette","Pipe","Filter","Dissolvable","Waterpipe","Other"]
["Combusted, Filtered","Cigar Component","Closed E-Liquid","Pipe Co-Package","Filtered Cigarette Tube","Loose Chewing Tobacco","Waterpipe Co-Package","Unknown"]
["Combusted, Non-Filtered","Cigar Tobacco Filler","ENDS Co-Package","Pipe Component","Non-Filtered Cigarette Tube","Loose Dry Snuff","Waterpipe Component"]
["Combusted, Other","Filtered, Sheet-Wrapped Cigar","ENDS Component","Pipe Tobacco Filler","Paper Tip","Loose Moist Snuff","Waterpipe Heat Source"]
["Non-Combusted","Leaf-Wrapped Cigar","Open E-Cigarette","Other","Roll-Your-Own Co-Package","Loose Snus","Waterpipe Tobacco Filler"]
["Other","Unfiltered, Sheet-Wrapped Cigar","Open E-Liquid",null,"Roll-Your-Own Tobacco Filler","Portioned Chewing Tobacco","Other"]
[null,"Other","Other",null,"Rolling Paper","Portioned Moist Snuff"]
[{"$nulls":4},"Other","Portioned Snus"]
[{"$nulls":5},"Smokeless Co-Package"]
[{"$nulls":5},"Other"]
[]
[]
[]
["AllFlavor","LimitedFlavor",null,"AllPackageType","ENDSCECigPT","ENDSCEliqPT","ENDSOECigPT","ENDSOEliqPT","WPPT","WPHSPT"]
["Blueberry ","Menthol ",null,"Bag/Pouch","Box","Cartridge","Box","Bottle","Box","Bag/Pouch"]
["Cherry ","None ",null,"Blister Pack","Clamshell","Other","Clamshell","Box","None","Box"]
["Chocolate ","Tobacco ",null,"Booklet","None",null,"None","Other","Other","Film Sleeve"]
["Cinnamon ","Other",null,"Bottle","Other",null,"Other",null,null,"None"]
["Citrus ",null,null,"Box",{"$nulls":5},"Other"]
["Coffee ",null,null,"Carton"]
["Coke ",null,null,"Cartridge","CigarLimitedPT","CigarFillerPT","CigarettePT","RYOPT","RPPT","SMKPT","RYOOPT"]
["Cola ",null,null,"Cellophane","Box","Bag/Pouch","Box","Bag/Pouch","Booklet","Bag/Pouch","Bag/Pouch"]
["Menthol ",null,null,"Clamshell","Cellophane","Metal Can and Lid","Clamshell","Box","Box","Blister Pack","Booklet"]
["Mint ",null,null,"Film Sleeve","Clamshell","Metal Can and Plastic Lid","Hard Box","Other","Other","Carton","Box"]
["Natural ",null,null,"Foil","Foil","None","Hard Pack",null,null,"Matchbook","Metal Can and Lid"]
["None ",null,null,"Hard Box","None","Plastic Can and Lid","Soft Pack",null,null,"Metal Can with Lid","Metal Can and Plastic Lid"]
["Peach ",null,null,"Hard Pack","Soft Pack","Plastic Can and Metal Lid","Other",null,null,"Metal Can with Plastic Lid","Plastic Can and Lid"]
{"$rows_left_out":70}
{"sheet":"Sheet4","index":6,"n_rows":30,"n_cols":8,"rows_kept":30,"hidden":true}
["Cat","DiameterFormatLookUp","PortionCountLookUp",null,"CCigarette"]
["Cigarette","DiameterFormat","PortionCount",null,"CCigars"]
["Cigar","CigarDiameterFormat","PortionCount",null,"CENDS"]
["ENDS","ENDSDiameterFormat","PortionCount",null,"CPipeTobaccoProduct"]
["Pipe","ENDSDiameterFormat","PortionCount",null,"CRollYourOwn"]
["Roll-Your-Own","DiameterFormat","PortionCount",null,"CSmokeless"]
["Smokeless","DiameterFormat","SMKPC",null,"CWaterpipeTobaccoProduct"]
["Waterpipe","DiameterFormat","PQUOther",null,"COther"]
["Other","DiameterFormat","PortionCount"]
[]
[]
[]
["IngredientType","YN"]
["SCS","Yes"]
["CI","No"]
[]
["CCigarette","CCigars","CENDS","CPipeTobaccoProduct","CRollYourOwn","CSmokeless","CWaterpipeTobaccoProduct","COther"]
["Tobacco Filler Additive","Tobacco Filler","E-Liquid","Tobacco Filler","Tobacco Filler Additive","Tobacco Filler","Tobacco Filler","Filter "]
["Adhesive","Tobacco Filler Additive","Atomizer","Tobacco Filler Additive","Adhesive","Tobacco Filler Additive","Tobacco Filler Additive","Ink (Rod Print) "]
["Filter","Adhesive","Coil/Coil Heads","Bowl","Filter","Pouch","Heat Source","Pack Inner Foil "]
["Ink (Rod Print)","Filter","Mouthpiece","Mouthpiece","Ink (Rod Print)","Other","Base","Cigarette Paper "]
["Pack Inner Foil","Tip","Tank/Cartridge","Shank (without bowl)","Cigarette Paper",null,"Bowl","Tipping Paper "]
["Cigarette Paper","Tipping Paper","Wick","Other","Tipping Paper",null,"Diffuser","Plug Wrap "]
["Tipping Paper","Plug Wrap","Other",null,"Plug Wrap",null,"Foil/Screen","Other (Specify)"]
["Plug Wrap","Wrapper/Binder",null,null,"Other",null,"Hose"]
["Other","Other",{"$nulls":4},"Mouthpiece"]
[{"$nulls":6},"Seal"]
[{"$nulls":6},"Stem"]
[{"$nulls":6},"Valve"]
[{"$nulls":6},"Other"]

{"sheet":"Sheet5","index":7,"n_rows":60,"n_cols":4,"rows_kept":60,"hidden":true}
["CatSubCat","PackageTypeLookUp","PackageQuantityUnitsLookUp","FlavorLookup"]
["CigaretteCigarette Co-Package","CigarettePT","CigPQU","LimitedFlavor"]
["CigaretteCombusted, Filtered","CigarettePT","CigPQU","LimitedFlavor"]
["CigaretteCombusted, Non-Filtered","CigarettePT","CigPQU","LimitedFlavor"]
["CigaretteCombusted, Other","CigarettePT","CigPQU","LimitedFlavor"]
["CigaretteNon-Combusted","CigarettePT","CigPQU","LimitedFlavor"]
["CigaretteNot Provided","CigarettePT","CigPQU","LimitedFlavor"]
["CigaretteOther","CigarettePT","CigPQU","LimitedFlavor"]
["CigarCigar Co-Package","AllPackageType","PQUOther","AllFlavor"]
["CigarCigar Component","CigarLimitedPT","PQUOther","AllFlavor"]
["CigarCigar Tobacco Filler","CigarFillerPT","PQUOther","LimitedFlavor"]
["CigarFiltered, sheet-Wrapped cigar","CigarLimitedPT","PQUOther","AllFlavor"]
["CigarLeaf-Wrapped cigar","CigarLimitedPT","PQUOther","AllFlavor"]
["CigarUnfiltered, sheet-Wrapped cigar","CigarLimitedPT","PQUOther","AllFlavor"]
["CigarNot Provided","AllPackageType","PQUOther","AllFlavor"]
["CigarOther","AllPackageType","PQUOther","AllFlavor"]
["ENDSClosed E-Cigarette","ENDSCECigPT","ENDSCECigPQU","AllFlavor"]
["ENDSClosed E-Liquid","ENDSCEliqPT","ENDSCEliqPQU","AllFlavor"]
["ENDSENDS Co-Package","ENDSCECigPT","ENDSCECigPQU","AllFlavor"]
["ENDSENDS Component","ENDSCECigPT","ENDSCECigPQU","AllFlavor"]
["ENDSOpen E-Cigarette","ENDSOECigPT","ENDSCECigPQU","AllFlavor"]
["ENDSOpen E-Liquid","ENDSOEliqPT","ENDSOEliqPQU","AllFlavor"]
["ENDSNot Provided","AllPackageType","AllPackageQuantityUnit","AllFlavor"]
["ENDSOther","AllPackageType","AllPackageQuantityUnit","AllFlavor"]
["PipePipe","PipePT","PipePQU","LimitedFlavor"]
["PipePipe Co-Package","AllPackageType","PipePQU","AllFlavor"]
["PipePipe Component","PipePT","PQUOther","AllFlavor"]
["PipePipe Tobacco Filler","PipeFillerPT","PipePQU","AllFlavor"]
["PipeNot Provided","AllPackageType","PipePQU","AllFlavor"]
["PipeOther","AllPackageType","PipePQU","AllFlavor"]
["Roll-Your-OwnFilter","RYOPT","RYOFilterPQU","LimitedFlavor"]
["Roll-Your-OwnFiltered Cigarette Tube","RYOPT","RYOTubePQU","LimitedFlavor"]
["Roll-Your-OwnNon-Filtered Cigarette Tube","RYOPT","RYOTubePQU","LimitedFlavor"]
["Roll-Your-OwnPaper Tip","RYOPT","RYOTipPQU","LimitedFlavor"]
["Roll-Your-OwnRoll-Your-Own Co-Package","RYOOPT","RYOOtherPQU","LimitedFlavor"]
["Roll-Your-OwnRoll-Your-Own Tobacco Filler","PipeFillerPT","RYOOtherPQU","LimitedFlavor"]
["Roll-Your-OwnRolling Paper","RPPT","RYOPaperPQU","LimitedFlavor"]
["Roll-Your-OwnNot Provided","RYOOPT","RYOOtherPQU","LimitedFlavor"]
["Roll-Your-OwnOther","RYOOPT","RYOOtherPQU","LimitedFlavor"]
["SmokelessDissolvable","SMKPT","SMKPC","AllFlavor"]
{"$rows_left_out":21}
{"sheet":"Sheet6","index":8,"n_rows":51,"n_cols":16,"rows_kept":51,"hidden":true}
["Yes/No","AdditiveChange","TypeIngredient","TypeName","TypeCode","Cure Method","UnitMeasure",null,"ExpectedFunctions ","Unit","Reportedper","Quantity","TestVariability","TargetOutcomeType","TargetOutcomeUnits","ReportingType"]
[null,"Quantity of additive was increased ","Single Chemical Substance","IUPAC Name","FDA UNII Code","Air ","Ash Content (%)","ADD ENHANCE","Addictiveness Enhancer","g","Milliliter of Product","Amount Calculated","Standard Error","Color","CIE L*a*b*","Typical Quantity"]
["Y","Quantity of additive was decreased","Complex Ingredients","Other","CAS Number","Steam","Assayed Contents (%)","A","Adhesive","mg","Gram of Product ","Amount Tested","95% Confidence Interval","pH","pH Units","Range"]
["N","Additive was eliminated","Other",null,"Other","Fire","Solid Dry Basis (%)","AER","Aerosol forming agent","mcg","Unit of Use","Amount to Achieve An Outcome","Other (Specify Type)","Total Sugars ","Grams of Total Sugars per Unit of Use"]
[null,"Additive was added",{"$nulls":3},"Sun","Solid Wet Basis (%)","AFA","Anti-foaming agent","ng",null,"Residual Amount ",null,"Moisture","Grams of Total Sugars per Gram of Product"]
[{"$nulls":5},"Flue","Moisture (%)","AP","Anti-plasticizer","pg",{"$nulls":3},"Other (Specify)","Other (Specify Unit)"]
[{"$nulls":5},"Other ","CORESTA Unit (cm3 min-1 cm-2 at 1 kPa)","ASA","Anti-sticking agent ","%"]
[{"$nulls":6},"Quality Conforms to a Published Standard - Citation for Standard (e.g., '21 CFR 175.105', or 'FCC 9 Acesulfame Potassium')","ANTI","Antioxidant","mL"]
[{"$nulls":6},"Degrees Brix (°Bx)","B","Binder"]
[{"$nulls":6},"Density (g/cm3)","BIO","Biocide "]
[{"$nulls":6},"Dextrose Equivalent","CAR","Carrier"]
[{"$nulls":6},"Proof","CAS","Casing"]
[{"$nulls":6},"Purity (%)","CHEM","Chemo-sensory Agent"]
[{"$nulls":6},"Specific Gravity (unitless)","CA","Coating Agent"]
[{"$nulls":6},"Specific Rotation (degrees)","COL","Color"]
[{"$nulls":6},"Other (specify unit)","COMB MOD","Combustion Modifier"]
[{"$nulls":7},"DIS","Dispersant"]
[{"$nulls":7},"DRY","Drying Agent"]
[{"$nulls":7},"EMUL","Emulsifier"]
[{"$nulls":7},"FA","Fermentation Agent"]
[{"$nulls":7},"FIB","Fiber"]
[{"$nulls":7},"FILL","Filler"]
[{"$nulls":7},"FFA","Film-forming Agent"]
[{"$nulls":7},"FILT","Filtration"]
[{"$nulls":7},"FL","Flavor"]
[{"$nulls":7},"FFH","Fuel for heat source"]
[{"$nulls":7},"HC","Heat conductor"]
[{"$nulls":7},"HI","Heat insulator "]
[{"$nulls":7},"H","Humectant"]
[{"$nulls":7},"INK","Ink"]
[{"$nulls":7},"LRA","Lip release Agent"]
[{"$nulls":7},"MD","Menthol Delivery"]
[{"$nulls":7},"MB","Moisture Barrier"]
[{"$nulls":7},"MOIS","Moisturizer"]
[{"$nulls":7},"NS","Nicotine source"]
[{"$nulls":7},"OB","Oxygen barrier"]
[{"$nulls":7},"pH","pH adjuster"]
[{"$nulls":7},"PHB","pH buffer"]
[{"$nulls":7},"PLAT","Plasticizer"]
[{"$nulls":7},"PCA","Porosity control agent"]
{"$rows_left_out":11}