{"text_format":"3","workbook":"xlsx","n_sheets":10,"sheets":["Instructions","Section 1","Section 2","Section 3","Section 4","Summary","Checks","OutputForCSV","Lists","TempOutput"],"not_rendered":{"macros":1,"defined_names":47,"comments":6},"read":"whole","date_system":"1900"}

{"sheet":"Instructions","index":0,"n_rows":19,"n_cols":3,"rows_kept":19}
[]
[null,null,"OMB Control Number: 2060-0170"]
[null,null,"Expiration Date: 4/16/2023"]
[null,null,"U.S. Environmental Protection Agency "]
[null,null,"Stratospheric Ozone Protection Program"]
[]
[null,null,"Methyl Bromide Producer Quarterly Report (Sec 82.13)"]
[null,null,"Version 5.0"]
[null,null,"Last Updated: April 2020"]
[]
[null,null,"Instructions"]
[null,null,"Complete this form by filling in the data fields that are highlighted in blue.  Guidance on how to complete individual data fields are provided in comment bubbles. Use the arrows to navigate between the tabs. Once completed, use the 'prepare submission' button on the Summary tab to generate your CSV file.  "]
[null,null,"Report Submission: This Excel file, the generated CSV file, and all supporting attachments should be submitted to EPA through the Central Data Exchange (CDX). Refer to EPA's website for additional information on form submission:"]
[null,null,"https://www.epa.gov/ods-phaseout/ods-recordkeeping-and-reporting"]
[]
{"$rows_left_out":5}
{"sheet":"Section 1","index":1,"n_rows":15,"n_cols":9,"rows_kept":15,"merged":[[7,2,7,3]]}
[]
[null,null,"U.S. Environmental Protection Agency"]
[null,null,"Methyl Bromide Producer Quarterly Report"]
[]
[null,null,"   Date Prepared:",{"$f":"TODAY()","v":"2020-04-16"}]
[]
[null,null,"Section 1: Report Identification Information "]
[null,null,"Complete all fields below.  No fields may be left blank."]
[null,null,"Company Name: ",null,null,{"$f":"IF($D$9=0,1,0)","v":1}]
[null,null,"Submission Type:",null,null,{"$f":"IF(OR(SubTSelection=Lists!C3,SubTSelection=Lists!C4),0,1)","v":1},null,null,{"$f":"IF(SubTSelection=\"\",\"\",IF(OR(SubTSelection=Lists!C3,SubTSelection=Lists!C4),\"\",\"PLEASE SELECT A VALID SUBMISSION TYPE FROM THE DROPDOWN LIST\"))","v":""}]
[null,null,"Reporting Year:",null,null,{"$f":"IF(OR($D$11=0,$D$11>Lists!$E$3),1,0)","v":1},null,null,{"$f":"IF(D11>Lists!E3,\"PLEASE CHOOSE A CURRENT OR PAST YEAR\",\"\")","v":""}]
[null,null,"Reporting Quarter:",null,null,{"$f":"IF(OR(ReportQtr=0,ReportQtr>Lists!F6),1,0)","v":1},null,null,{"$f":"IF(ReportQtr>Lists!F6,\"PLEASE SELECT A VALID QUARTER FROM THE DROPDOWN LIST\",\"\")","v":""}]
[{"$nulls":3},""]
[{"$nulls":3},{"$f":"Lists!C3","v":"Original Submission"}]
[{"$nulls":3},{"$f":"Lists!C4","v":"Re-Submittal"}]
{"$rows_left_out":1}
{"sheet":"Section 2","index":2,"n_rows":13,"n_cols":19,"rows_kept":13,"merged":[[8,3,8,13],[13,3,13,4],[14,3,14,4],[15,3,15,4],[16,3,16,4],[17,3,17,4],[18,3,18,4]]}
[]
[{"$nulls":3},"U.S. Environmental Protection Agency"]
[{"$nulls":3},"Methyl Bromide Producer Quarterly Report"]
[]
[{"$nulls":3},"Company Name:",{"$f":"IF('Section 1'!D9=0,\"\",'Section 1'!D9)","v":""}]
[{"$nulls":3},"Reporting Period:",{"$f":"IF(OR('Section 1'!D11=0,'Section 1'!D12=0),\"\",\"Quarter \"&'Section 1'!D12&\", \"&'Section 1'!D11)","v":""}]
[]
[{"$nulls":3},"Section 2: Production Data"]
[{"$nulls":3},"In the table below, enter the quantity of methyl bromide that was produced during the reporting period.  If no methyl bromide was produced, the table may be left blank. As a reminder, if methyl bromide was produced for QPS applications, global lab, emergency uses, second party transformation, or second party destruction, a copy of the transformation verification, destruction verification, QPS certification, and/or essential use certification from each company for whom material was produced must be provided to EPA along with the submission of this report.\n"]
[{"$nulls":3},"In-House Transformation ","Second Party Transformation ","In-House Destruction ","Second Party Destruction ","QPS","Pre-Plant Critical Use","Post-Harvest Critical Use","Critical Use for Export","Emergency Use","Global Lab","Gross Production"]
[{"$nulls":3},"kg","kg","kg","kg","kg","kg","kg","kg","kg","kg","Autopopulated"]
[{"$nulls":3},{"v":1500,"d":"1,500.00"},{"v":0,"d":"0.00"},{"v":0,"d":"0.00"},{"v":0,"d":"0.00"},{"v":100.5,"d":"100.50"},{"v":0,"d":"0.00"},{"v":200,"d":"200.00"},{"v":0,"d":"0.00"},{"v":0,"d":"0.00"},{"v":0,"d":"0.00"},{"$f":"D12+E12+F12+G12+H12+I12+J12+K12+L12+M12","v":{"v":1800.5,"d":"1,800.50"}},null,null,"Filled Out?","Sec2 Inclusion 2nd Party in Sec 3? - Trans/Dest","Section 3 Inclusion - Global Lab/Emergency"]
[{"$f":"IF(Q13=0,1,\"\")","v":""},{"$nulls":12},{"$f":"IF((D13+E13+F13+G13+H13+I13+J13+K13+L13+M13)=0,\"\",D13+E13+F13+G13+H13+I13+J13+K13+L13+M13)","v":""},null,null,{"$f":"IF(N13=\"\",\"N\",0)","v":"N"},{"$f":"IF(Q13=\"N\",0,IF(OR(AND(E13>0,COUNTIF('Section 3'!$G$15:$G$50,Lists!G3)=0),AND(G13>0,COUNTIF('Section 3'!$G$15:$G$50,Lists!G4)=0),AND(H13>0,COUNTIF('Section 3'!$G$15:$G$50,Lists!G5)=0)),1,0))","v":0},{"$f":"IF(Q13=\"N\",0,IF(OR(AND(M13>0,COUNTIF('Section 3'!$G$15:$G$50,Lists!G6)=0),AND(L13>0,COUNTIF('Section 3'!$G$15:$G$50,Lists!G7)=0)),1,0))","v":0}]

{"sheet":"Section 3","index":3,"n_rows":56,"n_cols":17,"rows_kept":56,"merged":[[8,3,8,6],[9,3,9,6],[10,3,10,6],[11,3,11,4],[12,3,12,4],[13,3,13,4],[14,3,14,4],[15,3,15,4],[16,3,16,4],[17,3,17,4],[18,3,18,4],[19,3,19,4],[20,3,20,4],[21,3,21,4],[22,3,22,4],[23,3,23,4],[24,3,24,4],[25,3,25,4],[26,3,26,4],[27,3,27,4],[28,3,28,4],[29,3,29,4],[30,3,30,4],[31,3,31,4],[32,3,32,4],[33,3,33,4],[34,3,34,4],[35,3,35,4],[36,3,36,4],[37,3,37,4],[38,3,38,4],[39,3,39,4],[40,3,40,4],[41,3,41,4],[42,3,42,4],[43,3,43,4],[44,3,44,4],[45,3,45,4],[46,3,46,4],[47,3,47,4],[48,3,48,4],[49,3,49,4]]}
[]
[{"$nulls":3},"U.S. Environmental Protection Agency"]
[{"$nulls":3},"Methyl Bromide Producer Quarterly Report"]
[]
[{"$nulls":3},"Company Name:",{"$f":"IF('Section 1'!D9=0,\"\",'Section 1'!D9)","v":""}]
[{"$nulls":3},"Reporting Period:",{"$f":"IF(OR('Section 1'!D11=0,'Section 1'!D12=0),\"\",\"Quarter \"&'Section 1'!D12&\", \"&'Section 1'!D11)","v":""}]
[]
[{"$nulls":3},"Section 3: Shipment/Sales Data"]
[{"$nulls":3},"Identify the recipient company(s) of the methyl bromide produced for second party transformation, second party destruction, QPS, global lab, and/or emergency uses, and the amount shipped to or purchased by each recipient company during the quarter. "]
[{"$nulls":3},"Note: Due to a potential time lag between the date of production and the date of shipment, it is recognized that for a given quarter the information in Section 3 may not match the information reported in Section 2 for second party transformation, second party destruction, and QPS; however, it is expected that all material produced for second party transformation, second party destruction, and QPS will eventually be shipped to a second party and must be reported as such in the applicable quarterly report. "]
[{"$nulls":3},"As a reminder, a copy of the transformation verification, destruction verification, QPS certification, and/or essential use certification from each second party for whom material was produced must be provided to EPA along with the submission of this report."]
[{"$nulls":3},"Recipient Company Name",null,"Quantity","Purpose"]
[{"$nulls":3},"Text",null,"kg","Selection"]
[{"$nulls":3},"Company A",null,{"v":10,"d":"10.00"},"Transformation",{"$nulls":4},"ActiveRow?","Character Check","Completeness check","Valid Purpose","Sec2 Inclusion in Sec3 - LE","Sec2 Inclusion in Sec3 - 2nd Party/QPS"]
[{"$f":"IF(D15=0,\"\",1)","v":""},{"$nulls":10},{"$f":"IF(A15=\"\",\"N\",\"Y\")","v":"N"},{"$f":"IF(LEN(D15)>200,1,0)","v":0},{"$f":"IF(D15=0,0,IF(OR(F15=0,G15=0),1,0))","v":0},{"$f":"IF(G15=0,0,IF(COUNTIF(Lists!$G$3:$G$7,G15)>0,0,1))","v":0},{"$f":"IF(OR(AND('Section 2'!$M$13=0,G15=Lists!$G$6),AND('Section 2'!$L$13=0,G15=Lists!$G$7)),1,0)","v":0},{"$f":"IF(OR(AND('Section 2'!$E$13=0,G15=Lists!$G$3),AND('Section 2'!$G$13=0,G15=Lists!$G$4),AND('Section 2'!$H$13=0,G15=Lists!$G$5)),1,0)","v":0}]
{"$rows_left_out":42}
{"sheet":"Section 4","index":4,"n_rows":17,"n_cols":13,"rows_kept":17,"hidden":true,"merged":[[8,3,8,7],[11,3,11,7],[12,3,12,4],[13,3,13,4],[14,3,14,4],[15,3,15,4],[16,3,16,4]]}
[]
[{"$nulls":3},"U.S. Environmental Protection Agency"]
[{"$nulls":3},"Methyl Bromide Producer Quarterly Report"]
[]
[{"$nulls":3},"Company Name:",{"$f":"IF('Section 1'!D9=0,\"\",'Section 1'!D9)","v":""}]
[{"$nulls":3},"Reporting Period:",{"$f":"IF(OR('Section 1'!D11=0,'Section 1'!D12=0),\"\",\"Quarter \"&'Section 1'!D12&\", \"&'Section 1'!D11)","v":""}]
[]
[{"$nulls":3},"Section 4: Producers Critical Use Year-End Inventory (Quarter 4 Only)"]
[{"$nulls":3},"Identify the amount of critical use methyl bromide held by your company at the end of the control period.",{"$nulls":7},"Q4 Inventory Check","Q1-Q3 Completeness Check"]
[{"$nulls":4},"  kg owned by reporting company",{"$nulls":6},"IF(ReportQtr=4,IF(ISBLANK(D10),1,0),0)",{"$f":"IF(ReportQtr<4,IF(D10<>0,1,0),0)","v":0}]
[]
[{"$nulls":3},"Identify the name(s) of company(s) for which critical use methyl bromide is being held by the reporting entity, and the associated amounts held for each (excluding end-users)."]
[{"$nulls":3},"Company Name",null,"Pre-Plant ","Post-Harvest "]
[{"$nulls":3},"Text",null,"kg","kg",{"$nulls":3},"ActiveRow","Q4 Completeness Check","Q1-Q3 Completeness Check"]
[{"$f":"IF(D15=0,\"\",1)","v":""},{"$nulls":9},{"$f":"IF(D15=\"\",\"N\",\"Y\")","v":"N"},{"$f":"IF(K15=\"y\",IF(AND(ISBLANK(F15),ISBLANK(G15)),1,0),0)","v":0},{"$f":"IF(ReportQtr<4,IF(OR(K15=\"Y\",F15>0,G15>0),1,0),0)","v":0}]
{"$rows_left_out":3}
{"sheet":"Summary","index":5,"n_rows":12,"n_cols":6,"rows_kept":12,"hidden":true,"merged":[[8,3,8,5],[9,3,10,3],[9,4,9,5]]}
[]
[{"$nulls":3},"U.S. Environmental Protection Agency"]
[{"$nulls":3},"Methyl Bromide Producer Quarterly Report"]
[]
[{"$nulls":3},"Company Name:",{"$f":"IF('Section 1'!D9=0,\"\",'Section 1'!D9)","v":""}]
[{"$nulls":3},"Reporting Period:",{"$f":"IF(OR('Section 1'!D11=0,'Section 1'!D12=0),\"\",\"Quarter \"&'Section 1'!D12&\", \"&'Section 1'!D11)","v":""}]
[]
[{"$nulls":3},"Allowance Summary"]
[{"$nulls":3},"The values in the table below are calculated based on data entered in Section 2.  If the totals appear to be incorrect, please return to Section 2 to review your data."]
[{"$nulls":3},"Chemical Name","Allowances Expended (kg)"]
[{"$nulls":4},"Pre-Plant Critical Use","Post-Harvest Critical Use"]
[1,null,null,"CH3Br",{"$f":"'Section 2'!I13","v":{"v":0,"d":"0.00"}},{"$f":"'Section 2'!J13","v":{"v":0,"d":"0.00"}}]

{"sheet":"Checks","index":6,"n_rows":27,"n_cols":5,"rows_kept":27,"hidden":true}
[]
[null,"Section","Check Description","Status (1 = Incomplete, 0 = Complete)"]
[null,"Section 1","All - Section 1",{"$f":"IF(SUM('Section 1'!F9:F12)>0,1,0)","v":1},"Stopper"]
[null,"Section 2","Error Check","NONE","Error Check"]
[null,"Section 2","Filled Out",{"$f":"IF('Section 2'!Q13=\"N\",1,0)","v":1},"Warning"]
[null,"Section 3","Section 3 Inclusion - Lab/Emergency",{"$f":"'Section 2'!S13","v":0},"Stopper"]
[null,"Section 3","Character Check",{"$f":"IF(SUM('Section 3'!M15:M24)>0,1,0)","v":0},"Stopper"]
[null,"Section 3","Sec 2 Inclusion - Lab/Emergency",{"$f":"IF(SUM('Section 3'!P15:P24)>0,1,0)","v":0},"Stopper"]
[null,"Section 3","Completeness check",{"$f":"IF(SUM('Section 3'!N15:N24)>0,1,0)","v":0},"Stopper"]
[null,"Section 3","Sec3 Valid Purpose",{"$f":"IF(SUM('Section 3'!O15:O24)>0,1,0)","v":0},"Stopper"]
[null,"Section 3","Error Check",{"$f":"IF(SUM(D6:D10)>0,1,0)","v":0},"Error Check"]
[null,"Section 3","Sec2 Inclusion 2nd Party in Sec 3",{"$f":"'Section 2'!R13","v":0},"Warning"]
[null,"Section 3","Sec2 Inclusion 2nd Party in Sec3",{"$f":"IF(SUM('Section 3'!Q15:Q24)>0,1,0)","v":0},"Warning"]
[null,"Section 4","Q4 Completeness Check","IF(SUM('Section 4'!L15:L17)>0,1,0)","Stopper"]
[null,"Section 4","Q1-Q3 Completeness Check","IF(SUM('Section 4'!M15:M17,'Section 4'!M10)>0,1,0)","Stopper"]
{"$rows_left_out":13}
{"sheet":"OutputForCSV","index":7,"n_rows":43,"n_cols":16,"rows_kept":43,"hidden":true}
["Row #","Entry",1,"PROD3","4",{"$f":"'Section 1'!D5","v":"2020-04-16"},{"$f":"'Section 1'!D9","v":0},{"$f":"'Section 1'!D10","v":0},{"$f":"'Section 1'!D11","v":0},{"$f":"'Section 1'!D12","v":0},{"$nulls":5},"LastColumn"]
[{"$f":"IF(D2=\"\",\"\",ROWS($A$1:A2))","v":""},1,{"$f":"IF(D2=\"\",\"\",2)","v":""},{"$f":"IF(O2=\"\",\"\",\"CH3Br\")","v":""},{"$f":"IFERROR(VLOOKUP($B2,'Section 2'!$A$13:$N$13,COLUMNS('Section 2'!$A$13:D$13),0),\"\")","v":""},{"$f":"IFERROR(VLOOKUP($B2,'Section 2'!$A$13:$N$13,COLUMNS('Section 2'!$A$13:E$13),0),\"\")","v":""},{"$f":"IFERROR(VLOOKUP($B2,'Section 2'!$A$13:$N$13,COLUMNS('Section 2'!$A$13:F$13),0),\"\")","v":""},{"$f":"IFERROR(VLOOKUP($B2,'Section 2'!$A$13:$N$13,COLUMNS('Section 2'!$A$13:G$13),0),\"\")","v":""},{"$f":"IFERROR(VLOOKUP($B2,'Section 2'!$A$13:$N$13,COLUMNS('Section 2'!$A$13:H$13),0),\"\")","v":""},{"$f":"IFERROR(VLOOKUP($B2,'Section 2'!$A$13:$N$13,COLUMNS('Section 2'!$A$13:I$13),0),\"\")","v":""},{"$f":"IFERROR(VLOOKUP($B2,'Section 2'!$A$13:$N$13,COLUMNS('Section 2'!$A$13:J$13),0),\"\")","v":""},{"$f":"IFERROR(VLOOKUP($B2,'Section 2'!$A$13:$N$13,COLUMNS('Section 2'!$A$13:K$13),0),\"\")","v":""},{"$f":"IFERROR(VLOOKUP($B2,'Section 2'!$A$13:$N$13,COLUMNS('Section 2'!$A$13:L$13),0),\"\")","v":""},{"$f":"IFERROR(VLOOKUP($B2,'Section 2'!$A$13:$N$13,COLUMNS('Section 2'!$A$13:M$13),0),\"\")","v":""},{"$f":"IFERROR(VLOOKUP($B2,'Section 2'!$A$13:$N$13,COLUMNS('Section 2'!$A$13:N$13),0),\"\")","v":""}]
[{"$f":"IF(D3=\"\",\"\",ROWS($A$1:A3))","v":""},1,{"$f":"IF(D3=\"\",\"\",3)","v":""},{"$f":"IF(E3=\"\",\"\",\"CH3Br\")","v":""},{"$f":"IFERROR(VLOOKUP($B3,'Section 3'!$A$15:$G$50,COLUMNS('Section 3'!$A$15:D$15),0),\"\")","v":""},{"$f":"IFERROR(VLOOKUP($B3,'Section 3'!$A$15:$G$50,COLUMNS('Section 3'!$A$15:F$15),0),\"\")","v":""},{"$f":"IFERROR(IF(VLOOKUP($B3,'Section 3'!$A$15:$G$50,COLUMNS('Section 3'!$A$15:G$15),0)=\"QPS\",\"QPS\",PROPER(VLOOKUP($B3,'Section 3'!$A$15:$G$50,COLUMNS('Section 3'!$A$15:G$50),0))),\"\")","v":""}]
[{"$f":"IF(D4=\"\",\"\",ROWS($A$1:A4))","v":""},2,{"$f":"IF(D4=\"\",\"\",3)","v":""},{"$f":"IF(E4=\"\",\"\",\"CH3Br\")","v":""},{"$f":"IFERROR(VLOOKUP($B4,'Section 3'!$A$15:$G$50,COLUMNS('Section 3'!$A$15:D$15),0),\"\")","v":""},{"$f":"IFERROR(VLOOKUP($B4,'Section 3'!$A$15:$G$50,COLUMNS('Section 3'!$A$15:F$15),0),\"\")","v":""},{"$f":"IFERROR(IF(VLOOKUP($B4,'Section 3'!$A$15:$G$50,COLUMNS('Section 3'!$A$15:G$15),0)=\"QPS\",\"QPS\",PROPER(VLOOKUP($B4,'Section 3'!$A$15:$G$50,COLUMNS('Section 3'!$A$15:G$50),0))),\"\")","v":""}]
[{"$f":"IF(D5=\"\",\"\",ROWS($A$1:A5))","v":""},3,"","",{"$f":"IFERROR(VLOOKUP($B5,'Section 3'!$A$15:$G$50,COLUMNS('Section 3'!$A$15:D$15),0),\"\")","v":""},{"$f":"IFERROR(VLOOKUP($B5,'Section 3'!$A$15:$G$50,COLUMNS('Section 3'!$A$15:F$15),0),\"\")","v":""},{"$f":"IFERROR(IF(VLOOKUP($B5,'Section 3'!$A$15:$G$50,COLUMNS('Section 3'!$A$15:G$15),0)=\"QPS\",\"QPS\",PROPER(VLOOKUP($B5,'Section 3'!$A$15:$G$50,COLUMNS('Section 3'!$A$15:G$50),0))),\"\")","v":""}]
[{"$f":"IF(D6=\"\",\"\",ROWS($A$1:A6))","v":""},4,"","",{"$f":"IFERROR(VLOOKUP($B6,'Section 3'!$A$15:$G$50,COLUMNS('Section 3'!$A$15:D$15),0),\"\")","v":""},{"$f":"IFERROR(VLOOKUP($B6,'Section 3'!$A$15:$G$50,COLUMNS('Section 3'!$A$15:F$15),0),\"\")","v":""},{"$f":"IFERROR(IF(VLOOKUP($B6,'Section 3'!$A$15:$G$50,COLUMNS('Section 3'!$A$15:G$15),0)=\"QPS\",\"QPS\",PROPER(VLOOKUP($B6,'Section 3'!$A$15:$G$50,COLUMNS('Section 3'!$A$15:G$50),0))),\"\")","v":""}]
[{"$f":"IF(D7=\"\",\"\",ROWS($A$1:A7))","v":""},5,"","",{"$f":"IFERROR(VLOOKUP($B7,'Section 3'!$A$15:$G$50,COLUMNS('Section 3'!$A$15:D$15),0),\"\")","v":""},{"$f":"IFERROR(VLOOKUP($B7,'Section 3'!$A$15:$G$50,COLUMNS('Section 3'!$A$15:F$15),0),\"\")","v":""},{"$f":"IFERROR(IF(VLOOKUP($B7,'Section 3'!$A$15:$G$50,COLUMNS('Section 3'!$A$15:G$15),0)=\"QPS\",\"QPS\",PROPER(VLOOKUP($B7,'Section 3'!$A$15:$G$50,COLUMNS('Section 3'!$A$15:G$50),0))),\"\")","v":""}]
[{"$f":"IF(D8=\"\",\"\",ROWS($A$1:A8))","v":""},6,"","",{"$f":"IFERROR(VLOOKUP($B8,'Section 3'!$A$15:$G$50,COLUMNS('Section 3'!$A$15:D$15),0),\"\")","v":""},{"$f":"IFERROR(VLOOKUP($B8,'Section 3'!$A$15:$G$50,COLUMNS('Section 3'!$A$15:F$15),0),\"\")","v":""},{"$f":"IFERROR(IF(VLOOKUP($B8,'Section 3'!$A$15:$G$50,COLUMNS('Section 3'!$A$15:G$15),0)=\"QPS\",\"QPS\",PROPER(VLOOKUP($B8,'Section 3'!$A$15:$G$50,COLUMNS('Section 3'!$A$15:G$50),0))),\"\")","v":""}]
[{"$f":"IF(D9=\"\",\"\",ROWS($A$1:A9))","v":""},7,"","",{"$f":"IFERROR(VLOOKUP($B9,'Section 3'!$A$15:$G$50,COLUMNS('Section 3'!$A$15:D$15),0),\"\")","v":""},{"$f":"IFERROR(VLOOKUP($B9,'Section 3'!$A$15:$G$50,COLUMNS('Section 3'!$A$15:F$15),0),\"\")","v":""},{"$f":"IFERROR(IF(VLOOKUP($B9,'Section 3'!$A$15:$G$50,COLUMNS('Section 3'!$A$15:G$15),0)=\"QPS\",\"QPS\",PROPER(VLOOKUP($B9,'Section 3'!$A$15:$G$50,COLUMNS('Section 3'!$A$15:G$50),0))),\"\")","v":""}]
[{"$f":"IF(D10=\"\",\"\",ROWS($A$1:A10))","v":""},8,"","",{"$f":"IFERROR(VLOOKUP($B10,'Section 3'!$A$15:$G$50,COLUMNS('Section 3'!$A$15:D$15),0),\"\")","v":""},{"$f":"IFERROR(VLOOKUP($B10,'Section 3'!$A$15:$G$50,COLUMNS('Section 3'!$A$15:F$15),0),\"\")","v":""},{"$f":"IFERROR(IF(VLOOKUP($B10,'Section 3'!$A$15:$G$50,COLUMNS('Section 3'!$A$15:G$15),0)=\"QPS\",\"QPS\",PROPER(VLOOKUP($B10,'Section 3'!$A$15:$G$50,COLUMNS('Section 3'!$A$15:G$50),0))),\"\")","v":""}]
[{"$f":"IF(D11=\"\",\"\",ROWS($A$1:A11))","v":""},9,"","",{"$f":"IFERROR(VLOOKUP($B11,'Section 3'!$A$15:$G$50,COLUMNS('Section 3'!$A$15:D$15),0),\"\")","v":""},{"$f":"IFERROR(VLOOKUP($B11,'Section 3'!$A$15:$G$50,COLUMNS('Section 3'!$A$15:F$15),0),\"\")","v":""},{"$f":"IFERROR(IF(VLOOKUP($B11,'Section 3'!$A$15:$G$50,COLUMNS('Section 3'!$A$15:G$15),0)=\"QPS\",\"QPS\",PROPER(VLOOKUP($B11,'Section 3'!$A$15:$G$50,COLUMNS('Section 3'!$A$15:G$50),0))),\"\")","v":""}]
[{"$f":"IF(D12=\"\",\"\",ROWS($A$1:A12))","v":""},10,"",{"$f":"IF(E12=\"\",\"\",\"CH3Br\")","v":""},{"$f":"IFERROR(VLOOKUP($B12,'Section 3'!$A$15:$G$50,COLUMNS('Section 3'!$A$15:D$15),0),\"\")","v":""},{"$f":"IFERROR(VLOOKUP($B12,'Section 3'!$A$15:$G$50,COLUMNS('Section 3'!$A$15:F$15),0),\"\")","v":""},{"$f":"IFERROR(IF(VLOOKUP($B12,'Section 3'!$A$15:$G$50,COLUMNS('Section 3'!$A$15:G$15),0)=\"QPS\",\"QPS\",PROPER(VLOOKUP($B12,'Section 3'!$A$15:$G$50,COLUMNS('Section 3'!$A$15:G$50),0))),\"\")","v":""}]
[{"$f":"IF(D13=\"\",\"\",ROWS($A$1:A13))","v":""},11,"","",{"$f":"IFERROR(VLOOKUP($B13,'Section 3'!$A$15:$G$50,COLUMNS('Section 3'!$A$15:D$15),0),\"\")","v":""},{"$f":"IFERROR(VLOOKUP($B13,'Section 3'!$A$15:$G$50,COLUMNS('Section 3'!$A$15:F$15),0),\"\")","v":""},{"$f":"IFERROR(IF(VLOOKUP($B13,'Section 3'!$A$15:$G$50,COLUMNS('Section 3'!$A$15:G$15),0)=\"QPS\",\"QPS\",PROPER(VLOOKUP($B13,'Section 3'!$A$15:$G$50,COLUMNS('Section 3'!$A$15:G$50),0))),\"\")","v":""}]
[{"$f":"IF(D14=\"\",\"\",ROWS($A$1:A14))","v":""},12,"","",{"$f":"IFERROR(VLOOKUP($B14,'Section 3'!$A$15:$G$50,COLUMNS('Section 3'!$A$15:D$15),0),\"\")","v":""},{"$f":"IFERROR(VLOOKUP($B14,'Section 3'!$A$15:$G$50,COLUMNS('Section 3'!$A$15:F$15),0),\"\")","v":""},{"$f":"IFERROR(IF(VLOOKUP($B14,'Section 3'!$A$15:$G$50,COLUMNS('Section 3'!$A$15:G$15),0)=\"QPS\",\"QPS\",PROPER(VLOOKUP($B14,'Section 3'!$A$15:$G$50,COLUMNS('Section 3'!$A$15:G$50),0))),\"\")","v":""}]
[{"$f":"IF(D15=\"\",\"\",ROWS($A$1:A15))","v":""},13,"","",{"$f":"IFERROR(VLOOKUP($B15,'Section 3'!$A$15:$G$50,COLUMNS('Section 3'!$A$15:D$15),0),\"\")","v":""},{"$f":"IFERROR(VLOOKUP($B15,'Section 3'!$A$15:$G$50,COLUMNS('Section 3'!$A$15:F$15),0),\"\")","v":""},{"$f":"IFERROR(IF(VLOOKUP($B15,'Section 3'!$A$15:$G$50,COLUMNS('Section 3'!$A$15:G$15),0)=\"QPS\",\"QPS\",PROPER(VLOOKUP($B15,'Section 3'!$A$15:$G$50,COLUMNS('Section 3'!$A$15:G$50),0))),\"\")","v":""}]
{"$rows_left_out":29}
{"sheet":"Lists","index":8,"n_rows":25,"n_cols":15,"rows_kept":25,"hidden":true}
[{"$nulls":13},"Variables for Data Submission"]
[null,"Chemical Name","Submission Type","Reporting Year","Current Year","Reporting Quarter","Purpose","Date for CSV Title","Form Name for CSV Title",null,"Form Type","Form Code",null,null,"Row #"]
[null,"CH3Br","Original Submission",2018,{"$f":"YEAR(TODAY())","v":2020},1,"Transformation",{"$f":"MONTH(SubDate)&\"-\"&DAY(SubDate)&\"-\"&YEAR(SubDate)","v":"4-16-2020"},"MeBr Producer",null,"Class I Producer","PROD1",null,"Sec2End",{"$f":"IF(MAX(OutputForCSV!A2:A2)=0,1,MAX(OutputForCSV!A2:A2))","v":1}]
[null,null,"Re-Submittal",2019,null,2,"Destruction",{"$nulls":3},"MeBr Producer","PROD3",null,"Sec3Start",{"$f":"OutputForCSV!A3","v":""}]
[{"$nulls":3},2020,null,3,"QPS",{"$nulls":3},"Class II Producer","PROD2",null,"Sec3End",{"$f":"MAX(OutputForCSV!A3:A38)","v":0}]
[{"$nulls":3},2021,null,4,"Global Lab",{"$nulls":3},"Class I Importer","IMPT1",null,"Sec4Start",{"$f":"OutputForCSV!A39","v":""}]
[{"$nulls":3},2022,null,null,"Emergency Use",{"$nulls":3},"MeBr Importer","IMPT3",null,"Sec4End",{"$f":"MAX(OutputForCSV!A39:A42)","v":0}]
[{"$nulls":3},2023,{"$nulls":6},"Class II Importer","IMPT2",null,"MaxTempRow",{"$f":"IF(MAX(TempOutput!A2:A40)=0,1,MAX(TempOutput!A2:A40))","v":3}]
[{"$nulls":3},2024,{"$nulls":6},"Class I Exporter","EXPT1",null,"Sec3PasteRow",{"$f":"IF(O3=0,2,O3+1)","v":2}]
[{"$nulls":3},2025,{"$nulls":6},"MeBr Exporter","EXPT3",null,"Sec4PasteRow",{"$f":"ROWS(OutputForCSV!A1:A38)-COUNTIF(OutputForCSV!A2:A38,\"\")+1","v":2}]
[{"$nulls":3},2026,{"$nulls":6},"Class II Exporter","EXPT2"]
[{"$nulls":3},2027,{"$nulls":6},"Class I Lab Supplier","LABS1"]
[{"$nulls":3},2028,{"$nulls":6},"Class I Destruction","DEST1"]
[{"$nulls":3},2029,{"$nulls":6},"MeBr Destruction","DEST3"]
[{"$nulls":10},"Class II Destruction","DEST2"]
{"$rows_left_out":11}
{"sheet":"TempOutput","index":9,"n_rows":40,"n_cols":14,"rows_kept":40,"hidden":true}
["MaxRow",1,"PROD3","3","2020-03-26","Test","Original Submission",2020,1]
[{"$f":"IF(OR(B2=\"\",B2=0),\"\",ROWS($A$1:A2))","v":2},2,"CH3Br",22,0,0,0,44,0,0,22,0,0,88]
[{"$f":"IF(OR(B3=\"\",B3=0),\"\",ROWS($A$1:A3))","v":3},3,"CH3Br","test",44,"Transformation"]
[{"$f":"IF(OR(B4=\"\",B4=0),\"\",ROWS($A$1:A4))","v":""}]
[{"$f":"IF(OR(B5=\"\",B5=0),\"\",ROWS($A$1:A5))","v":""}]
[{"$f":"IF(OR(B6=\"\",B6=0),\"\",ROWS($A$1:A6))","v":""}]
[{"$f":"IF(OR(B7=\"\",B7=0),\"\",ROWS($A$1:A7))","v":""}]
[{"$f":"IF(OR(B8=\"\",B8=0),\"\",ROWS($A$1:A8))","v":""}]
[{"$f":"IF(OR(B9=\"\",B9=0),\"\",ROWS($A$1:A9))","v":""}]
[{"$f":"IF(OR(B10=\"\",B10=0),\"\",ROWS($A$1:A10))","v":""}]
[{"$f":"IF(OR(B11=\"\",B11=0),\"\",ROWS($A$1:A11))","v":""}]
[{"$f":"IF(OR(B12=\"\",B12=0),\"\",ROWS($A$1:A12))","v":""}]
[{"$f":"IF(OR(B13=\"\",B13=0),\"\",ROWS($A$1:A13))","v":""}]
[{"$f":"IF(OR(B14=\"\",B14=0),\"\",ROWS($A$1:A14))","v":""}]
[{"$f":"IF(OR(B15=\"\",B15=0),\"\",ROWS($A$1:A15))","v":""}]
{"$rows_left_out":25}