{"text_format":"3","workbook":"xlsx","n_sheets":6,"sheets":["VETS-402","Export","Output","Pivot","Data","Lists"],"not_rendered":{"images":1,"macros":1,"defined_names":6,"pivot_tables":1},"read":"whole","date_system":"1900"}

{"sheet":"VETS-402","index":0,"n_rows":78,"n_cols":30,"rows_kept":78,"merged":[[0,1,0,2],[0,3,0,29],[1,0,8,0],[1,1,1,2],[1,3,1,9],[1,10,1,15],[1,16,3,20],[1,21,4,21],[1,22,3,27],[1,28,1,29],[2,1,2,2],[2,3,3,10],[2,11,4,11],[2,12,3,15],[2,28,2,29],[3,1,3,2],[4,1,4,2],[4,3,4,4],[4,5,4,7],[4,8,4,9],[4,12,4,13],[4,14,4,15],[4,17,4,18],[4,22,4,23],[4,24,4,25],[4,27,4,28],[5,1,7,2],[5,3,5,29],[6,4,6,5],[6,6,6,7],[6,8,6,9],[6,10,9,10],[6,11,9,11],[6,12,6,13],[6,14,6,15],[6,16,6,17],[6,18,6,19],[6,20,9,20],[6,21,9,21],[6,22,6,23],[6,24,6,25],[6,26,6,27],[6,28,6,29],[9,0,76,0],[9,1,10,1],[10,3,10,29],[11,1,11,29],[12,1,20,1],[12,3,12,29],[13,10,19,10],[14,20,19,20],[20,3,20,29],[21,1,21,29],[22,1,60,1],[22,2,22,29],[23,10,29,10],[23,20,29,20],[30,3,30,29],[31,2,31,29],[32,10,38,10],[32,20,38,20],[39,3,39,29],[40,2,40,29],[41,10,47,10],[41,20,47,20],[48,3,48,29],[49,2,49,29],[50,10,53,10],[50,20,53,20],[54,3,54,29],[55,2,55,29],[56,10,59,10],[56,20,59,20],[60,3,60,29],[61,1,61,29],[62,1,70,1],[62,3,62,29],[63,10,69,10],[63,20,69,20],[70,3,70,28],[71,7,71,27],[71,28,71,29],[72,1,76,1],[72,2,76,9],[72,10,76,29]]}
["Accessibility key: Unlocked (yellow) cells may be edited.",0,null,0]
[0,"U.S. Department of Labor\n",null,0,{"$nulls":6},"Jobs for Veterans State Grants Expenditure Detail Report",{"$nulls":5},0,{"$nulls":4},0,0,{"$nulls":5},"OMB Control Number: nnnn-nnnn"]
[null,"Veterans' Employment and Training Service",null,0,{"$nulls":7},0,0,{"$nulls":15}," Expiration Date: mm/dd/yyyy"]
[null,0,{"$nulls":26},0,0]
[null,"Section A: Grantee & Quarter Information",null,0,null,"Grant Number (ex. DV-12345-20-55-5-1)",{"$nulls":4},0,null,0,null,{"$f":"IF(ISBLANK(I5),\"\",I5)","v":""},null,0,{"$f":"IF(I5=\"\",\"\",(IF(ISERROR(Lists!P23),\"INCORRECT GRANT NUMBER\",(Lists!P23))))","v":""},null,0,null,null,0,null,{"$f":"IF(ISBLANK(S5),\"\",S5)","v":""},null,0,{"$f":"R5","v":""},null,0]
[null,0,null,0]
[{"$nulls":3},"Year 1 Quarter 1","Year 1 Quarter 2",null,"Year 1 Quarter 3",null,"Year 1 Quarter 4",null,0,0,"Year 2 Quarter 1",null,"Year 2 Quarter 2",null,"Year 2 Quarter 3",null,"Year 2 Quarter 4",null,0,0,"Year 3 Quarter 1",null,"Year 3 Quarter 2",null,"Year 3 Quarter 3",null,"Year 3 Quarter 4"]
[{"$nulls":3},"1st Quarter","2nd Quarter","Y1Q2 Cumulative","3rd Quarter","Y1Q3 Cumulative","4th Quarter","Y1Q4 Cumulative",null,null,"5th Quarter","Y2Q1 Cumulative","6th Quarter","Y2Q2 Cumulative","7th Quarter","Y2Q3 Cumulative","8th Quarter","Y2Q4 Cumulative",null,null,"9th Quarter","Y3Q1 Cumulative","10th Quarter","Y3Q2 Cumulative","11th Quarter","Y3Q3 Cumulative","12th Quarter","Y3Q4 Cumulative"]
[null,0,"Quarter Ending ",{"$f":"IF(ISERROR(VLOOKUP(Lists!$N$22,Lists!$Q$19:$AD$26,3)),\"\",VLOOKUP(Lists!$N$22,Lists!$Q$19:$AD$26,3))","v":""},null,{"$f":"IF(ISERROR(VLOOKUP(Lists!$N$22,Lists!$Q$19:$AD$26,4)),\"\",VLOOKUP(Lists!$N$22,Lists!$Q$19:$AD$26,4))","v":""},null,{"$f":"IF(ISERROR(VLOOKUP(Lists!$N$22,Lists!$Q$19:$AD$26,5)),\"\",VLOOKUP(Lists!$N$22,Lists!$Q$19:$AD$26,5))","v":""},null,{"$f":"IF(ISERROR(VLOOKUP(Lists!$N$22,Lists!$Q$19:$AD$26,6)),\"\",VLOOKUP(Lists!$N$22,Lists!$Q$19:$AD$26,6))","v":""},{"$nulls":3},{"$f":"IF(ISERROR(VLOOKUP(Lists!$N$22,Lists!$Q$19:$AD$26,7)),\"\",VLOOKUP(Lists!$N$22,Lists!$Q$19:$AD$26,7))","v":""},null,{"$f":"IF(ISERROR(VLOOKUP(Lists!$N$22,Lists!$Q$19:$AD$26,8)),\"\",VLOOKUP(Lists!$N$22,Lists!$Q$19:$AD$26,8))","v":""},null,{"$f":"IF(ISERROR(VLOOKUP(Lists!$N$22,Lists!$Q$19:$AD$26,9)),\"\",VLOOKUP(Lists!$N$22,Lists!$Q$19:$AD$26,9))","v":""},null,{"$f":"IF(ISERROR(VLOOKUP(Lists!$N$22,Lists!$Q$19:$AD$26,10)),\"\",VLOOKUP(Lists!$N$22,Lists!$Q$19:$AD$26,10))","v":""},{"$nulls":3},{"$f":"IF(ISERROR(VLOOKUP(Lists!$N$22,Lists!$Q$19:$AD$26,11)),\"\",VLOOKUP(Lists!$N$22,Lists!$Q$19:$AD$26,11))","v":""},null,{"$f":"IF(ISERROR(VLOOKUP(Lists!$N$22,Lists!$Q$19:$AD$26,12)),\"\",VLOOKUP(Lists!$N$22,Lists!$Q$19:$AD$26,12))","v":""},null,{"$f":"IF(ISERROR(VLOOKUP(Lists!$N$22,Lists!$Q$19:$AD$26,13)),\"\",VLOOKUP(Lists!$N$22,Lists!$Q$19:$AD$26,13))","v":""},null,{"$f":"IF(ISERROR(VLOOKUP(Lists!$N$22,Lists!$Q$19:$AD$26,14)),\"\",VLOOKUP(Lists!$N$22,Lists!$Q$19:$AD$26,14))","v":""}]
[0,0,"Date Prepared ",null,{"$f":"F10","v":"00:00:00"},null,{"$f":"H10","v":"00:00:00"},null,{"$f":"J10","v":"00:00:00"},{"$nulls":3},{"$f":"N10","v":"00:00:00"},null,{"$f":"P10","v":"00:00:00"},null,{"$f":"R10","v":"00:00:00"},null,{"$f":"T10","v":"00:00:00"},{"$nulls":3},{"$f":"X10","v":"00:00:00"},null,{"$f":"Z10","v":"00:00:00"},null,{"$f":"AB10","v":"00:00:00"},null,{"$f":"AD10","v":"00:00:00"}]
{"$rows_left_out":69}
{"sheet":"Export","index":1,"n_rows":42,"n_cols":14,"rows_kept":42}
["Section","Item Name","Year 1 Quarter 1","Year 1 Quarter 2","Year 1 Quarter 3","Year 1 Quarter 4","Year 2 Quarter 1","Year 2 Quarter 2","Year 2 Quarter 3","Year 2 Quarter 4","Year 3 Quarter 1","Year 3 Quarter 2","Year 3 Quarter 3","Year 3 Quarter 4"]
["Section A","Grant Number (ex. DV-12345-20-55-5-1)",{"$f":"'VETS-402'!$I$5","v":0},{"$f":"'VETS-402'!$I$5","v":0},{"$f":"'VETS-402'!$I$5","v":0},{"$f":"'VETS-402'!$I$5","v":0},{"$f":"'VETS-402'!$I$5","v":0},{"$f":"'VETS-402'!$I$5","v":0},{"$f":"'VETS-402'!$I$5","v":0},{"$f":"'VETS-402'!$I$5","v":0},{"$f":"'VETS-402'!$I$5","v":0},{"$f":"'VETS-402'!$I$5","v":0},{"$f":"'VETS-402'!$I$5","v":0},{"$f":"'VETS-402'!$I$5","v":0}]
["Section A","State",{"$f":"'VETS-402'!$R$5","v":""},{"$f":"'VETS-402'!$R$5","v":""},{"$f":"'VETS-402'!$R$5","v":""},{"$f":"'VETS-402'!$R$5","v":""},{"$f":"'VETS-402'!$R$5","v":""},{"$f":"'VETS-402'!$R$5","v":""},{"$f":"'VETS-402'!$R$5","v":""},{"$f":"'VETS-402'!$R$5","v":""},{"$f":"'VETS-402'!$R$5","v":""},{"$f":"'VETS-402'!$R$5","v":""},{"$f":"'VETS-402'!$R$5","v":""},{"$f":"'VETS-402'!$R$5","v":""}]
["Section A","Quarter Ending ",{"$f":"'VETS-402'!D9","v":""},{"$f":"'VETS-402'!F9","v":""},{"$f":"'VETS-402'!H9","v":""},{"$f":"'VETS-402'!J9","v":""},{"$f":"'VETS-402'!N9","v":""},{"$f":"'VETS-402'!P9","v":""},{"$f":"'VETS-402'!R9","v":""},{"$f":"'VETS-402'!T9","v":""},{"$f":"'VETS-402'!X9","v":""},{"$f":"'VETS-402'!Z9","v":""},{"$f":"'VETS-402'!AB9","v":""},{"$f":"'VETS-402'!AD9","v":""}]
["Section A","Date Prepared ",{"$f":"'VETS-402'!D10","v":"00:00:00"},{"$f":"'VETS-402'!F10","v":"00:00:00"},{"$f":"'VETS-402'!H10","v":"00:00:00"},{"$f":"'VETS-402'!J10","v":"00:00:00"},{"$f":"'VETS-402'!N10","v":"00:00:00"},{"$f":"'VETS-402'!P10","v":"00:00:00"},{"$f":"'VETS-402'!R10","v":"00:00:00"},{"$f":"'VETS-402'!T10","v":"00:00:00"},{"$f":"'VETS-402'!X10","v":"00:00:00"},{"$f":"'VETS-402'!Z10","v":"00:00:00"},{"$f":"'VETS-402'!AB10","v":"00:00:00"},{"$f":"'VETS-402'!AD10","v":"00:00:00"}]
["Section B","a. Disabled Veterans Outreach Program",{"$f":"ROUND('VETS-402'!D15,0)","v":0},{"$f":"ROUND('VETS-402'!F15,0)","v":0},{"$f":"ROUND('VETS-402'!H15,0)","v":0},{"$f":"ROUND('VETS-402'!J15,0)","v":0},{"$f":"ROUND('VETS-402'!N15,0)","v":0},{"$f":"ROUND('VETS-402'!P15,0)","v":0},{"$f":"ROUND('VETS-402'!R15,0)","v":0},{"$f":"ROUND('VETS-402'!T15,0)","v":0},{"$f":"ROUND('VETS-402'!X15,0)","v":0},{"$f":"ROUND('VETS-402'!Z15,0)","v":0},{"$f":"ROUND('VETS-402'!AB15,0)","v":0},{"$f":"ROUND('VETS-402'!AD15,0)","v":0}]
["Section B","b. Consolidated DVOP/LVER Positions",{"$f":"ROUND('VETS-402'!D16,0)","v":0},{"$f":"ROUND('VETS-402'!F16,0)","v":0},{"$f":"ROUND('VETS-402'!H16,0)","v":0},{"$f":"ROUND('VETS-402'!J16,0)","v":0},{"$f":"ROUND('VETS-402'!N16,0)","v":0},{"$f":"ROUND('VETS-402'!P16,0)","v":0},{"$f":"ROUND('VETS-402'!R16,0)","v":0},{"$f":"ROUND('VETS-402'!T16,0)","v":0},{"$f":"ROUND('VETS-402'!X16,0)","v":0},{"$f":"ROUND('VETS-402'!Z16,0)","v":0},{"$f":"ROUND('VETS-402'!AB16,0)","v":0},{"$f":"ROUND('VETS-402'!AD16,0)","v":0}]
["Section B","c. Local Veterans Employment Representatives",{"$f":"ROUND('VETS-402'!D17,0)","v":0},{"$f":"ROUND('VETS-402'!F17,0)","v":0},{"$f":"ROUND('VETS-402'!H17,0)","v":0},{"$f":"ROUND('VETS-402'!J17,0)","v":0},{"$f":"ROUND('VETS-402'!N17,0)","v":0},{"$f":"ROUND('VETS-402'!P17,0)","v":0},{"$f":"ROUND('VETS-402'!R17,0)","v":0},{"$f":"ROUND('VETS-402'!T17,0)","v":0},{"$f":"ROUND('VETS-402'!X17,0)","v":0},{"$f":"ROUND('VETS-402'!Z17,0)","v":0},{"$f":"ROUND('VETS-402'!AB17,0)","v":0},{"$f":"ROUND('VETS-402'!AD17,0)","v":0}]
["Section B","d. Incentive Awards",{"$f":"ROUND('VETS-402'!D18,0)","v":0},{"$f":"ROUND('VETS-402'!F18,0)","v":0},{"$f":"ROUND('VETS-402'!H18,0)","v":0},{"$f":"ROUND('VETS-402'!J18,0)","v":0},{"$f":"ROUND('VETS-402'!N18,0)","v":0},{"$f":"ROUND('VETS-402'!P18,0)","v":0},{"$f":"ROUND('VETS-402'!R18,0)","v":0},{"$f":"ROUND('VETS-402'!T18,0)","v":0},{"$f":"ROUND('VETS-402'!X18,0)","v":0},{"$f":"ROUND('VETS-402'!Z18,0)","v":0},{"$f":"ROUND('VETS-402'!AB18,0)","v":0},{"$f":"ROUND('VETS-402'!AD18,0)","v":0}]
["Section B","e. Mgmt & Admin Costs",{"$f":"ROUND('VETS-402'!D19,0)","v":0},{"$f":"ROUND('VETS-402'!F19,0)","v":0},{"$f":"ROUND('VETS-402'!H19,0)","v":0},{"$f":"ROUND('VETS-402'!J19,0)","v":0},{"$f":"ROUND('VETS-402'!N19,0)","v":0},{"$f":"ROUND('VETS-402'!P19,0)","v":0},{"$f":"ROUND('VETS-402'!R19,0)","v":0},{"$f":"ROUND('VETS-402'!T19,0)","v":0},{"$f":"ROUND('VETS-402'!X19,0)","v":0},{"$f":"ROUND('VETS-402'!Z19,0)","v":0},{"$f":"ROUND('VETS-402'!AB19,0)","v":0},{"$f":"ROUND('VETS-402'!AD19,0)","v":0}]
{"$rows_left_out":33}
{"sheet":"Output","index":2,"n_rows":62,"n_cols":14,"rows_kept":62,"merged":[[0,1,0,10],[1,0,1,10],[2,0,2,10],[3,0,3,10],[4,0,5,0],[4,4,5,4],[4,5,4,6],[4,8,5,10],[5,5,5,6],[6,0,6,10],[7,0,7,10],[8,0,8,6],[8,7,8,10],[9,0,11,0],[9,1,9,2],[9,4,11,4],[9,5,9,8],[9,10,11,10],[10,1,10,2],[10,5,10,8],[11,1,11,2],[11,5,11,8],[12,0,12,10],[13,0,13,10],[14,0,14,4],[15,0,15,4],[16,10,22,10],[17,0,22,0],[23,0,23,10],[24,0,24,10],[25,0,31,0],[25,10,31,10],[32,0,32,10],[33,0,33,10],[34,0,40,0],[34,10,40,10],[41,0,41,10],[42,0,42,10],[43,0,46,0],[43,10,46,10],[47,0,47,10],[48,0,48,10],[49,0,52,0],[49,10,52,10],[53,0,53,10],[54,0,54,10],[55,0,60,2],[55,3,55,7],[55,8,60,8],[55,10,60,10],[56,3,56,7],[57,3,57,7],[58,3,58,7],[59,3,59,7],[60,3,60,7],[61,0,61,10]]}
["Accessibility key: Unlocked (yellow) cells may be edited.",0]
["Jobs for Veterans State Grants Expenditure Detail Report",{"$nulls":12},{"$f":"CONCATENATE($D$5,$D$6)","v":"44926"}]
["Cumulative / Accrual Basis"]
["          SECTION A - GENERAL INFORMATION"]
[0,0,"1) State:",{"$f":"'VETS-402'!R5","v":""},0,"3) Grant Number:",null,{"$f":"'VETS-402'!I5","v":0},0,null,null,{"$f":"VLOOKUP(D6,Lists!$L$2:$O$13,2,)","v":"2020Q1"}]
[null,{"$f":"VLOOKUP(D6,Lists!L2:Q13,6)","v":"Y1Q1"},"2) Quarter Ending:","2022-12-31",null,"4) Date Prepared:",null,{"$f":"GETPIVOTDATA(\"Max of Date Prepared \",Pivot!$A$1,\"Quarter/Cumulative\",$H$16,\"State\",$D$5)","v":"00:00:00"},{"$nulls":3},{"$f":"VLOOKUP($D$6,Lists!$L$2:$O$14,3,)","v":"2019Q4"}]
[0,{"$nulls":10},{"$f":"VLOOKUP($D$6,Lists!$L$2:$O$14,4,)","v":1},{"$f":"VLOOKUP($D$6,Lists!$L$2:$P$14,5,)","v":4}]
["         SECTION B - FUNDING INFORMATION"]
["CUMULATIVE FUNDS APPROVED THROUGH THE END OF THIS REPORTING PERIOD FOR:",{"$nulls":6},0]
[0,"1) DVOP Total Funds:",null,{"$f":"GETPIVOTDATA(\"Sum of Disabled Veterans Outreach Program\",Pivot!$A$1,\"Quarter/Cumulative\",$J$16,\"State\",$D$5)","v":{"v":0,"d":"$0"}},0,"4) Incentive Award Total Funds:",{"$nulls":3},{"$f":"GETPIVOTDATA(\"Sum of Incentive Awards\",Pivot!$A$1,\"Quarter/Cumulative\",$J$16,\"State\",$D$5)","v":{"v":0,"d":"$0"}},0]
{"$rows_left_out":53}
{"sheet":"Pivot","index":3,"n_rows":42,"n_cols":26,"rows_kept":42,"hidden":true}
[null,"Column Labels"]
[null,"",{"$nulls":22}," Total","Grand Total"]
["Values","1st Quarter","2nd Quarter","Y1Q2 Cumulative","3rd Quarter","Y1Q3 Cumulative","4th Quarter","Y1Q4 Cumulative","5th Quarter","Y2Q1 Cumulative","6th Quarter","Y2Q2 Cumulative","7th Quarter","Y2Q3 Cumulative","8th Quarter","Y2Q4 Cumulative","9th Quarter","Y3Q1 Cumulative","10th Quarter","Y3Q2 Cumulative","11th Quarter","Y3Q3 Cumulative","12th Quarter","Y3Q4 Cumulative"]
["Max of Quarter Ending","00:00:00","00:00:00","00:00:00","00:00:00","00:00:00","00:00:00","00:00:00","00:00:00","00:00:00","00:00:00","00:00:00","00:00:00","00:00:00","00:00:00","00:00:00","00:00:00","00:00:00","00:00:00","00:00:00","00:00:00","00:00:00","00:00:00","00:00:00","00:00:00","00:00:00"]
["Max of Grant Number",0,0,0,0,0,0,0,0,0,0,0,0,0,0,0,0,0,0,0,0,0,0,0,0,0]
["Max of Date Prepared ","00:00:00","00:00:00","00:00:00","00:00:00","00:00:00","00:00:00","00:00:00","00:00:00","00:00:00","00:00:00","00:00:00","00:00:00","00:00:00","00:00:00","00:00:00","00:00:00","00:00:00","00:00:00","00:00:00","00:00:00","00:00:00","00:00:00","00:00:00","00:00:00","00:00:00"]
["Sum of Disabled Veterans Outreach Program",0,0,0,0,0,0,0,0,0,0,0,0,0,0,0,0,0,0,0,0,0,0,0,0,0]
["Sum of Consolidated DVOP/LVER Positions",0,0,0,0,0,0,0,0,0,0,0,0,0,0,0,0,0,0,0,0,0,0,0,0,0]
["Sum of Local Veterans Employment Representatives",0,0,0,0,0,0,0,0,0,0,0,0,0,0,0,0,0,0,0,0,0,0,0,0,0]
["Sum of Incentive Awards",0,0,0,0,0,0,0,0,0,0,0,0,0,0,0,0,0,0,0,0,0,0,0,0,0]
{"$rows_left_out":33}
{"sheet":"Data","index":4,"n_rows":24,"n_cols":81,"rows_kept":24,"hidden":true}
["FY/Q","Quarter/Cumulative","Grant Number","State","Quarter Ending","Date Prepared ","Disabled Veterans Outreach Program","Consolidated DVOP/LVER Positions","Local Veterans Employment Representatives","Incentive Awards","Mgmt & Admin Costs","Total Approved Funds","Funded DVOP Positions","DVOP Salaries Paid","DVOP Benefits Paid","Total DVOP Outlays","DVOP Unliquidated Obligations","Total DVOP Outlays & Obligations","Funded Consolidated Positions","Consolidated Salaries Paid","Consolidated Benefits Paid","Total Consolidated Outlays","Consolidated Unliquidated Obligations","Total Consolidated Outlays & Obligations","Funded LVER Positions","LVER Salaries Paid","LVER Benefits Paid","Total LVER Outlays","LVER Unliquidated Obligations","Total LVER Outlays & Obligations","Incentive Award Outlays","Incentive Award Unliquidated Obligations","Total Incentive Outlays & Obligations","Mgmt & Admin Outlays","Mgmt & Admin Unliquidated Obligations","Total Mgmt & Admin Outlays & Obligations","DVOP Balance Remaining","Consolidated Balance Remaining","LVER Balance Remaining","Incentive Balance Remaining","Mgmt & Admin Balance Remaining","Total Balance Remaining",{"$nulls":38},"Code"]
["Y1Q1","1st Quarter",{"$f":"'VETS-402'!$I$5","v":0},{"$f":"'VETS-402'!$R$5","v":""},{"$f":"'VETS-402'!D$9","v":""},{"$f":"'VETS-402'!D$10","v":"00:00:00"},{"$f":"TRANSPOSE('VETS-402'!D15:J20)","v":{"v":0,"d":"$0.00"}},{"v":0,"d":"$0.00"},{"v":0,"d":"$0.00"},{"v":0,"d":"$0.00"},{"v":0,"d":"$0.00"},{"v":0,"d":"$0.00"},{"$f":"TRANSPOSE('VETS-402'!D25:J30)","v":0},{"v":0,"d":"$0.00"},{"v":0,"d":"$0.00"},{"v":0,"d":"$0.00"},{"v":0,"d":"$0.00"},{"v":0,"d":"$0.00"},{"$f":"TRANSPOSE('VETS-402'!D34:J39)","v":0},{"v":0,"d":"$0.00"},{"v":0,"d":"$0.00"},{"v":0,"d":"$0.00"},{"v":0,"d":"$0.00"},{"v":0,"d":"$0.00"},{"$f":"TRANSPOSE('VETS-402'!D43:J48)","v":0},{"v":0,"d":"$0.00"},{"v":0,"d":"$0.00"},{"v":0,"d":"$0.00"},{"v":0,"d":"$0.00"},{"v":0,"d":"$0.00"},{"$f":"TRANSPOSE('VETS-402'!D52:J54)","v":{"v":0,"d":"$0.00"}},{"v":0,"d":"$0.00"},{"v":0,"d":"$0.00"},{"$f":"TRANSPOSE('VETS-402'!D58:J60)","v":{"v":0,"d":"$0.00"}},{"v":0,"d":"$0.00"},{"v":0,"d":"$0.00"},{"$f":"TRANSPOSE('VETS-402'!D65:J70)","v":{"v":0,"d":"$0.00"}},{"v":0,"d":"$0.00"},{"v":0,"d":"$0.00"},{"v":0,"d":"$0.00"},{"v":0,"d":"$0.00"},{"v":0,"d":"$0.00"}]
["Y1Q2","2nd Quarter",{"$f":"'VETS-402'!$I$5","v":0},{"$f":"'VETS-402'!$R$5","v":""},{"$f":"'VETS-402'!F$9","v":""},{"$f":"'VETS-402'!F$10","v":"00:00:00"},{"v":0,"d":"$0.00"},{"v":0,"d":"$0.00"},{"v":0,"d":"$0.00"},{"v":0,"d":"$0.00"},{"v":0,"d":"$0.00"},{"v":0,"d":"$0.00"},"",{"v":0,"d":"$0.00"},{"v":0,"d":"$0.00"},{"v":0,"d":"$0.00"},{"v":0,"d":"$0.00"},{"v":0,"d":"$0.00"},"",{"v":0,"d":"$0.00"},{"v":0,"d":"$0.00"},{"v":0,"d":"$0.00"},{"v":0,"d":"$0.00"},{"v":0,"d":"$0.00"},"",{"v":0,"d":"$0.00"},{"v":0,"d":"$0.00"},{"v":0,"d":"$0.00"},{"v":0,"d":"$0.00"},{"v":0,"d":"$0.00"},{"v":0,"d":"$0.00"},{"v":0,"d":"$0.00"},{"v":0,"d":"$0.00"},{"v":0,"d":"$0.00"},{"v":0,"d":"$0.00"},{"v":0,"d":"$0.00"},"N/A","N/A","N/A","N/A","N/A","N/A"]
["Y1Q2","Y1Q2 Cumulative",{"$f":"'VETS-402'!$I$5","v":0},{"$f":"'VETS-402'!$R$5","v":""},{"$f":"'VETS-402'!F$9","v":""},{"$f":"'VETS-402'!F$10","v":"00:00:00"},{"v":0,"d":"$0.00"},{"v":0,"d":"$0.00"},{"v":0,"d":"$0.00"},{"v":0,"d":"$0.00"},{"v":0,"d":"$0.00"},{"v":0,"d":"$0.00"},0,{"v":0,"d":"$0.00"},{"v":0,"d":"$0.00"},{"v":0,"d":"$0.00"},{"v":0,"d":"$0.00"},{"v":0,"d":"$0.00"},0,{"v":0,"d":"$0.00"},{"v":0,"d":"$0.00"},{"v":0,"d":"$0.00"},{"v":0,"d":"$0.00"},{"v":0,"d":"$0.00"},0,{"v":0,"d":"$0.00"},{"v":0,"d":"$0.00"},{"v":0,"d":"$0.00"},{"v":0,"d":"$0.00"},{"v":0,"d":"$0.00"},{"v":0,"d":"$0.00"},{"v":0,"d":"$0.00"},{"v":0,"d":"$0.00"},{"v":0,"d":"$0.00"},{"v":0,"d":"$0.00"},{"v":0,"d":"$0.00"},{"v":0,"d":"$0.00"},{"v":0,"d":"$0.00"},{"v":0,"d":"$0.00"},{"v":0,"d":"$0.00"},{"v":0,"d":"$0.00"},{"v":0,"d":"$0.00"}]
["Y1Q3","3rd Quarter",{"$f":"'VETS-402'!$I$5","v":0},{"$f":"'VETS-402'!$R$5","v":""},{"$f":"'VETS-402'!H$9","v":""},{"$f":"'VETS-402'!H$10","v":"00:00:00"},{"v":0,"d":"$0.00"},{"v":0,"d":"$0.00"},{"v":0,"d":"$0.00"},{"v":0,"d":"$0.00"},{"v":0,"d":"$0.00"},{"v":0,"d":"$0.00"},"",{"v":0,"d":"$0.00"},{"v":0,"d":"$0.00"},{"v":0,"d":"$0.00"},{"v":0,"d":"$0.00"},{"v":0,"d":"$0.00"},"",{"v":0,"d":"$0.00"},{"v":0,"d":"$0.00"},{"v":0,"d":"$0.00"},{"v":0,"d":"$0.00"},{"v":0,"d":"$0.00"},"",{"v":0,"d":"$0.00"},{"v":0,"d":"$0.00"},{"v":0,"d":"$0.00"},{"v":0,"d":"$0.00"},{"v":0,"d":"$0.00"},{"v":0,"d":"$0.00"},{"v":0,"d":"$0.00"},{"v":0,"d":"$0.00"},{"v":0,"d":"$0.00"},{"v":0,"d":"$0.00"},{"v":0,"d":"$0.00"},"N/A","N/A","N/A","N/A","N/A","N/A"]
["Y1Q3","Y1Q3 Cumulative",{"$f":"'VETS-402'!$I$5","v":0},{"$f":"'VETS-402'!$R$5","v":""},{"$f":"'VETS-402'!H$9","v":""},{"$f":"'VETS-402'!H$10","v":"00:00:00"},{"v":0,"d":"$0.00"},{"v":0,"d":"$0.00"},{"v":0,"d":"$0.00"},{"v":0,"d":"$0.00"},{"v":0,"d":"$0.00"},{"v":0,"d":"$0.00"},0,{"v":0,"d":"$0.00"},{"v":0,"d":"$0.00"},{"v":0,"d":"$0.00"},{"v":0,"d":"$0.00"},{"v":0,"d":"$0.00"},0,{"v":0,"d":"$0.00"},{"v":0,"d":"$0.00"},{"v":0,"d":"$0.00"},{"v":0,"d":"$0.00"},{"v":0,"d":"$0.00"},0,{"v":0,"d":"$0.00"},{"v":0,"d":"$0.00"},{"v":0,"d":"$0.00"},{"v":0,"d":"$0.00"},{"v":0,"d":"$0.00"},{"v":0,"d":"$0.00"},{"v":0,"d":"$0.00"},{"v":0,"d":"$0.00"},{"v":0,"d":"$0.00"},{"v":0,"d":"$0.00"},{"v":0,"d":"$0.00"},{"v":0,"d":"$0.00"},{"v":0,"d":"$0.00"},{"v":0,"d":"$0.00"},{"v":0,"d":"$0.00"},{"v":0,"d":"$0.00"},{"v":0,"d":"$0.00"}]
["Y1Q4","4th Quarter",{"$f":"'VETS-402'!$I$5","v":0},{"$f":"'VETS-402'!$R$5","v":""},{"$f":"'VETS-402'!J$9","v":""},{"$f":"'VETS-402'!J$10","v":"00:00:00"},{"v":0,"d":"$0.00"},{"v":0,"d":"$0.00"},{"v":0,"d":"$0.00"},{"v":0,"d":"$0.00"},{"v":0,"d":"$0.00"},{"v":0,"d":"$0.00"},"",{"v":0,"d":"$0.00"},{"v":0,"d":"$0.00"},{"v":0,"d":"$0.00"},{"v":0,"d":"$0.00"},{"v":0,"d":"$0.00"},"",{"v":0,"d":"$0.00"},{"v":0,"d":"$0.00"},{"v":0,"d":"$0.00"},{"v":0,"d":"$0.00"},{"v":0,"d":"$0.00"},"",{"v":0,"d":"$0.00"},{"v":0,"d":"$0.00"},{"v":0,"d":"$0.00"},{"v":0,"d":"$0.00"},{"v":0,"d":"$0.00"},{"v":0,"d":"$0.00"},{"v":0,"d":"$0.00"},{"v":0,"d":"$0.00"},{"v":0,"d":"$0.00"},{"v":0,"d":"$0.00"},{"v":0,"d":"$0.00"},"N/A","N/A","N/A","N/A","N/A","N/A"]
["Y1Q4","Y1Q4 Cumulative",{"$f":"'VETS-402'!$I$5","v":0},{"$f":"'VETS-402'!$R$5","v":""},{"$f":"'VETS-402'!J$9","v":""},{"$f":"'VETS-402'!J$10","v":"00:00:00"},{"v":0,"d":"$0.00"},{"v":0,"d":"$0.00"},{"v":0,"d":"$0.00"},{"v":0,"d":"$0.00"},{"v":0,"d":"$0.00"},{"v":0,"d":"$0.00"},0,{"v":0,"d":"$0.00"},{"v":0,"d":"$0.00"},{"v":0,"d":"$0.00"},{"v":0,"d":"$0.00"},{"v":0,"d":"$0.00"},0,{"v":0,"d":"$0.00"},{"v":0,"d":"$0.00"},{"v":0,"d":"$0.00"},{"v":0,"d":"$0.00"},{"v":0,"d":"$0.00"},0,{"v":0,"d":"$0.00"},{"v":0,"d":"$0.00"},{"v":0,"d":"$0.00"},{"v":0,"d":"$0.00"},{"v":0,"d":"$0.00"},{"v":0,"d":"$0.00"},{"v":0,"d":"$0.00"},{"v":0,"d":"$0.00"},{"v":0,"d":"$0.00"},{"v":0,"d":"$0.00"},{"v":0,"d":"$0.00"},{"v":0,"d":"$0.00"},{"v":0,"d":"$0.00"},{"v":0,"d":"$0.00"},{"v":0,"d":"$0.00"},{"v":0,"d":"$0.00"},{"v":0,"d":"$0.00"}]
["Y2Q1","5th Quarter",{"$f":"'VETS-402'!$I$5","v":0},{"$f":"'VETS-402'!$R$5","v":""},{"$f":"'VETS-402'!N$9","v":""},{"$f":"'VETS-402'!N$10","v":"00:00:00"},{"$f":"TRANSPOSE('VETS-402'!M15:T20)","v":{"v":0,"d":"$0.00"}},{"v":0,"d":"$0.00"},{"v":0,"d":"$0.00"},{"v":0,"d":"$0.00"},{"v":0,"d":"$0.00"},{"v":0,"d":"$0.00"},{"$f":"TRANSPOSE('VETS-402'!M25:T30)","v":"N/A"},{"v":0,"d":"$0.00"},{"v":0,"d":"$0.00"},{"v":0,"d":"$0.00"},{"v":0,"d":"$0.00"},{"v":0,"d":"$0.00"},{"$f":"TRANSPOSE('VETS-402'!M34:T39)","v":"N/A"},{"v":0,"d":"$0.00"},{"v":0,"d":"$0.00"},{"v":0,"d":"$0.00"},{"v":0,"d":"$0.00"},{"v":0,"d":"$0.00"},{"$f":"TRANSPOSE('VETS-402'!M43:T48)","v":"N/A"},{"v":0,"d":"$0.00"},{"v":0,"d":"$0.00"},{"v":0,"d":"$0.00"},{"v":0,"d":"$0.00"},{"v":0,"d":"$0.00"},{"$f":"TRANSPOSE('VETS-402'!M52:T54)","v":{"v":0,"d":"$0.00"}},{"v":0,"d":"$0.00"},{"v":0,"d":"$0.00"},{"$f":"TRANSPOSE('VETS-402'!M58:T60)","v":{"v":0,"d":"$0.00"}},{"v":0,"d":"$0.00"},{"v":0,"d":"$0.00"},{"$f":"TRANSPOSE('VETS-402'!M65:T70)","v":"N/A"},"N/A","N/A","N/A","N/A","N/A"]
["Y2Q1","Y2Q1 Cumulative",{"$f":"'VETS-402'!$I$5","v":0},{"$f":"'VETS-402'!$R$5","v":""},{"$f":"'VETS-402'!N$9","v":""},{"$f":"'VETS-402'!N$10","v":"00:00:00"},{"v":0,"d":"$0.00"},{"v":0,"d":"$0.00"},{"v":0,"d":"$0.00"},{"v":0,"d":"$0.00"},{"v":0,"d":"$0.00"},{"v":0,"d":"$0.00"},"N/A",{"v":0,"d":"$0.00"},{"v":0,"d":"$0.00"},{"v":0,"d":"$0.00"},{"v":0,"d":"$0.00"},{"v":0,"d":"$0.00"},"N/A",{"v":0,"d":"$0.00"},{"v":0,"d":"$0.00"},{"v":0,"d":"$0.00"},{"v":0,"d":"$0.00"},{"v":0,"d":"$0.00"},"N/A",{"v":0,"d":"$0.00"},{"v":0,"d":"$0.00"},{"v":0,"d":"$0.00"},{"v":0,"d":"$0.00"},{"v":0,"d":"$0.00"},{"v":0,"d":"$0.00"},{"v":0,"d":"$0.00"},{"v":0,"d":"$0.00"},{"v":0,"d":"$0.00"},{"v":0,"d":"$0.00"},{"v":0,"d":"$0.00"},{"v":0,"d":"$0.00"},{"v":0,"d":"$0.00"},{"v":0,"d":"$0.00"},{"v":0,"d":"$0.00"},{"v":0,"d":"$0.00"},{"v":0,"d":"$0.00"}]
{"$rows_left_out":15}
{"sheet":"Lists","index":5,"n_rows":95,"n_cols":30,"rows_kept":95,"hidden":true}
["State Number","State","ST",{"$nulls":8},"Quarter End","FYQ"]
[1,"ALABAMA","AL",{"$nulls":8},"2022-12-31","2020Q1","2019Q4",1,4,"Y1Q1","1st Quarter","1st Quarter","1st Quarter"]
[2,"ALASKA","AK",{"$nulls":8},"2023-03-31","2020Q2","2020Q1",2,1,"Y1Q2","2nd Quarter","Y1Q2 Cumulative","1st Quarter"]
[4,"ARIZONA","AZ",{"$nulls":8},"2023-06-30","2020Q3","2020Q2",3,2,"Y1Q3","3rd Quarter","Y1Q3 Cumulative","Y1Q2 Cumulative"]
[5,"ARKANSAS","AR",{"$nulls":8},"2023-09-30","2020Q4","2020Q3",4,3,"Y1Q4","4th Quarter","Y1Q4 Cumulative","Y1Q3 Cumulative"]
[6,"CALIFORNIA","CA",{"$nulls":8},"2023-12-31","2021Q1","2020Q4",1,4,"Y2Q1","5th Quarter","Y2Q1 Cumulative","Y1Q4 Cumulative"]
[8,"COLORADO","CO",{"$nulls":8},"2024-03-31","2021Q2","2021Q1",2,4,"Y2Q2","6th Quarter","Y2Q2 Cumulative","Y2Q1 Cumulative"]
[9,"CONNECTICUT","CT",{"$nulls":8},"2024-06-30","2021Q3","2021Q2",3,1,"Y2Q3","7th Quarter","Y2Q3 Cumulative","Y2Q2 Cumulative"]
[10,"DELAWARE","DE",{"$nulls":8},"2024-09-30","2021Q4","2021Q3",4,2,"Y2Q4","8th Quarter","Y2Q4 Cumulative","Y2Q3 Cumulative"]
[11,"DISTRICT OF COLUMBIA","DC",{"$nulls":8},"2024-12-31","2022Q1","2021Q4",1,3,"Y3Q1","9th Quarter","Y3Q1 Cumulative","Y2Q4 Cumulative"]
{"$rows_left_out":85}