{"text_format":"3","workbook":"xlsx","n_sheets":24,"sheets":["Instructions & Definitions","Step 1-Contact and Program Info","Step 2-Third Party Information","Step 3-Refrigerators","Step 3-Refrigerators (B)","Step 3-Stand-Alone Freezers","Step 3-Stand-Alone Freezers (B)","Step 3-Air-Conditioning Uni (B)","Step 3-Air-Conditioning Units","Step 3-Dehumidifiers","Step 3-Dehumidifiers (B)","Step 4-Units Jointly Processed","Step 5-QA_Input Data Summary","Step 5-Env Benefits","Step 5-Env Benefits (B)","Step 5-Energy Impacts ","Step 5 Energy Impacts (B)","Step 5-Benefits Messaging","Step 6-Partner Feedback","Step 7-Confirmation","OutputLinker","OutputLinker (B)","Assumptions","DOE RUL"],"not_rendered":{"charts":9,"images":9,"macros":1,"external_links":2,"defined_names":252,"comments":4},"read":"whole","date_system":"1900"}

{"sheet":"Instructions & Definitions","index":0,"n_rows":57,"n_cols":5,"rows_kept":57,"merged":[[2,2,2,4],[3,2,3,4],[4,2,4,4],[9,2,9,4],[13,2,13,4],[15,2,15,4],[19,2,19,4],[23,2,23,4],[25,3,25,4],[26,3,26,4],[27,3,27,4],[28,3,28,4],[29,3,29,4],[30,3,30,4],[35,3,35,4],[37,3,37,4],[39,3,39,4],[41,3,41,4],[43,3,43,4],[45,3,45,4],[47,3,47,4],[49,3,49,4]]}
["  "]
[{"$nulls":4},"OMB Control Number: 2060-0703\nExpiration Date: XX/XX/XXXX\n"]
[null,null,"United States"]
[null,null,"ENVIRONMENTAL PROTECTION AGENCY"]
[null,null,"Washington, DC 20460"]
[null,null,"Responsible Appliance Disposal (RAD) Program Annual Reporting Form"]
[null,null,"Office of Air & Radiation"]
[]
[null,null,"BURDEN STATEMENT"]
[null,null,"This collection of information is approved by OMB under the Paperwork Reduction Act, 44 U.S.C. 3501 et seq. (OMB Control No.2060-0703). Responses to this collection of information are voluntary (40 CFR 82.155). An agency may not conduct or sponsor, and a person is not required to respond to, a collection of information unless it displays a currently valid OMB control number. The public reporting and recordkeeping burden for this collection of information is estimated to be six hours  per response. Send comments on the Agency’s need for this information, the accuracy of the provided burden estimates and any suggested methods for minimizing respondent burden to the Regulatory Support Division Director, U.S. Environmental Protection Agency (2821T), 1200 Pennsylvania Ave., NW, Washington, D.C. 20460. Include the OMB control number in any correspondence. Do not send the completed form to this address."]
[]
[null,null,"INTRODUCTION"]
[]
[null,null,"The U.S. EPA’s Responsible Appliance Disposal (RAD) program for utilities, manufacturers, retailers, state and local governments, waste removal service providers, and other qualifying organizations is a voluntary program that helps protect the ozone layer and reduce emissions of greenhouse gases.  Through the Program, partners dispose of old refrigerators, freezers, dehumidifiers, and window air-conditioning units using the best environmental practices available and going beyond what is required by federal law."]
[]
[null,null,"This reporting form will allow EPA to track and quantify the environmental benefits achieved by your program, and ultimately, those achieved by the RAD program as a whole."]
[]
[null,null,"CONFIDENTIALITY"]
[]
[null,null,"All information submitted to EPA will be treated in accordance with the EPA regulations at 40 CFR Part 2, including the provisions on protecting confidential business information (CBI). For information to be treated as CBI, it must be designated as CBI at the time of submittal. EPA will protect CBI to the maximum extent of the law."]
[]
[null,null,"INSTRUCTIONS"]
[]
[null,null,"Please complete all worksheets that are applicable to your program. Within each worksheet, please provide information for all fields requested. The purpose of each worksheet and the type of information requested in each is outlined below. Please ensure that all of the following steps have been completed before submitting the reporting form. "]
[{"$nulls":3},"Step 1: Contact and Program Information \n   Provide your contact and program information.  "]
[{"$nulls":3},"Step 2: Third-Party Information\n   Enter contact information for and details about all companies providing appliance collection and processing services under your program."]
[{"$nulls":3},"Step 3: Activity Data on Processed Units\n   Complete a Step 3 worksheet for each appliance type included in your program. \n   There are separate worksheets for Refrigerators, Stand-Alone Freezers, Air Conditioning Units, and Dehumidifiers.  For each type of   \n   appliance processed by your program, complete the worksheet to provide the number of units processed and the amounts of \n   materials/components recovered from those units."]
[{"$nulls":3},"Step 4:  Units Handled Jointly by Your Organization and Another RAD Partner\n   Complete this worksheet if any appliances were jointly processed by your organization and another RAD partner. When reporting the             \n   units by refrigerant type and blowing agent type, report only the units processed with refrigerant recovery and foam recovery, respectively."]
[{"$nulls":3},"Step 5: Summary of Input Data for Quality Assurance and Program Benefits \n    a) Review Step 5 Summary of Input Data for Quality Assurance worksheet to ensure that the information entered in the Step 3 \n        worksheets is accurate. This worksheet is used for quality assurance purposes and does not require any data input.\n    b) Review Step 5 Summary of Program's Environmental Benefits and Step 5 Summary of Program's Gross Energy Impacts from \n        Removal of Old Units worksheets to learn about the environmental and/or energy impacts associated with your program.\n    c) Review Step 5 Key Messages and Figures to Promote Program's Benefits worksheet to access key messages and figures that can \n        help you promote the benefits achieved by your program."]
[{"$nulls":3},"Step 6: Partner Feedback\n   Provide qualitative information on your program and any input on the RAD program."]
[null,null,"  \n   ","Step 7: Confirmation\n   Check and sign a statement confirming that all information provided in this form is accurate, to the best of your knowledge."]
[]
[]
[null,null,"DEFINITIONS"]
[]
[{"$nulls":3},"Recover: To remove a material (in any condition) from an appliance and then store it externally without necessarily testing or processing it in any way."]
[]
[{"$nulls":3},"Reclaim: To reprocess ODS and ODS substitutes using specialized machinery to all of the specifications in appendix A to 40 CFR part 82, subpart F (based on ARI Standard 700-1995, Specification for Fluorocarbons and Other Refrigerants), and to verify using the analytical methodology prescribed in section 5 of appendix A of 40 CFR part 82, subpart F. "]
[]
[{"$nulls":3},"Stockpiling with Intent to Reclaim: To store refrigerant or foam-blowing agent on-site at the recycling facility where the unit was processed with the intent of later reclaiming the substance(s)."]
[]
[{"$nulls":3},"Recycle: To extract material from an appliance and process it for reuse.  Recycling durable components, such as metals, rubber, plastic, and glass, entails reprocessing them for future use in other manufactured products, and not reuse of the appliance itself.  When recycling used oil, refrigerants must be recovered from the used oil to the fullest extent possible, and the used oil cannot be mixed with used oil from sources other than refrigeration units."]
[]
[{"$nulls":3},"Destroy: To cause the expiration of a controlled substance.  Destruction does not result in a commercially useful end product.  For refrigerant or foam-blowing agent, destruction must be performed in accordance with the guidelines in 40 CFR §82.3.  For PCBs, which are found in capacitors manufactured before 1980, destruction must be in accordance with 40 CFR §761."]
[]
[{"$nulls":3},"Stockpiling with Intent to Destroy: To store refrigerant or foam-blowing agent on-site at the recycling facility where the unit was processed with the intent of later destroying the substance(s)."]
[]
[{"$nulls":3},"Dispose: Mercury waste, such as switches and relays, must be recovered from appliances prior to disposal or shredding, sent to a qualified recovery facility that has appropriate hazardous waste management permits, and managed in accordance with applicable federal, state, and local hazardous waste regulations (e.g., waste must be properly packaged prior to transport).  The federal hazardous waste regulations under the Resource Conservation and Recovery Act (RCRA) can be found in 40 CFR §260 - 279.  Used oil must be disposed in accordance with 40 CFR §279.81."]
[]
[{"$nulls":3},"Energy Cost for Residential Consumers ($/kWh): The energy cost paid by consumers, which may include a customer charge, distribution charge, transmission charge, transition charge, generation service charge, or other charges based on the electricity pricing scheme in your region."]
[]
[]
[]
[null,null,"SEND COMPLETED FORMS VIA EMAIL TO: \n"]
[]
[]
[null,null,"EPA Form Number: 5900-482"]

{"sheet":"Step 1-Contact and Program Info","index":1,"n_rows":38,"n_cols":12,"rows_kept":38,"merged":[[1,3,1,9],[1,10,1,13],[6,3,6,6],[10,3,10,6],[10,9,10,11],[11,3,11,6],[11,9,11,11],[12,3,12,6],[12,9,12,11],[13,3,13,6],[13,9,13,11],[14,3,14,6],[14,9,14,11],[15,3,15,6],[15,9,15,11],[16,3,16,6],[16,9,16,11],[32,2,33,6]]}
[]
[{"$nulls":3},"United States\nENVIRONMENTAL PROTECTION AGENCY\nWashington, DC 20460"]
[null,null,"Step 1: Contact and Program Information"]
[null,null,"Instructions: Provide your contact and program information (Tables A and B) on this page."]
[null,null,"A. Contact Information"]
[]
[null,null,"  Name of RAD Partner:",{"$nulls":5},"Reporting Period:","MM/DD/YYYY","to","MM/DD/YYYY"]
[]
[]
[null,null,"Primary Contact: ",{"$nulls":5},"Alternate Contact: "]
[null,null,"  Contact Name ",{"$nulls":5},"Contact Name "]
[null,null,"  Address ",{"$nulls":5},"Address "]
[]
[]
[null,null,"  Phone ",{"$nulls":5},"Phone "]
[null,null,"  Fax ",{"$nulls":5},"Fax "]
[null,null,"  E-mail Address ",{"$nulls":5},"E-mail Address "]
[]
[]
[null,null,"B. Program Information"]
[]
[null,null,"Please select the RAD partner category your program falls under:"]
[]
[null,null,{"$f":"IF(G22=\"Retailer\",\"How many stores are in the area served by your program?\",IF(G22=\"Utility\",\"How many households are in the area served by your program?\",IF(G22=\"Manufacturer\",\"How many states are in the area served by your program?\",IF(G22=\"State/Local Government\",\"How many facilities or households are in the area served by your program?\",IF(G22=\"Waste Removal Service Provider\",\"How many states are in the area served by your program?\",\"\")))))","v":""}]
[]
[null,null,"Indicate which appliance types are included in your program:",{"$nulls":3},"Refrigerators",null,{"$f":"IF(H26=\"Yes\",\"Complete Step 3 - Refrigerators worksheet\",\"\")","v":""}]
[{"$nulls":6},"Stand-Alone Freezers",null,{"$f":"IF(H27=\"Yes\",\"Complete Step 3 - Stand-Alone Freezers worksheet\",\"\")","v":""}]
[{"$nulls":6},"Air-Conditioning Units",null,{"$f":"IF(H28=\"Yes\",\"Complete Step 3 - Air-Conditioning Units worksheet\",\"\")","v":""}]
[{"$nulls":6},"Dehumidifiers",null,{"$f":"IF(H29=\"Yes\",\"Complete Step 3 - Dehumidifiers worksheet\",\"\")","v":""}]
[]
[null,null,"Does your program jointly process/administer some appliances with another RAD partner?",{"$nulls":5},{"$f":"IF(H31=\"Yes\",\"Complete Step 3 - Units Jointly Processed worksheet\",\"\")","v":""}]
[]
[null,null,"Does your program provide an incentive (e.g., financial) to encourage disposal of old, \nworking refrigerated appliances?",{"$nulls":5},{"$f":"IF(H33=\"Yes\",\"Complete Table C in each Step 3 Activity Data worksheet\",\"\")","v":""}]
[]
[]
[]
[]
[null,null,{"$f":"'Instructions & Definitions'!C57","v":"EPA Form Number: 5900-482"}]

{"sheet":"Step 2-Third Party Information","index":2,"n_rows":109,"n_cols":15,"rows_kept":109,"merged":[[2,9,2,12],[5,2,5,11],[8,3,9,4],[8,5,9,6],[8,7,9,8],[8,9,8,14],[10,3,10,4],[10,5,10,6],[10,7,10,8],[11,3,11,4],[11,5,11,6],[11,7,11,8],[12,3,12,4],[12,5,12,6],[12,7,12,8],[13,3,13,4],[13,5,13,6],[13,7,13,8],[14,3,14,4],[14,5,14,6],[14,7,14,8],[15,3,15,4],[15,5,15,6],[15,7,15,8],[16,3,16,4],[16,5,16,6],[16,7,16,8],[17,3,17,4],[17,5,17,6],[17,7,17,8],[18,3,18,4],[18,5,18,6],[18,7,18,8],[19,3,19,4],[19,5,19,6],[19,7,19,8],[20,3,20,4],[20,5,20,6],[20,7,20,8],[21,3,21,4],[21,5,21,6],[21,7,21,8],[22,3,22,4],[22,5,22,6],[22,7,22,8],[23,3,23,4],[23,5,23,6],[23,7,23,8],[24,3,24,4],[24,5,24,6],[24,7,24,8],[25,3,25,4],[25,5,25,6],[25,7,25,8],[28,3,29,4],[28,5,29,6],[28,7,29,8],[28,9,28,10],[28,11,29,12],[30,3,30,4],[30,5,30,6],[30,7,30,8],[30,11,30,12],[31,3,31,4],[32,3,32,4],[33,3,33,4],[34,3,34,4],[35,3,35,4],[36,3,36,4],[37,3,37,4],[38,3,38,4],[39,3,39,4],[40,3,40,4],[41,3,41,4],[41,5,41,6],[41,7,41,8],[41,11,41,12],[42,3,42,4],[42,5,42,6],[42,7,42,8],[42,11,42,12],[43,3,43,4],[43,5,43,6],[43,7,43,8],[43,11,43,12],[44,3,44,4],[44,5,44,6],[44,7,44,8],[44,11,44,12],[48,3,48,4],[48,5,48,12],[49,9,49,12],[50,9,50,12],[71,3,72,4],[71,5,72,6],[71,7,72,8],[71,9,71,10],[71,11,72,12],[73,3,73,4],[73,5,73,6],[73,7,73,8],[73,11,73,12],[74,3,74,4],[75,3,75,4],[76,3,76,4],[77,3,77,4],[78,3,78,4],[79,3,79,4],[80,3,80,4],[81,3,81,4],[82,3,82,4],[83,3,83,4],[84,3,84,4],[84,5,84,6],[84,7,84,8],[84,11,84,12],[85,3,85,4],[85,5,85,6],[85,7,85,8],[85,11,85,12],[86,3,86,4],[86,5,86,6],[86,7,86,8],[86,11,86,12],[87,3,87,4],[87,5,87,6],[87,7,87,8],[87,11,87,12],[90,3,91,4],[90,5,91,6],[90,7,91,8],[90,9,90,11],[92,3,92,4],[92,5,92,6],[92,7,92,8],[93,3,93,4],[94,3,94,4],[95,3,95,4],[96,3,96,4],[97,3,97,4],[98,3,98,4],[99,3,99,4],[100,3,100,4],[101,3,101,4],[102,3,102,4],[103,3,103,4],[103,5,103,6],[103,7,103,8],[104,3,104,4],[104,5,104,6],[104,7,104,8],[105,3,105,4],[105,5,105,6],[105,7,105,8],[106,3,106,4],[106,5,106,6],[106,7,106,8]]}
[]
[]
[]
[null,null,"Step 2: Third-Party Information"]
[]
[null,null,"Instructions: In Tables A-E below, please indicate the contact information for all companies used by your program to collect/treat appliances and recovered materials in order to fulfill the requirements of the RAD program. Indicate an \"x\" for the role fulfilled by each company. Note that you may need to contact third-party providers in order to obtain the names and addresses of the companies that provide the services specified.  Please add additional rows if needed."]
[]
[null,null,"A. Haul-Away and Demanufacturing Companies"]
[null,null,"Company Name","Contact Name",null,"Phone Number",null,"Address",null,"Company Role"]
[{"$nulls":9},"Appliance Haul-Away","Refrigerant Recovery","Foam/Blowing Agent Recovery","Mercury Recovery","Used Oil Recovery","PCBs Recovery"]
[null,null,"Example Company A","John Smith",null,"123-456-7890",null,"123 Street Name\nCity, State, Zipcode",null,"x","x",null,"x","x","x"]
{"$rows_empty":16}
[null,null,"B. Refrigerant Reclamation and Destruction Facilities"]
[null,null,"Company Name","Contact Name",null,"Phone Number",null,"Address",null,"Facility Role",null,"Type of Destruction Technology (if applicable) "]
[{"$nulls":9},"Reclamation","Destruction"]
{"$rows_empty":16}
[null,null,"C. Foam/Blowing Agent Recovery Process"]
[null,null,"Please use an \"x\" in the appropriate column to indicate the appliance items from which foam is recovered and the foam recovery process used."]
[null,null,"Company Name","Foam Recovery Items",null,"Foam/Blowing Agent Recovery Process"]
[{"$nulls":3},"Doors ","Case","Manual \n(saw and scrape/filet)a","Semi-Automated \n(saw, scrape/filet, and process to recover blowing agent)b","Fully Automated (appliance processed whole to recover blowing agent)c","Other: please describe","Name of Automated Technology/Equipment Type \n(if an automated technology is selected)d"]
[null,null,"Example Company B",null,"x",null,"x",null,null,"SEG"]
{"$rows_empty":14}
[null,null,"a Manual: The appliance is deconstructed with the use of hand or electric saws; foam is removed manually by scraping or fileting. The foam is then destroyed with the blowing agent intact."]
[null,null,"b Semi-Automated: The appliance is deconstructed with the use of hand or electric saws; the intact foam panels are then processed using an automated technology to recover the blowing agent."]
[null,null,"c Fully Automated: The whole appliance is processed using an automated technology to recover the blowing agent."]
[null,null,"d For example, Adelmann, SEG, and URT. "]
[]
[null,null,"D. Foam/Blowing Agent Reclamation and Destruction Facilities"]
[null,null,"Facility Name","Contact Name",null,"Phone Number",null,"Address",null,"Facility Role",null,"Type of Destruction Technology (if applicable) "]
[{"$nulls":9},"Reclamation","Destruction"]
{"$rows_empty":16}
[null,null,"E. Hazardous Materials Recycling and Disposal Facilities"]
[null,null,"Facility Name","Contact Name",null,"Phone Number",null,"Address",null,"Facility Role"]
[{"$nulls":9},"Recycling/ Disposal of Used Oil","Disposal of PCBs","Disposal of Mercury"]
{"$rows_empty":16}
[null,null,{"$f":"'Instructions & Definitions'!C57","v":"EPA Form Number: 5900-482"}]

{"sheet":"Step 3-Refrigerators","index":3,"n_rows":83,"n_cols":11,"rows_kept":83,"merged":[[1,8,1,10],[3,2,3,9],[5,2,5,9],[9,6,9,9],[10,6,13,9],[13,10,15,10],[14,7,14,9],[15,7,22,9],[22,10,26,10],[25,2,25,5],[26,2,26,7],[27,2,28,2],[27,3,28,4],[27,5,28,6],[27,7,28,7],[29,2,38,2],[30,3,30,4],[31,3,31,4],[32,3,32,4],[33,3,33,4],[35,3,35,4],[36,3,36,4],[37,3,37,4],[38,3,38,4],[39,2,57,2],[40,3,40,4],[41,3,41,4],[42,3,42,4],[43,3,43,4],[45,3,45,4],[46,3,46,4],[47,3,47,4],[48,3,48,4],[50,3,50,4],[51,3,51,4],[52,3,52,4],[53,3,53,4],[55,3,55,4],[56,3,56,4],[57,3,57,4],[58,3,58,4],[59,2,60,2],[59,3,59,4],[60,3,60,4],[61,2,62,2],[61,3,61,4],[62,3,62,4],[63,3,63,4],[64,3,64,4],[68,2,68,7],[70,2,70,3],[70,4,70,5],[71,2,71,3],[71,4,71,5],[72,2,72,3],[72,4,72,5],[74,3,81,9]]}
[]
[]
[null,null,"Step 3: Activity Data on Refrigerators",{"$nulls":3},{"$f":"IF('Step 1-Contact and Program Info'!D7=0,\" \",'Step 1-Contact and Program Info'!D7)","v":" "},{"$f":"IF('Step 1-Contact and Program Info'!J7=\"\",\"\",'Step 1-Contact and Program Info'!J7)","v":"MM/DD/YYYY"},{"$f":"IF(H3=\"\",\"\",\"to\")","v":"to"},{"$f":"IF('Step 1-Contact and Program Info'!L7=\"\",\"\",'Step 1-Contact and Program Info'!L7)","v":"MM/DD/YYYY"}]
[null,null,"Instructions: All partners should complete Tables A and B. If your program provides an incentive (e.g., financial) to encourage the disposal of old, working refrigerated appliances, please also complete Table C. When populating cells, please use the units provided; do not add text to specify units. This form only recognizes numbers. "]
[null,null,"A. Units Processed"]
[null,null,"Please complete the gray cells below. Enter the total number of units processed by your program by refrigerant type and insulating material type in column D. Specify the number of units processed with refrigerant recovery and foam recovery in cells E11 to E13 and cells E16 to E22, respectively, and whether foam was recovered from appliance doors (cells F16 to F19). Also, provide the average age of appliances collected (cell D9), and whether the information on refrigerant and blowing agent types is based on assumptions or data (cells F11 to F13 and cells G16 to G22, respectively).  If any of the units reported in column D were jointly processed/administered with another RAD Utility, Retailer, Manufacturer, State/Local Government, or Waste Removal Service Provider Partner, please indicate the number of these units in Step 4 - Units Jointly Processed; the units reported in this table should be inclusive of the units reported in Step 4. If you wish to provide additional information (e.g., regarding types of refrigerants or insulating materials not listed below) or highlight uncertainties in your reporting, please do so in the “Comments” box."]
[]
[null,null,"Total Number of Units Processed"]
[null,null,"Average Age of Appliances Collected (yrs)"]
[null,null,"Refrigerant Type","Total Number of Units Processed ","Number of Units Processed with Refrigerant Recovery","Refrigerant Type Based On: ","Comments:"]
[null,null,"CFC-12"]
[null,null,"HFC-134a"]
[null,null,"Other"]
[null,null,"Total",{"$f":"SUM(D11:D13)","v":0},{"$f":"SUM(E11:E13)","v":0},{"$nulls":5},{"$f":"IF(AND(D14<>D8,NOT(AND(ISBLANK(D11),ISBLANK(D12), ISBLANK(D13)))),\"<-- Ensure that total across all refrigerant types (cell D14) matches total number of units entered above (cell D8).\",\"\")","v":""}]
[null,null,"Insulating Material Type","Total Number of Units Processed ","Number of Units Processed with Foam Recovery","Was Foam Recovered From Appliance Doors?","Insulating Material Type Based On: ","Comments:"]
[null,null,"CFC-11 Blowing Agent"]
[null,null,"HCFC-141b Blowing Agent"]
[null,null,"HFC-134a Blowing Agent"]
[null,null,"HFC-245fa Blowing Agent"]
[null,null,"Cyclopentane Blowing Agent"]
[null,null,"Fiberglass"]
[null,null,"Other"]
[null,null,"Total",{"$f":"SUM(D16:D22)","v":0},{"$f":"SUM(E16:E22)","v":0},{"$nulls":5},{"$f":"IF(AND(D23<>D8,NOT(AND(ISBLANK(D16),ISBLANK(D17), ISBLANK(D18), ISBLANK(D19), ISBLANK(D20), ISBLANK(D21), ISBLANK(D22)))),\"<-- Ensure that total across all insulating material types (cell D23) matches total number of units entered above (cell D8).\",\"\")","v":""}]
[]
[null,null,"B. Fate and Quantity of Substances Recovered"]
[]
[null,null,"Please complete the table below to provide the total amount of appliance components recovered by your program during the current reporting period. If any substances recovered during the current reporting period are currently in storage, please report on the intended fate of the substance (e.g., stockpiling with intent to reclaim/destroy). Refer back to the Instructions & Definitions tab for definitions of the fates for each component.  For any fields that do not apply to your program, please enter \"0\" under \"Total Amount\" in column F.  For every non-zero value entered in column F, indicate whether the quantity specified is based on actual measurements or on assumptions by selecting the appropriate option in column H. If you wish to clarify uncertainties about the data provided, or wish to provide further information, please use the space for “Additional Comments” at the bottom of this worksheet."]
[null,null,"Appliance Component","Fate of Component",null,"Total Amount",null,"Total Amount Based On: "]
[]
[null,null,"Refrigerant (including that recovered from compressor oil)","CFC-12 "]
[{"$nulls":3},"Reclaimed",null,null,"(lb)"]
[{"$nulls":3},"Stockpiling with Intent to Reclaim",null,null,"(lb)"]
[{"$nulls":3},"Destroyed",null,null,"(lb)"]
[{"$nulls":3},"Stockpiling with Intent to Destroy",null,null,"(lb)"]
[{"$nulls":3},"HFC-134a "]
[{"$nulls":3},"Reclaimed",null,null,"(lb)"]
[{"$nulls":3},"Stockpiling with Intent to Reclaim",null,null,"(lb)"]
[{"$nulls":3},"Destroyed",null,null,"(lb)"]
[{"$nulls":3},"Stockpiling with Intent to Destroy",null,null,"(lb)"]
[null,null,"Foam-Blowing Agent*","CFC-11"]
[{"$nulls":3},"Reclaimed",null,null,"(lb)"]
[{"$nulls":3},"Stockpiling with Intent to Reclaim",null,null,"(lb)"]
[{"$nulls":3},"Destroyed",null,null,"(lb)"]
[{"$nulls":3},"Stockpiling with Intent to Destroy",null,null,"(lb)"]
[{"$nulls":3},"HCFC-141b"]
[{"$nulls":3},"Reclaimed",null,null,"(lb)"]
[{"$nulls":3},"Stockpiling with Intent to Reclaim",null,null,"(lb)"]
[{"$nulls":3},"Destroyed",null,null,"(lb)"]
[{"$nulls":3},"Stockpiling with Intent to Destroy",null,null,"(lb)"]
[{"$nulls":3},"HFC-134a"]
[{"$nulls":3},"Reclaimed",null,null,"(lb)"]
[{"$nulls":3},"Stockpiling with Intent to Reclaim",null,null,"(lb)"]
[{"$nulls":3},"Destroyed",null,null,"(lb)"]
[{"$nulls":3},"Stockpiling with Intent to Destroy",null,null,"(lb)"]
[{"$nulls":3},"HFC-245fa"]
[{"$nulls":3},"Reclaimed",null,null,"(lb)"]
[{"$nulls":3},"Stockpiling with Intent to Reclaim",null,null,"(lb)"]
[{"$nulls":3},"Destroyed",null,null,"(lb)"]
[{"$nulls":3},"Stockpiling with Intent to Destroy",null,null,"(lb)"]
[null,null,"Used Oil","Recycled",null,null,"(gal)"]
[{"$nulls":3},"Disposed",null,null,"(gal)"]
[null,null,"Metal","Ferrous Metal Recycled",null,null,"(lb)"]
[{"$nulls":3},"Non-Ferrous Metal Recycled",null,null,"(lb)"]
[null,null,"Plastic","Recycled",null,null,"(lb)"]
[null,null,"Glass","Recycled",null,null,"(lb)"]
[null,null,"PCB-Containing Capacitors","Destroyed",null,null,"(# of capacitors)"]
[null,null,"*Foam-blowing agent typically represents only 10% of the total foam weight."]
[null,null,"C. Energy Savings"]
[null,null,"Please complete the table below if your program provides an incentive (e.g., financial) to encourage the disposal (i.e., without replacement) of old, working refrigerated appliances. "]
[]
[null,null,"Average Number of Remaining Years of Useful Life",null,{"$f":"IF($D$9=\"\",\"\",VLOOKUP($D$9,'DOE RUL'!$A$5:$C$65,2,TRUE))","v":""}]
[null,null,"Average Energy Consumed/Year/Unit (kWh)"]
[null,null,"Average Energy Cost for Residential Consumers ($/kWh)  \n[please provide the average cost during the current program period] "]
[]
[null,null,"Additional Comments:"]
{"$rows_empty":7}
[null,null,{"$f":"'Instructions & Definitions'!C57","v":"EPA Form Number: 5900-482"}]

{"sheet":"Step 3-Refrigerators (B)","index":4,"n_rows":73,"n_cols":10,"rows_kept":73,"hidden":true,"merged":[[1,8,1,9],[3,2,3,9],[5,2,5,9],[10,6,12,8],[14,7,20,8],[23,2,23,5],[23,7,23,10],[24,2,24,7],[25,2,26,2],[25,3,26,4],[25,5,26,6],[25,7,26,7],[27,2,36,2],[28,3,28,4],[29,3,29,4],[30,3,30,4],[31,3,31,4],[33,3,33,4],[34,3,34,4],[35,3,35,4],[36,3,36,4],[37,2,55,2],[38,3,38,4],[39,3,39,4],[40,3,40,4],[41,3,41,4],[43,3,43,4],[44,3,44,4],[45,3,45,4],[46,3,46,4],[48,3,48,4],[49,3,49,4],[50,3,50,4],[51,3,51,4],[53,3,53,4],[54,3,54,4],[55,3,55,4],[56,3,56,4],[57,2,58,2],[57,3,57,4],[58,3,58,4],[59,2,60,2],[59,3,59,4],[60,3,60,4],[61,3,61,4],[62,3,62,4],[66,2,66,7],[68,2,68,3],[68,4,68,5],[69,2,69,3],[69,4,69,5],[70,2,70,3],[70,4,70,5],[72,3,79,9]]}
[]
[]
[null,null,"Activity Data: Refrigerators",{"$nulls":3},{"$f":"IF('Step 1-Contact and Program Info'!D7=0, \" \",'Step 1-Contact and Program Info'!D7)","v":" "},{"$f":"'Step 1-Contact and Program Info'!J7","v":"MM/DD/YYYY"},"to",{"$f":"'Step 1-Contact and Program Info'!L7","v":"MM/DD/YYYY"}]
[null,null,"Instructions: All partners should complete Tables A and B. If your program provides an incentive (e.g., financial) to encourage the disposal of old, working refrigerated appliances, please also complete Table C. When populating cells, please use the units provided; do not add text to specify units. This form only recognizes numbers. "]
[null,null,"Units Processed"]
[null,null,{"$f":"'Step 3-Refrigerators'!C6:J6","v":"Please complete the gray cells below. Enter the total number of units processed by your program by refrigerant type and insulating material type in column D. Specify the number of units processed with refrigerant recovery and foam recovery in cells E11 to E13 and cells E16 to E22, respectively, and whether foam was recovered from appliance doors (cells F16 to F19). Also, provide the average age of appliances collected (cell D9), and whether the information on refrigerant and blowing agent types is based on assumptions or data (cells F11 to F13 and cells G16 to G22, respectively).  If any of the units reported in column D were jointly processed/administered with another RAD Utility, Retailer, Manufacturer, State/Local Government, or Waste Removal Service Provider Partner, please indicate the number of these units in Step 4 - Units Jointly Processed; the units reported in this table should be inclusive of the units reported in Step 4. If you wish to provide additional information (e.g., regarding types of refrigerants or insulating materials not listed below) or highlight uncertainties in your reporting, please do so in the “Comments” box."}]
[]
[null,null,"Total Number of Units Processed (excluding units processed by other RAD utilities)",{"$f":"'Step 3-Refrigerators'!D8-'Step 4-Units Jointly Processed'!AH11","v":0}]
[null,null,"Average Age of Appliances Collected (yrs)",{"$f":"'Step 3-Refrigerators'!D9","v":0}]
[null,null,"Number of Units Processed Containing the Following Refrigerants","Total Number of Units Processed ","Number of Units Processed with Refrigerant Recovery",{"$f":"'Step 3-Refrigerators'!F10","v":"Refrigerant Type Based On: "},"Comments:"]
[null,null,"CFC-12",{"$f":"'Step 3-Refrigerators'!D11-'Step 4-Units Jointly Processed'!AH13","v":0},{"$f":"'Step 3-Refrigerators'!E11-'Step 4-Units Jointly Processed'!AH13","v":0},{"$f":"'Step 3-Refrigerators'!F11","v":0},{"$f":"'Step 3-Refrigerators'!G11","v":0}]
[null,null,"HFC-134a",{"$f":"'Step 3-Refrigerators'!D12-'Step 4-Units Jointly Processed'!AH14","v":0},{"$f":"'Step 3-Refrigerators'!E12-'Step 4-Units Jointly Processed'!AH14","v":0},{"$f":"'Step 3-Refrigerators'!F12","v":0}]
[null,null,"Other",{"$f":"'Step 3-Refrigerators'!D13-'Step 4-Units Jointly Processed'!AH15","v":0},{"$f":"'Step 3-Refrigerators'!E13-'Step 4-Units Jointly Processed'!AH15","v":0},{"$f":"'Step 3-Refrigerators'!F13","v":0}]
[null,null,"Number of Units Processed Containing the Following Insulating Materials","Total Number of Units Processed ","Number of Units Processed with Foam Recovery",{"$f":"'Step 3-Refrigerators'!F15","v":"Was Foam Recovered From Appliance Doors?"},{"$f":"'Step 3-Refrigerators'!G15","v":"Insulating Material Type Based On: "},"Comments:"]
[null,null,"CFC-11 Blowing Agent",{"$f":"'Step 3-Refrigerators'!D16-'Step 4-Units Jointly Processed'!AH18","v":0},{"$f":"'Step 3-Refrigerators'!E16-'Step 4-Units Jointly Processed'!AH18","v":0},{"$f":"'Step 3-Refrigerators'!F16","v":0},{"$f":"'Step 3-Refrigerators'!G16","v":0},{"$f":"'Step 3-Refrigerators'!H16","v":0}]
[null,null,"HCFC-141b Blowing Agent",{"$f":"'Step 3-Refrigerators'!D17-'Step 4-Units Jointly Processed'!AH19","v":0},{"$f":"'Step 3-Refrigerators'!E17-'Step 4-Units Jointly Processed'!AH19","v":0},{"$f":"'Step 3-Refrigerators'!F17","v":0},{"$f":"'Step 3-Refrigerators'!G17","v":0}]
[null,null,"HFC-134a Blowing Agent",{"$f":"'Step 3-Refrigerators'!D18-'Step 4-Units Jointly Processed'!AH20","v":0},{"$f":"'Step 3-Refrigerators'!E18-'Step 4-Units Jointly Processed'!AH20","v":0},{"$f":"'Step 3-Refrigerators'!F18","v":0},{"$f":"'Step 3-Refrigerators'!G18","v":0}]
[null,null,"HFC-245fa Blowing Agent",{"$f":"'Step 3-Refrigerators'!D19-'Step 4-Units Jointly Processed'!AH21","v":0},{"$f":"'Step 3-Refrigerators'!E19-'Step 4-Units Jointly Processed'!AH21","v":0},{"$f":"'Step 3-Refrigerators'!F19","v":0},{"$f":"'Step 3-Refrigerators'!G19","v":0}]
[null,null,"Cyclopentane  Blowing Agent",{"$f":"'Step 3-Refrigerators'!D20-'Step 4-Units Jointly Processed'!AH22","v":0},{"$f":"'Step 3-Refrigerators'!E20-'Step 4-Units Jointly Processed'!AH22","v":0},{"$f":"'Step 3-Refrigerators'!F20","v":0},{"$f":"'Step 3-Refrigerators'!G20","v":0}]
[null,null,"Fiberglass",{"$f":"'Step 3-Refrigerators'!D21-'Step 4-Units Jointly Processed'!AH23","v":0},{"$f":"'Step 3-Refrigerators'!E21-'Step 4-Units Jointly Processed'!AH23","v":0},{"$f":"'Step 3-Refrigerators'!F21","v":0},{"$f":"'Step 3-Refrigerators'!G21","v":0}]
[null,null,"Other",{"$f":"'Step 3-Refrigerators'!D22-'Step 4-Units Jointly Processed'!AH24","v":0},{"$f":"'Step 3-Refrigerators'!E22-'Step 4-Units Jointly Processed'!AH24","v":0},{"$f":"'Step 3-Refrigerators'!F22","v":0},{"$f":"'Step 3-Refrigerators'!G22","v":0}]
[]
[null,null,"Fate and Quantity of Substances Recovered"]
[]
[null,null,{"$f":"'Step 3-Refrigerators'!C27:H27","v":"Please complete the table below to provide the total amount of appliance components recovered by your program during the current reporting period. If any substances recovered during the current reporting period are currently in storage, please report on the intended fate of the substance (e.g., stockpiling with intent to reclaim/destroy). Refer back to the Instructions & Definitions tab for definitions of the fates for each component.  For any fields that do not apply to your program, please enter \"0\" under \"Total Amount\" in column F.  For every non-zero value entered in column F, indicate whether the quantity specified is based on actual measurements or on assumptions by selecting the appropriate option in column H. If you wish to clarify uncertainties about the data provided, or wish to provide further information, please use the space for “Additional Comments” at the bottom of this worksheet."}]
[null,null,"Appliance Component","Fate of Component",null,"Total Amount",null,"Total Amount Based On: "]
[]
[null,null,"Refrigerant (including that recovered from compressor oil)","CFC-12 "]
[{"$nulls":3},"Reclaimed",null,{"$f":"IF('Step 3-Refrigerators'!$E$11=0,\"\", $E$11*('Step 3-Refrigerators'!$F$31/'Step 3-Refrigerators'!$E$11))","v":""},"(lb)",{"$f":"IF('Step 3-Refrigerators'!H31=0,\"\",'Step 3-Refrigerators'!H31)","v":""}]
[{"$nulls":3},"Stockpiling with Intent to Reclaim",null,{"$f":"IF('Step 3-Refrigerators'!$E$11=0,\"\", $E$11*('Step 3-Refrigerators'!$F$32/'Step 3-Refrigerators'!$E$11))","v":""},"(lb)",{"$f":"IF('Step 3-Refrigerators'!H32=0,\"\",'Step 3-Refrigerators'!H32)","v":""}]
[{"$nulls":3},"Destroyed",null,{"$f":"IF('Step 3-Refrigerators'!$E$11=0,\"\", $E$11*('Step 3-Refrigerators'!$F$33/'Step 3-Refrigerators'!$E$11))","v":""},"(lb)",{"$f":"IF('Step 3-Refrigerators'!H33=0,\"\",'Step 3-Refrigerators'!H33)","v":""}]
[{"$nulls":3},"Stockpiling with Intent to Destroy",null,{"$f":"IF('Step 3-Refrigerators'!$E$11=0,\"\", $E$11*('Step 3-Refrigerators'!$F$34/'Step 3-Refrigerators'!$E$11))","v":""},"(lb)",{"$f":"IF('Step 3-Refrigerators'!H34=0,\"\",'Step 3-Refrigerators'!H34)","v":""}]
[{"$nulls":3},"HFC-134a "]
[{"$nulls":3},"Reclaimed",null,{"$f":"IF('Step 3-Refrigerators'!$E$12=0,\"\", $E$12*('Step 3-Refrigerators'!$F36/'Step 3-Refrigerators'!$E$12))","v":""},"(lb)",{"$f":"IF('Step 3-Refrigerators'!H36=0,\"\",'Step 3-Refrigerators'!H36)","v":""}]
[{"$nulls":3},"Stockpiling with Intent to Reclaim",null,{"$f":"IF('Step 3-Refrigerators'!$E$12=0,\"\", $E$12*('Step 3-Refrigerators'!$F37/'Step 3-Refrigerators'!$E$12))","v":""},"(lb)",{"$f":"IF('Step 3-Refrigerators'!H37=0,\"\",'Step 3-Refrigerators'!H37)","v":""}]
[{"$nulls":3},"Destroyed",null,{"$f":"IF('Step 3-Refrigerators'!$E$12=0,\"\", $E$12*('Step 3-Refrigerators'!$F38/'Step 3-Refrigerators'!$E$12))","v":""},"(lb)",{"$f":"IF('Step 3-Refrigerators'!H38=0,\"\",'Step 3-Refrigerators'!H38)","v":""}]
[{"$nulls":3},"Stockpiling with Intent to Destroy",null,{"$f":"IF('Step 3-Refrigerators'!$E$12=0,\"\", $E$12*('Step 3-Refrigerators'!$F39/'Step 3-Refrigerators'!$E$12))","v":""},"(lb)",{"$f":"IF('Step 3-Refrigerators'!H39=0,\"\",'Step 3-Refrigerators'!H39)","v":""}]
[null,null,"Foam-Blowing Agent*","CFC-11"]
[{"$nulls":3},"Reclaimed",null,{"$f":"IF('Step 3-Refrigerators'!$E$16=0,\"\", $E$15*('Step 3-Refrigerators'!$F$41/'Step 3-Refrigerators'!$E$16))","v":""},"(lb)",{"$f":"IF('Step 3-Refrigerators'!H41=0,\"\",'Step 3-Refrigerators'!H41)","v":""}]
[{"$nulls":3},"Stockpiling with Intent to Reclaim",null,{"$f":"IF('Step 3-Refrigerators'!$E$16=0,\"\", $E$15*('Step 3-Refrigerators'!$F$42/'Step 3-Refrigerators'!$E$16))","v":""},"(lb)",{"$f":"IF('Step 3-Refrigerators'!H42=0,\"\",'Step 3-Refrigerators'!H42)","v":""}]
[{"$nulls":3},"Destroyed",null,{"$f":"IF('Step 3-Refrigerators'!$E$16=0,\"\", $E$15*('Step 3-Refrigerators'!$F$43/'Step 3-Refrigerators'!$E$16))","v":""},"(lb)",{"$f":"IF('Step 3-Refrigerators'!H43=0,\"\",'Step 3-Refrigerators'!H43)","v":""}]
[{"$nulls":3},"Stockpiling with Intent to Destroy",null,{"$f":"IF('Step 3-Refrigerators'!$E$16=0,\"\", $E$15*('Step 3-Refrigerators'!$F$44/'Step 3-Refrigerators'!$E$16))","v":""},"(lb)",{"$f":"IF('Step 3-Refrigerators'!H44=0,\"\",'Step 3-Refrigerators'!H44)","v":""}]
[{"$nulls":3},"HCFC-141b"]
[{"$nulls":3},"Reclaimed",null,{"$f":"IF('Step 3-Refrigerators'!$E$17=0,\"\", $E$16*('Step 3-Refrigerators'!$F$46/'Step 3-Refrigerators'!$E$17))","v":""},"(lb)",{"$f":"IF('Step 3-Refrigerators'!H46=0,\"\",'Step 3-Refrigerators'!H46)","v":""}]
[{"$nulls":3},"Stockpiling with Intent to Reclaim",null,{"$f":"IF('Step 3-Refrigerators'!$E$17=0,\"\", $E$16*('Step 3-Refrigerators'!$F$47/'Step 3-Refrigerators'!$E$17))","v":""},"(lb)",{"$f":"IF('Step 3-Refrigerators'!H47=0,\"\",'Step 3-Refrigerators'!H47)","v":""}]
[{"$nulls":3},"Destroyed",null,{"$f":"IF('Step 3-Refrigerators'!$E$17=0,\"\", $E$16*('Step 3-Refrigerators'!$F$48/'Step 3-Refrigerators'!$E$17))","v":""},"(lb)",{"$f":"IF('Step 3-Refrigerators'!H48=0,\"\",'Step 3-Refrigerators'!H48)","v":""}]
[{"$nulls":3},"Stockpiling with Intent to Destroy",null,{"$f":"IF('Step 3-Refrigerators'!$E$17=0,\"\", $E$16*('Step 3-Refrigerators'!$F$49/'Step 3-Refrigerators'!$E$17))","v":""},"(lb)",{"$f":"IF('Step 3-Refrigerators'!H49=0,\"\",'Step 3-Refrigerators'!H49)","v":""}]
[{"$nulls":3},"HFC-134a"]
[{"$nulls":3},"Reclaimed",null,{"$f":"IF('Step 3-Refrigerators'!$E$18=0,\"\", $E$17*('Step 3-Refrigerators'!$F51/'Step 3-Refrigerators'!$E$18))","v":""},"(lb)",{"$f":"IF('Step 3-Refrigerators'!H51=0,\"\",'Step 3-Refrigerators'!H51)","v":""}]
[{"$nulls":3},"Stockpiling with Intent to Reclaim",null,{"$f":"IF('Step 3-Refrigerators'!$E$18=0,\"\", $E$17*('Step 3-Refrigerators'!$F52/'Step 3-Refrigerators'!$E$18))","v":""},"(lb)",{"$f":"IF('Step 3-Refrigerators'!H52=0,\"\",'Step 3-Refrigerators'!H52)","v":""}]
[{"$nulls":3},"Destroyed",null,{"$f":"IF('Step 3-Refrigerators'!$E$18=0,\"\", $E$17*('Step 3-Refrigerators'!$F53/'Step 3-Refrigerators'!$E$18))","v":""},"(lb)",{"$f":"IF('Step 3-Refrigerators'!H53=0,\"\",'Step 3-Refrigerators'!H53)","v":""}]
[{"$nulls":3},"Stockpiling with Intent to Destroy",null,{"$f":"IF('Step 3-Refrigerators'!$E$18=0,\"\", $E$17*('Step 3-Refrigerators'!$F54/'Step 3-Refrigerators'!$E$18))","v":""},"(lb)",{"$f":"IF('Step 3-Refrigerators'!H54=0,\"\",'Step 3-Refrigerators'!H54)","v":""}]
[{"$nulls":3},"HFC-245fa"]
[{"$nulls":3},"Reclaimed",null,{"$f":"IF('Step 3-Refrigerators'!$E$19=0,\"\", $E$18*('Step 3-Refrigerators'!$F$56/'Step 3-Refrigerators'!$E$19))","v":""},"(lb)",{"$f":"IF('Step 3-Refrigerators'!H56=0,\"\",'Step 3-Refrigerators'!H56)","v":""}]
[{"$nulls":3},"Stockpiling with Intent to Reclaim",null,{"$f":"IF('Step 3-Refrigerators'!$E$19=0,\"\", $E$18*('Step 3-Refrigerators'!$F$57/'Step 3-Refrigerators'!$E$19))","v":""},"(lb)",{"$f":"IF('Step 3-Refrigerators'!H57=0,\"\",'Step 3-Refrigerators'!H57)","v":""}]
[{"$nulls":3},"Destroyed",null,{"$f":"IF('Step 3-Refrigerators'!$E$19=0,\"\", $E$18*('Step 3-Refrigerators'!$F$58/'Step 3-Refrigerators'!$E$19))","v":""},"(lb)",{"$f":"IF('Step 3-Refrigerators'!H58=0,\"\",'Step 3-Refrigerators'!H58)","v":""}]
[{"$nulls":3},"Stockpiling with Intent to Destroy",null,{"$f":"IF('Step 3-Refrigerators'!$E$19=0,\"\", $E$18*('Step 3-Refrigerators'!$F$59/'Step 3-Refrigerators'!$E$19))","v":""},"(lb)",{"$f":"IF('Step 3-Refrigerators'!H59=0,\"\",'Step 3-Refrigerators'!H59)","v":""}]
[null,null,"Used Oil","Recycled",null,{"$f":"IF('Step 3-Refrigerators'!$D$8=0,\"\", $D$8*('Step 3-Refrigerators'!$F60/'Step 3-Refrigerators'!$D$8))","v":""},"(gal)",{"$f":"IF('Step 3-Refrigerators'!H60=0,\"\",'Step 3-Refrigerators'!H60)","v":""}]
[{"$nulls":3},"Disposed",null,{"$f":"IF('Step 3-Refrigerators'!$D$8=0,\"\", $D$8*('Step 3-Refrigerators'!$F61/'Step 3-Refrigerators'!$D$8))","v":""},"(gal)",{"$f":"IF('Step 3-Refrigerators'!H61=0,\"\",'Step 3-Refrigerators'!H61)","v":""}]
[null,null,"Metal","Ferrous Metal Recycled",null,{"$f":"IF('Step 3-Refrigerators'!$D$8=0,\"\", $D$8*('Step 3-Refrigerators'!$F62/'Step 3-Refrigerators'!$D$8))","v":""},"(lb)",{"$f":"IF('Step 3-Refrigerators'!H62=0,\"\",'Step 3-Refrigerators'!H62)","v":""}]
[{"$nulls":3},"Non-Ferrous Metal Recycled",null,{"$f":"IF('Step 3-Refrigerators'!$D$8=0,\"\", $D$8*('Step 3-Refrigerators'!$F63/'Step 3-Refrigerators'!$D$8))","v":""},"(lb)",{"$f":"IF('Step 3-Refrigerators'!H63=0,\"\",'Step 3-Refrigerators'!H63)","v":""}]
[null,null,"Plastic","Recycled",null,{"$f":"IF('Step 3-Refrigerators'!$D$8=0,\"\", $D$8*('Step 3-Refrigerators'!$F64/'Step 3-Refrigerators'!$D$8))","v":""},"(lb)",{"$f":"IF('Step 3-Refrigerators'!H64=0,\"\",'Step 3-Refrigerators'!H64)","v":""}]
[null,null,"Glass","Recycled",null,{"$f":"IF('Step 3-Refrigerators'!$D$8=0,\"\", $D$8*('Step 3-Refrigerators'!$F65/'Step 3-Refrigerators'!$D$8))","v":""},"(lb)",{"$f":"IF('Step 3-Refrigerators'!H65=0,\"\",'Step 3-Refrigerators'!H65)","v":""}]
[null,null,"PCB-Containing Capacitors","Destroyed",null,{"$f":"IF('Step 3-Refrigerators'!$D$8=0,\"\", $D$8*('Step 3-Refrigerators'!$F66/'Step 3-Refrigerators'!$D$8))","v":""},"(capacitors)",{"$f":"IF('Step 3-Refrigerators'!H66=0,\"\",'Step 3-Refrigerators'!H66)","v":""}]
[null,null,"*Foam-blowing agent typically represents only 10% of the total foam weight."]
[null,null,"Energy Savings"]
[null,null,{"$f":"'Step 3-Refrigerators'!C69:H69","v":"Please complete the table below if your program provides an incentive (e.g., financial) to encourage the disposal (i.e., without replacement) of old, working refrigerated appliances. "}]
[]
[null,null,"Average Number of Remaining Years of Useful Life",null,{"$f":"'Step 3-Refrigerators'!E71:F71","v":""},{"$nulls":3},""]
[null,null,"Average Energy Consumed/Year/Unit (kWh)",null,{"$f":"'Step 3-Refrigerators'!E72:F72","v":{"v":0,"d":"0.0"}}]
[null,null,"Average Energy Cost for Residential Consumers ($/kWh)  [please provide the average cost during the current program period]",null,{"$f":"'Step 3-Refrigerators'!E73:F73","v":{"v":0,"d":"$0.00"}}]
[]
[null,null,"Additional Comments:",{"$f":"IFERROR('Step 3-Refrigerators'!D75,\"\")","v":0}]

{"sheet":"Step 3-Stand-Alone Freezers","index":5,"n_rows":90,"n_cols":11,"rows_kept":90,"merged":[[1,8,1,9],[3,2,3,9],[5,2,5,9],[9,6,9,9],[10,6,14,9],[14,10,16,10],[15,7,15,9],[16,7,23,9],[23,10,27,10],[26,2,26,5],[26,7,26,9],[27,2,27,7],[28,2,29,2],[28,3,29,4],[28,5,29,6],[28,7,29,7],[30,2,44,2],[31,3,31,4],[32,3,32,4],[33,3,33,4],[34,3,34,4],[36,3,36,4],[37,3,37,4],[38,3,38,4],[39,3,39,4],[41,3,41,4],[42,3,42,4],[43,3,43,4],[44,3,44,4],[45,2,63,2],[46,3,46,4],[47,3,47,4],[48,3,48,4],[49,3,49,4],[51,3,51,4],[52,3,52,4],[53,3,53,4],[54,3,54,4],[56,3,56,4],[57,3,57,4],[58,3,58,4],[59,3,59,4],[61,3,61,4],[62,3,62,4],[63,3,63,4],[64,3,64,4],[65,2,66,2],[65,3,65,4],[66,3,66,4],[67,2,68,2],[67,3,67,4],[68,3,68,4],[69,3,69,4],[70,3,70,4],[71,2,72,2],[71,3,71,4],[72,3,72,4],[75,2,75,7],[77,2,77,3],[77,4,77,5],[78,2,78,3],[78,4,78,5],[79,2,79,3],[79,4,79,5],[81,3,88,9]]}
[]
[]
[null,null,"Step 3: Activity Data on Stand-Alone Freezers",{"$nulls":3},{"$f":"IF('Step 1-Contact and Program Info'!D7=0, \" \",'Step 1-Contact and Program Info'!D7)","v":" "},{"$f":"IF('Step 1-Contact and Program Info'!J7=\"\",\"\",'Step 1-Contact and Program Info'!J7)","v":"MM/DD/YYYY"},{"$f":"IF(H3=\"\",\"\",\"to\")","v":"to"},{"$f":"IF('Step 1-Contact and Program Info'!L7=\"\",\"\",'Step 1-Contact and Program Info'!L7)","v":"MM/DD/YYYY"}]
[null,null,"Instructions: All partners should complete Tables A and B. If your program provides an incentive (e.g., financial) to encourage the disposal of old, working refrigerated appliances, please also complete Table C. When populating cells, please use the units provided; do not add text to specify units. This form only recognizes numbers. "]
[null,null,"A. Units Processed"]
[null,null,"Please complete the gray cells below. Enter the total number of units processed by your program by refrigerant type and insulating material type in column D. Specify the number of units processed with refrigerant recovery and foam recovery in cells E11 to E14 and cells E17 to E23, respectively, and whether foam was recovered from appliance doors (cells F17 to F20). Also, provide the average age of appliances collected (cell D9), and whether the information on refrigerant and blowing agent types is based on assumptions or data (cells F11 to F14 and cells G17 to G23, respectively).  If any of the units reported in column D were jointly processed/administered with another RAD Utility, Retailer, Manufacturer, State/Local Government, or Waste Removal Service Provider Partner, please indicate the number of these units in Step 4 - Units Jointly Processed; the units reported in this table should be inclusive of the units reported in Step 4. If you wish to provide additional information (e.g., regarding types of refrigerants or insulating materials not listed below) or highlight uncertainties in your reporting, please do so in the “Comments” box."]
[]
[null,null,"Total Number of Units Processed"]
[null,null,"Average Age of Appliances Collected (yrs)"]
[null,null,"Refrigerant Type","Total Number of Units Processed ","Number of Units Processed with Refrigerant Recovery","Refrigerant Type Based On: ","Comments:"]
[null,null,"CFC-12"]
[null,null,"HCFC-22"]
[null,null,"HFC-134a"]
[null,null,"Other"]
[null,null,"Total",{"$f":"SUM(D11:D14)","v":0},{"$f":"SUM(E11:E14)","v":0},{"$nulls":5},{"$f":"IF(AND(D15<>D8,NOT(AND(ISBLANK(D11),ISBLANK(D12), ISBLANK(D13), ISBLANK(D14)))),\"<-- Ensure that total across all refrigerant types (cell D15) matches total number of units entered above (cell D8).\",\"\")","v":""}]
[null,null,"Insulating Material Type","Total Number of Units Processed ","Number of Units Processed with Foam Recovery","Was Foam Recovered From Appliance Doors?","Insulating Material Type Based On: ","Comments:"]
[null,null,"CFC-11 Blowing Agent"]
[null,null,"HCFC-141b Blowing Agent"]
[null,null,"HFC-134a Blowing Agent"]
[null,null,"HFC-245fa Blowing Agent"]
[null,null,"Cyclopentane  Blowing Agent"]
[null,null,"Fiberglass"]
[null,null,"Other"]
[null,null,"Total",{"$f":"SUM(D17:D23)","v":0},{"$f":"SUM(E17:E23)","v":0},{"$nulls":5},{"$f":"IF(AND(D24<>D8,NOT(AND(ISBLANK(D17),ISBLANK(D18), ISBLANK(D19), ISBLANK(D20), ISBLANK(D21), ISBLANK(D22), ISBLANK(D23)))),\"<-- Ensure that total across all insulating material types (cell D24) matches total number of units entered above (cell D8).\",\"\")","v":""}]
[]
[null,null,"B. Fate and Quantity of Substances Recovered"]
[]
[null,null,"Please complete the table below to provide the total amount of appliance components recovered by your program during the current reporting period. If any substances recovered during the current reporting period are currently in storage, please report on the intended fate of the substance (e.g., stockpiling with intent to reclaim/destroy). Refer back to the Instructions & Definitions tab for definitions of the fates for each component.  For any fields that do not apply to your program, please enter \"0\" under \"Total Amount\" in column F.  For every non-zero value entered in column F, indicate whether the quantity specified is based on actual measurements or on assumptions by selecting the appropriate option in column H. If you wish to clarify uncertainties about the data provided, or wish to provide further information, please use the space for “Additional Comments” at the bottom of this worksheet."]
[null,null,"Appliance Component","Fate of Component",null,"Total Amount",null,"Total Amount Based On: "]
[]
[null,null,"Refrigerant (including that recovered from compressor oil)","CFC-12"]
[{"$nulls":3},"Reclaimed",null,null,"(lb)"]
[{"$nulls":3},"Stockpiling with Intent to Reclaim",null,null,"(lb)"]
[{"$nulls":3},"Destroyed",null,null,"(lb)"]
[{"$nulls":3},"Stockpiling with Intent to Destroy",null,null,"(lb)"]
[{"$nulls":3},"HCFC-22"]
[{"$nulls":3},"Reclaimed",null,null,"(lb)"]
[{"$nulls":3},"Stockpiling with Intent to Reclaim",null,null,"(lb)"]
[{"$nulls":3},"Destroyed",null,null,"(lb)"]
[{"$nulls":3},"Stockpiling with Intent to Destroy",null,null,"(lb)"]
[{"$nulls":3},"HFC-134a"]
[{"$nulls":3},"Reclaimed",null,null,"(lb)"]
[{"$nulls":3},"Stockpiling with Intent to Reclaim",null,null,"(lb)"]
[{"$nulls":3},"Destroyed",null,null,"(lb)"]
[{"$nulls":3},"Stockpiling with Intent to Destroy",null,null,"(lb)"]
[null,null,"Foam-Blowing Agent*","CFC-11"]
[{"$nulls":3},"Reclaimed",null,null,"(lb)"]
[{"$nulls":3},"Stockpiling with Intent to Reclaim",null,null,"(lb)"]
[{"$nulls":3},"Destroyed",null,null,"(lb)"]
[{"$nulls":3},"Stockpiling with Intent to Destroy",null,null,"(lb)"]
[{"$nulls":3},"HCFC-141b"]
[{"$nulls":3},"Reclaimed",null,null,"(lb)"]
[{"$nulls":3},"Stockpiling with Intent to Reclaim",null,null,"(lb)"]
[{"$nulls":3},"Destroyed",null,null,"(lb)"]
[{"$nulls":3},"Stockpiling with Intent to Destroy",null,null,"(lb)"]
[{"$nulls":3},"HFC-134a"]
[{"$nulls":3},"Reclaimed",null,null,"(lb)"]
[{"$nulls":3},"Stockpiling with Intent to Reclaim",null,null,"(lb)"]
[{"$nulls":3},"Destroyed",null,null,"(lb)"]
[{"$nulls":3},"Stockpiling with Intent to Destroy",null,null,"(lb)"]
[{"$nulls":3},"HFC-245fa"]
[{"$nulls":3},"Reclaimed",null,null,"(lb)"]
[{"$nulls":3},"Stockpiling with Intent to Reclaim",null,null,"(lb)"]
[{"$nulls":3},"Destroyed",null,null,"(lb)"]
[{"$nulls":3},"Stockpiling with Intent to Destroy",null,null,"(lb)"]
[null,null,"Used Oil","Recycled",null,null,"(gal)"]
[{"$nulls":3},"Disposed",null,null,"(gal)"]
[null,null,"Metal","Ferrous Metal Recycled",null,null,"(lb)"]
[{"$nulls":3},"Non-Ferrous Metal Recycled",null,null,"(lb)"]
[null,null,"Plastic","Recycled",null,null,"(lb)"]
[null,null,"PCB-Containing Capacitors","Destroyed",null,null,"(# of capacitors)"]
[null,null,"Mercury-Containing Components","Recycled",null,null,"(# of components)"]
[{"$nulls":3},"Disposed",null,null,"(# of components)"]
[null,null,"*Foam-blowing agent typically represents only 10% of the total foam weight."]
[null,null,"C. Energy Savings"]
[null,null,"Please complete the table below if your program provides an incentive (e.g., financial) to encourage the disposal (i.e., without replacement) of old, working refrigerated appliances."]
[]
[null,null,"Average Number of Remaining Years of Useful Life",null,{"$f":"IF($D$9=\"\",\"\",VLOOKUP($D$9,'DOE RUL'!$A$5:$C$65,3,TRUE))","v":""}]
[null,null,"Average Energy Consumed/Year/Unit (kWh)"]
[null,null,"Average Energy Cost for Residential Consumers ($/kWh)  \n[please provide the average cost during the current program period]"]
[]
[null,null,"Additional Comments:"]
{"$rows_empty":7}
[null,null,{"$f":"'Instructions & Definitions'!C57","v":"EPA Form Number: 5900-482"}]

{"sheet":"Step 3-Stand-Alone Freezers (B)","index":6,"n_rows":80,"n_cols":10,"rows_kept":80,"hidden":true,"merged":[[1,8,1,9],[3,2,3,9],[5,2,5,9],[9,6,9,9],[10,6,13,9],[14,7,14,9],[15,7,21,9],[24,2,24,5],[24,7,24,9],[25,2,25,7],[26,2,27,2],[26,3,27,4],[26,5,27,6],[26,7,27,7],[28,2,42,2],[29,3,29,4],[30,3,30,4],[31,3,31,4],[32,3,32,4],[34,3,34,4],[35,3,35,4],[36,3,36,4],[37,3,37,4],[39,3,39,4],[40,3,40,4],[41,3,41,4],[42,3,42,4],[43,2,61,2],[44,3,44,4],[45,3,45,4],[46,3,46,4],[47,3,47,4],[49,3,49,4],[50,3,50,4],[51,3,51,4],[52,3,52,4],[54,3,54,4],[55,3,55,4],[56,3,56,4],[57,3,57,4],[59,3,59,4],[60,3,60,4],[61,3,61,4],[62,3,62,4],[63,2,64,2],[63,3,63,4],[64,3,64,4],[65,2,66,2],[65,3,65,4],[66,3,66,4],[67,3,67,4],[69,2,70,2],[70,3,70,4],[73,2,73,9],[75,2,75,3],[75,4,75,5],[76,2,76,3],[76,4,76,5],[77,2,77,3],[77,4,77,5],[79,3,86,9]]}
[]
[]
[null,null,"Activity Data: Stand Alone Freezers",{"$nulls":3},{"$f":"IF('Step 1-Contact and Program Info'!D7=0, \" \",'Step 1-Contact and Program Info'!D7)","v":" "},{"$f":"'Step 1-Contact and Program Info'!J7","v":"MM/DD/YYYY"},"to",{"$f":"'Step 1-Contact and Program Info'!L7","v":"MM/DD/YYYY"}]
[null,null,"Instructions: All partners should complete Tables A and B. If your program provides an incentive (e.g., financial) to encourage the disposal of old, working refrigerated appliances, please also complete Table C. When populating cells, please use the units provided; do not add text to specify units. This form only recognizes numbers. "]
[null,null,"Units Processed"]
[null,null,{"$f":"'Step 3-Stand-Alone Freezers'!C6:J6","v":"Please complete the gray cells below. Enter the total number of units processed by your program by refrigerant type and insulating material type in column D. Specify the number of units processed with refrigerant recovery and foam recovery in cells E11 to E14 and cells E17 to E23, respectively, and whether foam was recovered from appliance doors (cells F17 to F20). Also, provide the average age of appliances collected (cell D9), and whether the information on refrigerant and blowing agent types is based on assumptions or data (cells F11 to F14 and cells G17 to G23, respectively).  If any of the units reported in column D were jointly processed/administered with another RAD Utility, Retailer, Manufacturer, State/Local Government, or Waste Removal Service Provider Partner, please indicate the number of these units in Step 4 - Units Jointly Processed; the units reported in this table should be inclusive of the units reported in Step 4. If you wish to provide additional information (e.g., regarding types of refrigerants or insulating materials not listed below) or highlight uncertainties in your reporting, please do so in the “Comments” box."}]
[]
[null,null,"Total Number of Units Processed (excluding units processed by other RAD utilities)",{"$f":"'Step 3-Stand-Alone Freezers'!D8-'Step 4-Units Jointly Processed'!AH28","v":0}]
[null,null,"Average Age of Appliances Collected (yrs)",{"$f":"'Step 3-Stand-Alone Freezers'!D9","v":0}]
[null,null,"Refrigerant Type","Total Number of Units Processed ","Number of Units Processed with Refrigerant Recovery",{"$f":"'Step 3-Stand-Alone Freezers'!F10","v":"Refrigerant Type Based On: "},"Comments:"]
[null,null,"CFC-12",{"$f":"'Step 3-Stand-Alone Freezers'!D11-'Step 4-Units Jointly Processed'!AH30","v":0},{"$f":"'Step 3-Stand-Alone Freezers'!E11-'Step 4-Units Jointly Processed'!AH30","v":0},{"$f":"'Step 3-Stand-Alone Freezers'!F11","v":0},{"$f":"'Step 3-Stand-Alone Freezers'!G11","v":0}]
[null,null,"HCFC-22",{"$f":"'Step 3-Stand-Alone Freezers'!D12-'Step 4-Units Jointly Processed'!AH31","v":0},{"$f":"'Step 3-Stand-Alone Freezers'!E12-'Step 4-Units Jointly Processed'!AH31","v":0},{"$f":"'Step 3-Stand-Alone Freezers'!F12","v":0}]
[null,null,"HFC-134a",{"$f":"'Step 3-Stand-Alone Freezers'!D13-'Step 4-Units Jointly Processed'!AH32","v":0},{"$f":"'Step 3-Stand-Alone Freezers'!E13-'Step 4-Units Jointly Processed'!AH32","v":0},{"$f":"'Step 3-Stand-Alone Freezers'!F13","v":0}]
[null,null,"Other",{"$f":"'Step 3-Stand-Alone Freezers'!D14-'Step 4-Units Jointly Processed'!AH33","v":0},{"$f":"'Step 3-Stand-Alone Freezers'!E14-'Step 4-Units Jointly Processed'!AH33","v":0},{"$f":"'Step 3-Stand-Alone Freezers'!F14","v":0}]
[null,null,"Insulating MaterialType","Total Number of Units Processed ","Number of Units Processed with Foam Recovery",{"$f":"'Step 3-Stand-Alone Freezers'!F16","v":"Was Foam Recovered From Appliance Doors?"},"Based On: ","Comments:"]
[null,null,"CFC-11 Blowing Agent",{"$f":"'Step 3-Stand-Alone Freezers'!D17-'Step 4-Units Jointly Processed'!AH36","v":0},{"$f":"'Step 3-Stand-Alone Freezers'!E17-'Step 4-Units Jointly Processed'!AH36","v":0},{"$f":"'Step 3-Stand-Alone Freezers'!F17","v":0},{"$f":"'Step 3-Stand-Alone Freezers'!G17","v":0},{"$f":"'Step 3-Stand-Alone Freezers'!H17","v":0}]
[null,null,"HCFC-141b Blowing Agent",{"$f":"'Step 3-Stand-Alone Freezers'!D18-'Step 4-Units Jointly Processed'!AH37","v":0},{"$f":"'Step 3-Stand-Alone Freezers'!E18-'Step 4-Units Jointly Processed'!AH37","v":0},{"$f":"'Step 3-Stand-Alone Freezers'!F18","v":0},{"$f":"'Step 3-Stand-Alone Freezers'!G18","v":0}]
[null,null,"HFC-134a Blowing Agent",{"$f":"'Step 3-Stand-Alone Freezers'!D19-'Step 4-Units Jointly Processed'!AH38","v":0},{"$f":"'Step 3-Stand-Alone Freezers'!E19-'Step 4-Units Jointly Processed'!AH38","v":0},{"$f":"'Step 3-Stand-Alone Freezers'!F19","v":0},{"$f":"'Step 3-Stand-Alone Freezers'!G19","v":0}]
[null,null,"HFC-245fa Blowing Agent",{"$f":"'Step 3-Stand-Alone Freezers'!D20-'Step 4-Units Jointly Processed'!AH39","v":0},{"$f":"'Step 3-Stand-Alone Freezers'!E20-'Step 4-Units Jointly Processed'!AH39","v":0},{"$f":"'Step 3-Stand-Alone Freezers'!F20","v":0},{"$f":"'Step 3-Stand-Alone Freezers'!G20","v":0}]
[null,null,"Cyclopentane  Blowing Agent",{"$f":"'Step 3-Stand-Alone Freezers'!D21-'Step 4-Units Jointly Processed'!AH40","v":0},{"$f":"'Step 3-Stand-Alone Freezers'!E21-'Step 4-Units Jointly Processed'!AH40","v":0},{"$f":"'Step 3-Stand-Alone Freezers'!F21","v":0},{"$f":"'Step 3-Stand-Alone Freezers'!G21","v":0}]
[null,null,"Fiberglass",{"$f":"'Step 3-Stand-Alone Freezers'!D22-'Step 4-Units Jointly Processed'!AH41","v":0},{"$f":"'Step 3-Stand-Alone Freezers'!E22-'Step 4-Units Jointly Processed'!AH41","v":0},{"$f":"'Step 3-Stand-Alone Freezers'!F22","v":0},{"$f":"'Step 3-Stand-Alone Freezers'!G22","v":0}]
[null,null,"Other",{"$f":"'Step 3-Stand-Alone Freezers'!D23-'Step 4-Units Jointly Processed'!AH42","v":0},{"$f":"'Step 3-Stand-Alone Freezers'!E23-'Step 4-Units Jointly Processed'!AH42","v":0},{"$f":"'Step 3-Stand-Alone Freezers'!F23","v":0},{"$f":"'Step 3-Stand-Alone Freezers'!G23","v":0}]
[]
[null,null,"Fate and Quantity of Substances Recovered"]
[]
[null,null,{"$f":"'Step 3-Stand-Alone Freezers'!C28:H28","v":"Please complete the table below to provide the total amount of appliance components recovered by your program during the current reporting period. If any substances recovered during the current reporting period are currently in storage, please report on the intended fate of the substance (e.g., stockpiling with intent to reclaim/destroy). Refer back to the Instructions & Definitions tab for definitions of the fates for each component.  For any fields that do not apply to your program, please enter \"0\" under \"Total Amount\" in column F.  For every non-zero value entered in column F, indicate whether the quantity specified is based on actual measurements or on assumptions by selecting the appropriate option in column H. If you wish to clarify uncertainties about the data provided, or wish to provide further information, please use the space for “Additional Comments” at the bottom of this worksheet."}]
[null,null,"Appliance Component","Fate of Component",null,"Total Amount",null,"Total Amount Based On: "]
[]
[null,null,"Refrigerant (including that recovered from compressor oil)","CFC-12"]
[{"$nulls":3},"Reclaimed",null,{"$f":"IF('Step 3-Stand-Alone Freezers'!$E$11=0,\"\",$E$11*('Step 3-Stand-Alone Freezers'!$F32/'Step 3-Stand-Alone Freezers'!$E$11))","v":""},"(lb)",{"$f":"IF('Step 3-Stand-Alone Freezers'!H32=0,\"\",'Step 3-Stand-Alone Freezers'!H32)","v":""}]
[{"$nulls":3},"Stockpiling with Intent to Reclaim",null,{"$f":"IF('Step 3-Stand-Alone Freezers'!$E$11=0,\"\",$E$11*('Step 3-Stand-Alone Freezers'!$F33/'Step 3-Stand-Alone Freezers'!$E$11))","v":""},"(lb)",{"$f":"IF('Step 3-Stand-Alone Freezers'!H33=0,\"\",'Step 3-Stand-Alone Freezers'!H33)","v":""}]
[{"$nulls":3},"Destroyed",null,{"$f":"IF('Step 3-Stand-Alone Freezers'!$E$11=0,\"\",$E$11*('Step 3-Stand-Alone Freezers'!$F34/'Step 3-Stand-Alone Freezers'!$E$11))","v":""},"(lb)",{"$f":"IF('Step 3-Stand-Alone Freezers'!H34=0,\"\",'Step 3-Stand-Alone Freezers'!H34)","v":""}]
[{"$nulls":3},"Stockpiling with Intent to Destroy",null,{"$f":"IF('Step 3-Stand-Alone Freezers'!$E$11=0,\"\",$E$11*('Step 3-Stand-Alone Freezers'!$F35/'Step 3-Stand-Alone Freezers'!$E$11))","v":""},"(lb)",{"$f":"IF('Step 3-Stand-Alone Freezers'!H35=0,\"\",'Step 3-Stand-Alone Freezers'!H35)","v":""}]
[{"$nulls":3},"HCFC-22"]
[{"$nulls":3},"Reclaimed",null,{"$f":"IF('Step 3-Stand-Alone Freezers'!$E$12=0,\"\",$E$12*('Step 3-Stand-Alone Freezers'!$F37/'Step 3-Stand-Alone Freezers'!$E$12))","v":""},"(lb)",{"$f":"IF('Step 3-Stand-Alone Freezers'!H37=0,\"\",'Step 3-Stand-Alone Freezers'!H37)","v":""}]
[{"$nulls":3},"Stockpiling with Intent to Reclaim",null,{"$f":"IF('Step 3-Stand-Alone Freezers'!$E$12=0,\"\",$E$12*('Step 3-Stand-Alone Freezers'!$F38/'Step 3-Stand-Alone Freezers'!$E$12))","v":""},"(lb)",{"$f":"IF('Step 3-Stand-Alone Freezers'!H38=0,\"\",'Step 3-Stand-Alone Freezers'!H38)","v":""}]
[{"$nulls":3},"Destroyed",null,{"$f":"IF('Step 3-Stand-Alone Freezers'!$E$12=0,\"\",$E$12*('Step 3-Stand-Alone Freezers'!$F39/'Step 3-Stand-Alone Freezers'!$E$12))","v":""},"(lb)",{"$f":"IF('Step 3-Stand-Alone Freezers'!H39=0,\"\",'Step 3-Stand-Alone Freezers'!H39)","v":""}]
[{"$nulls":3},"Stockpiling with Intent to Destroy",null,{"$f":"IF('Step 3-Stand-Alone Freezers'!$E$12=0,\"\",$E$12*('Step 3-Stand-Alone Freezers'!$F40/'Step 3-Stand-Alone Freezers'!$E$12))","v":""},"(lb)",{"$f":"IF('Step 3-Stand-Alone Freezers'!H40=0,\"\",'Step 3-Stand-Alone Freezers'!H40)","v":""}]
[{"$nulls":3},"HFC-134a"]
[{"$nulls":3},"Reclaimed",null,{"$f":"IF('Step 3-Stand-Alone Freezers'!$E$13=0,\"\",$E$13*('Step 3-Stand-Alone Freezers'!$F42/'Step 3-Stand-Alone Freezers'!$E$13))","v":""},"(lb)",{"$f":"IF('Step 3-Stand-Alone Freezers'!H42=0,\"\",'Step 3-Stand-Alone Freezers'!H42)","v":""}]
[{"$nulls":3},"Stockpiling with Intent to Reclaim",null,{"$f":"IF('Step 3-Stand-Alone Freezers'!$E$13=0,\"\",$E$13*('Step 3-Stand-Alone Freezers'!$F43/'Step 3-Stand-Alone Freezers'!$E$13))","v":""},"(lb)",{"$f":"IF('Step 3-Stand-Alone Freezers'!H43=0,\"\",'Step 3-Stand-Alone Freezers'!H43)","v":""}]
[{"$nulls":3},"Destroyed",null,{"$f":"IF('Step 3-Stand-Alone Freezers'!$E$13=0,\"\",$E$13*('Step 3-Stand-Alone Freezers'!$F44/'Step 3-Stand-Alone Freezers'!$E$13))","v":""},"(lb)",{"$f":"IF('Step 3-Stand-Alone Freezers'!H44=0,\"\",'Step 3-Stand-Alone Freezers'!H44)","v":""}]
[{"$nulls":3},"Stockpiling with Intent to Destroy",null,{"$f":"IF('Step 3-Stand-Alone Freezers'!$E$13=0,\"\",$E$13*('Step 3-Stand-Alone Freezers'!$F45/'Step 3-Stand-Alone Freezers'!$E$13))","v":""},"(lb)",{"$f":"IF('Step 3-Stand-Alone Freezers'!H45=0,\"\",'Step 3-Stand-Alone Freezers'!H45)","v":""}]
[null,null,"Foam-Blowing Agent*","CFC-11"]
[{"$nulls":3},"Reclaimed",null,{"$f":"IF('Step 3-Stand-Alone Freezers'!$E$17=0,\"\",$E$16*('Step 3-Stand-Alone Freezers'!$F47/'Step 3-Stand-Alone Freezers'!$E$17))","v":""},"(lb)",{"$f":"IF('Step 3-Stand-Alone Freezers'!H47=0,\"\",'Step 3-Stand-Alone Freezers'!H47)","v":""}]
[{"$nulls":3},"Stockpiling with Intent to Reclaim",null,{"$f":"IF('Step 3-Stand-Alone Freezers'!$E$17=0,\"\",$E$16*('Step 3-Stand-Alone Freezers'!$F48/'Step 3-Stand-Alone Freezers'!$E$17))","v":""},"(lb)",{"$f":"IF('Step 3-Stand-Alone Freezers'!H48=0,\"\",'Step 3-Stand-Alone Freezers'!H48)","v":""}]
[{"$nulls":3},"Destroyed",null,{"$f":"IF('Step 3-Stand-Alone Freezers'!$E$17=0,\"\",$E$16*('Step 3-Stand-Alone Freezers'!$F49/'Step 3-Stand-Alone Freezers'!$E$17))","v":""},"(lb)",{"$f":"IF('Step 3-Stand-Alone Freezers'!H49=0,\"\",'Step 3-Stand-Alone Freezers'!H49)","v":""}]
[{"$nulls":3},"Stockpiling with Intent to Destroy",null,{"$f":"IF('Step 3-Stand-Alone Freezers'!$E$17=0,\"\",$E$16*('Step 3-Stand-Alone Freezers'!$F50/'Step 3-Stand-Alone Freezers'!$E$17))","v":""},"(lb)",{"$f":"IF('Step 3-Stand-Alone Freezers'!H50=0,\"\",'Step 3-Stand-Alone Freezers'!H50)","v":""}]
[{"$nulls":3},"HCFC-141b"]
[{"$nulls":3},"Reclaimed",null,{"$f":"IF('Step 3-Stand-Alone Freezers'!$E$18=0,\"\",$E$17*('Step 3-Stand-Alone Freezers'!$F52/'Step 3-Stand-Alone Freezers'!$E$18))","v":""},"(lb)",{"$f":"IF('Step 3-Stand-Alone Freezers'!H52=0,\"\",'Step 3-Stand-Alone Freezers'!H52)","v":""}]
[{"$nulls":3},"Stockpiling with Intent to Reclaim",null,{"$f":"IF('Step 3-Stand-Alone Freezers'!$E$18=0,\"\",$E$17*('Step 3-Stand-Alone Freezers'!$F53/'Step 3-Stand-Alone Freezers'!$E$18))","v":""},"(lb)",{"$f":"IF('Step 3-Stand-Alone Freezers'!H53=0,\"\",'Step 3-Stand-Alone Freezers'!H53)","v":""}]
[{"$nulls":3},"Destroyed",null,{"$f":"IF('Step 3-Stand-Alone Freezers'!$E$18=0,\"\",$E$17*('Step 3-Stand-Alone Freezers'!$F54/'Step 3-Stand-Alone Freezers'!$E$18))","v":""},"(lb)",{"$f":"IF('Step 3-Stand-Alone Freezers'!H54=0,\"\",'Step 3-Stand-Alone Freezers'!H54)","v":""}]
[{"$nulls":3},"Stockpiling with Intent to Destroy",null,{"$f":"IF('Step 3-Stand-Alone Freezers'!$E$18=0,\"\",$E$17*('Step 3-Stand-Alone Freezers'!$F55/'Step 3-Stand-Alone Freezers'!$E$18))","v":""},"(lb)",{"$f":"IF('Step 3-Stand-Alone Freezers'!H55=0,\"\",'Step 3-Stand-Alone Freezers'!H55)","v":""}]
[{"$nulls":3},"HFC-134a"]
[{"$nulls":3},"Reclaimed",null,{"$f":"IF('Step 3-Stand-Alone Freezers'!$E$19=0,\"\",$E$18*('Step 3-Stand-Alone Freezers'!$F57/'Step 3-Stand-Alone Freezers'!$E$19))","v":""},"(lb)",{"$f":"IF('Step 3-Stand-Alone Freezers'!H57=0,\"\",'Step 3-Stand-Alone Freezers'!H57)","v":""}]
[{"$nulls":3},"Stockpiling with Intent to Reclaim",null,{"$f":"IF('Step 3-Stand-Alone Freezers'!$E$19=0,\"\",$E$18*('Step 3-Stand-Alone Freezers'!$F58/'Step 3-Stand-Alone Freezers'!$E$19))","v":""},"(lb)",{"$f":"IF('Step 3-Stand-Alone Freezers'!H58=0,\"\",'Step 3-Stand-Alone Freezers'!H58)","v":""}]
[{"$nulls":3},"Destroyed",null,{"$f":"IF('Step 3-Stand-Alone Freezers'!$E$19=0,\"\",$E$18*('Step 3-Stand-Alone Freezers'!$F59/'Step 3-Stand-Alone Freezers'!$E$19))","v":""},"(lb)",{"$f":"IF('Step 3-Stand-Alone Freezers'!H59=0,\"\",'Step 3-Stand-Alone Freezers'!H59)","v":""}]
[{"$nulls":3},"Stockpiling with Intent to Destroy",null,{"$f":"IF('Step 3-Stand-Alone Freezers'!$E$19=0,\"\",$E$18*('Step 3-Stand-Alone Freezers'!$F60/'Step 3-Stand-Alone Freezers'!$E$19))","v":""},"(lb)",{"$f":"IF('Step 3-Stand-Alone Freezers'!H60=0,\"\",'Step 3-Stand-Alone Freezers'!H60)","v":""}]
[{"$nulls":3},"HFC-245fa"]
[{"$nulls":3},"Reclaimed",null,{"$f":"IF('Step 3-Stand-Alone Freezers'!$E$20=0,\"\",$E$19*('Step 3-Stand-Alone Freezers'!$F62/'Step 3-Stand-Alone Freezers'!$E$20))","v":""},"(lb)",{"$f":"IF('Step 3-Stand-Alone Freezers'!H62=0,\"\",'Step 3-Stand-Alone Freezers'!H62)","v":""}]
[{"$nulls":3},"Stockpiling with Intent to Reclaim",null,{"$f":"IF('Step 3-Stand-Alone Freezers'!$E$20=0,\"\",$E$19*('Step 3-Stand-Alone Freezers'!$F63/'Step 3-Stand-Alone Freezers'!$E$20))","v":""},"(lb)",{"$f":"IF('Step 3-Stand-Alone Freezers'!H63=0,\"\",'Step 3-Stand-Alone Freezers'!H63)","v":""}]
[{"$nulls":3},"Destroyed",null,{"$f":"IF('Step 3-Stand-Alone Freezers'!$E$20=0,\"\",$E$19*('Step 3-Stand-Alone Freezers'!$F64/'Step 3-Stand-Alone Freezers'!$E$20))","v":""},"(lb)",{"$f":"IF('Step 3-Stand-Alone Freezers'!H64=0,\"\",'Step 3-Stand-Alone Freezers'!H64)","v":""}]
[{"$nulls":3},"Stockpiling with Intent to Destroy",null,{"$f":"IF('Step 3-Stand-Alone Freezers'!$E$20=0,\"\",$E$19*('Step 3-Stand-Alone Freezers'!$F65/'Step 3-Stand-Alone Freezers'!$E$20))","v":""},"(lb)",{"$f":"IF('Step 3-Stand-Alone Freezers'!H65=0,\"\",'Step 3-Stand-Alone Freezers'!H65)","v":""}]
[null,null,"Used Oil","Recycled",null,{"$f":"IF('Step 3-Stand-Alone Freezers'!$D$8=0,\"\", $D$8*('Step 3-Stand-Alone Freezers'!F66/'Step 3-Stand-Alone Freezers'!$D$8))","v":""},"(gal)",{"$f":"IF('Step 3-Stand-Alone Freezers'!H66=0,\"\",'Step 3-Stand-Alone Freezers'!H66)","v":""}]
[{"$nulls":3},"Disposed",null,{"$f":"IF('Step 3-Stand-Alone Freezers'!$D$8=0,\"\", $D$8*('Step 3-Stand-Alone Freezers'!F67/'Step 3-Stand-Alone Freezers'!$D$8))","v":""},"(gal)",{"$f":"IF('Step 3-Stand-Alone Freezers'!H67=0,\"\",'Step 3-Stand-Alone Freezers'!H67)","v":""}]
[null,null,"Metal","Ferrous Metal Recycled",null,{"$f":"IF('Step 3-Stand-Alone Freezers'!$D$8=0,\"\", $D$8*('Step 3-Stand-Alone Freezers'!F68/'Step 3-Stand-Alone Freezers'!$D$8))","v":""},"(lb)",{"$f":"IF('Step 3-Stand-Alone Freezers'!H68=0,\"\",'Step 3-Stand-Alone Freezers'!H68)","v":""}]
[{"$nulls":3},"Non-Ferrous Metal Recycled",null,{"$f":"IF('Step 3-Stand-Alone Freezers'!$D$8=0,\"\", $D$8*('Step 3-Stand-Alone Freezers'!F69/'Step 3-Stand-Alone Freezers'!$D$8))","v":""},"(lb)",{"$f":"IF('Step 3-Stand-Alone Freezers'!H69=0,\"\",'Step 3-Stand-Alone Freezers'!H69)","v":""}]
[null,null,"Plastic","Recycled",null,{"$f":"IF('Step 3-Stand-Alone Freezers'!$D$8=0,\"\", $D$8*('Step 3-Stand-Alone Freezers'!F70/'Step 3-Stand-Alone Freezers'!$D$8))","v":""},"(lb)",{"$f":"IF('Step 3-Stand-Alone Freezers'!H70=0,\"\",'Step 3-Stand-Alone Freezers'!H70)","v":""}]
[null,null,"PCB-Containing Capacitors","Destroyed",null,{"$f":"IF('Step 3-Stand-Alone Freezers'!$D$8=0,\"\", $D$8*('Step 3-Stand-Alone Freezers'!F71/'Step 3-Stand-Alone Freezers'!$D$8))","v":""},"(capacitors)",{"$f":"IF('Step 3-Stand-Alone Freezers'!H71=0,\"\",'Step 3-Stand-Alone Freezers'!H71)","v":""}]
[null,null,"Mercury-Containing Components","Recycled",null,{"$f":"IF('Step 3-Stand-Alone Freezers'!$D$8=0,\"\", $D$8*('Step 3-Stand-Alone Freezers'!F72/'Step 3-Stand-Alone Freezers'!$D$8))","v":""},"(components)",{"$f":"IF('Step 3-Stand-Alone Freezers'!H72=0,\"\",'Step 3-Stand-Alone Freezers'!H72)","v":""}]
[{"$nulls":3},"Disposed",null,{"$f":"IF('Step 3-Stand-Alone Freezers'!$D$8=0,\"\", $D$8*('Step 3-Stand-Alone Freezers'!F73/'Step 3-Stand-Alone Freezers'!$D$8))","v":""},"(components)",{"$f":"IF('Step 3-Stand-Alone Freezers'!H73=0,\"\",'Step 3-Stand-Alone Freezers'!H73)","v":""}]
[null,null,"*Foam-blowing agent typically represents only 10% of the total foam weight."]
[null,null,"Energy Savings"]
[null,null,{"$f":"'Step 3-Stand-Alone Freezers'!C76:H76","v":"Please complete the table below if your program provides an incentive (e.g., financial) to encourage the disposal (i.e., without replacement) of old, working refrigerated appliances."}]
[]
[null,null,"Average Number of Remaining Years of Useful Life",null,{"$f":"'Step 3-Stand-Alone Freezers'!E78:F78","v":""}]
[null,null,"Average Energy Consumed/Year/Unit (kWh)",null,{"$f":"'Step 3-Stand-Alone Freezers'!E79:F79","v":{"v":0,"d":"0.0"}}]
[null,null,"Average Energy Cost for Residential Consumers ($/kWh)  \n[please provide the average cost during the current program period]",null,{"$f":"'Step 3-Stand-Alone Freezers'!E80","v":{"v":0,"d":"$0.00"}}]
[]
[null,null,"Additional Comments:",{"$f":"IFERROR('Step 3-Stand-Alone Freezers'!D82,\"\")","v":0}]

{"sheet":"Step 3-Air-Conditioning Uni (B)","index":7,"n_rows":50,"n_cols":10,"rows_kept":50,"hidden":true,"merged":[[1,8,1,9],[3,2,3,9],[5,2,5,9],[9,6,9,8],[10,6,13,8],[16,2,16,5],[16,7,16,10],[17,2,17,7],[18,2,19,2],[18,3,19,4],[18,5,19,6],[18,7,19,7],[20,2,34,2],[20,3,20,5],[21,3,21,4],[22,3,22,4],[23,3,23,4],[24,3,24,4],[25,3,25,5],[26,3,26,4],[27,3,27,4],[28,3,28,4],[29,3,29,4],[30,3,30,5],[31,3,31,4],[32,3,32,4],[33,3,33,4],[34,3,34,4],[35,2,36,2],[35,3,35,4],[36,3,36,4],[37,2,38,2],[37,3,37,4],[38,3,38,4],[39,3,39,4],[43,2,43,10],[45,2,45,3],[45,4,45,5],[46,2,46,3],[46,4,46,5],[47,2,47,3],[47,4,47,5],[49,3,56,9]]}
[]
[]
[null,null,{"$f":"'Step 3-Air-Conditioning Units'!C3","v":"Step 3: Activity Data on Air-Conditioning Units"},{"$nulls":3},{"$f":"IF('Step 1-Contact and Program Info'!D7=0, \" \",'Step 1-Contact and Program Info'!D7)","v":" "},{"$f":"'Step 1-Contact and Program Info'!$J$7","v":"MM/DD/YYYY"},"to",{"$f":"'Step 1-Contact and Program Info'!$L$7","v":"MM/DD/YYYY"}]
[null,null,"Instructions: All partners should complete Tables A and B. If your program provides an incentive (e.g., financial) to encourage the disposal of old, \nworking refrigerated appliances, please also complete Table C. When populating cells, please use the units provided; do not add text to specify units. This form only recognizes numbers. "]
[null,null,"Units Processed"]
[null,null,{"$f":"'Step 3-Air-Conditioning Units'!C6:J6","v":"Please complete the gray cells below. Enter the total number of units processed by your program by refrigerant type in column D. Specify the number of units processed with refrigerant recovery in cells E11 to E14.  Also, provide the average age of appliances collected (cell D9), and whether the information on refrigerant types is based on assumptions or data (cells F11 to F14).  If any of the units reported in column D were jointly processed/administered with another RAD Utility, Retailer, Manufacturer, State/Local Government, or Waste Removal Service Provider Partner, please indicate the number of these units in Step 4 - Units Jointly Processed; the units reported in this table should be inclusive of the units reported in Step 4. If you wish to provide additional information (e.g., regarding types of refrigerants or insulating materials not listed below) or highlight uncertainties in your reporting, please do so in the “Comments” box."}]
[]
[null,null,"Total Number of Units Processed (excluding units processed by other RAD utilities)",{"$f":"'Step 3-Air-Conditioning Units'!D8-'Step 4-Units Jointly Processed'!AH46","v":0}]
[null,null,"Average Age of Appliances Collected (yrs)",{"$f":"'Step 3-Air-Conditioning Units'!D9","v":{"v":0,"d":"0.0"}}]
[null,null,"Refrigerant Type","Total Number of Units Processed ","Number of Units Processed with Refrigerant Recovery","Based On: ","Comments:"]
[null,null,"HCFC-22",{"$f":"'Step 3-Air-Conditioning Units'!D11-'Step 4-Units Jointly Processed'!AH48","v":0},{"$f":"'Step 3-Air-Conditioning Units'!E11-'Step 4-Units Jointly Processed'!AH48","v":0},{"$f":"'Step 3-Air-Conditioning Units'!F11","v":0},{"$f":"'Step 3-Air-Conditioning Units'!G11:I14","v":0}]
[null,null,"R-407C",{"$f":"'Step 3-Air-Conditioning Units'!D12-'Step 4-Units Jointly Processed'!AH49","v":0},{"$f":"'Step 3-Air-Conditioning Units'!E12-'Step 4-Units Jointly Processed'!AH49","v":0},{"$f":"'Step 3-Air-Conditioning Units'!F12","v":0}]
[null,null,"R-410A",{"$f":"'Step 3-Air-Conditioning Units'!D13-'Step 4-Units Jointly Processed'!AH50","v":0},{"$f":"'Step 3-Air-Conditioning Units'!E13-'Step 4-Units Jointly Processed'!AH50","v":0},{"$f":"'Step 3-Air-Conditioning Units'!F13","v":0}]
[null,null,"Other",{"$f":"'Step 3-Air-Conditioning Units'!D14-'Step 4-Units Jointly Processed'!AH51","v":0},{"$f":"'Step 3-Air-Conditioning Units'!E14-'Step 4-Units Jointly Processed'!AH51","v":0},{"$f":"'Step 3-Air-Conditioning Units'!F14","v":0}]
[]
[null,null,"Fate and Quantity of Substances Recovered"]
[]
[null,null,{"$f":"'Step 3-Air-Conditioning Units'!C19:H19","v":"Please complete the table below to provide the total amount of appliance components recovered by your program during the current reporting period. If any substances recovered during the current reporting period are currently in storage, please report on the intended fate of the substance (e.g., stockpiling with intent to reclaim/destroy). Refer back to the Instructions & Definitions tab for definitions of the fates for each component.  For any fields that do not apply to your program, please enter \"0\" under \"Total Amount\" in column F.  For every non-zero value entered in column F, indicate whether the quantity specified is based on actual measurements or on assumptions by selecting the appropriate option in column H. If you wish to clarify uncertainties about the data provided, or wish to provide further information, please use the space for “Additional Comments” at the bottom of this worksheet."}]
[null,null,"Appliance Component","Fate of Component",null,"Total Amount",null,"Total Amount Based On: "]
[]
[null,null,"Refrigerant (including that recovered from compressor oil)","HCFC-22"]
[{"$nulls":3},"Reclaimed",null,{"$f":"IF('Step 3-Air-Conditioning Units'!$E$11=0,\"\", $E$11*('Step 3-Air-Conditioning Units'!F23/'Step 3-Air-Conditioning Units'!$E$11))","v":""},"(lb)",{"$f":"IF('Step 3-Air-Conditioning Units'!H23=\"\",\"\",'Step 3-Air-Conditioning Units'!H23)","v":""}]
[{"$nulls":3},"Stockpiling with Intent to Reclaim",null,{"$f":"IF('Step 3-Air-Conditioning Units'!$E$11=0,\"\", $E$11*('Step 3-Air-Conditioning Units'!F24/'Step 3-Air-Conditioning Units'!$E$11))","v":""},"(lb)",{"$f":"IF('Step 3-Air-Conditioning Units'!H24=\"\",\"\",'Step 3-Air-Conditioning Units'!H24)","v":""}]
[{"$nulls":3},"Destroyed",null,{"$f":"IF('Step 3-Air-Conditioning Units'!$E$11=0,\"\", $E$11*('Step 3-Air-Conditioning Units'!F25/'Step 3-Air-Conditioning Units'!$E$11))","v":""},"(lb)",{"$f":"IF('Step 3-Air-Conditioning Units'!H25=\"\",\"\",'Step 3-Air-Conditioning Units'!H25)","v":""}]
[{"$nulls":3},"Stockpiling with Intent to Destroy",null,{"$f":"IF('Step 3-Air-Conditioning Units'!$E$11=0,\"\", $E$11*('Step 3-Air-Conditioning Units'!F26/'Step 3-Air-Conditioning Units'!$E$11))","v":""},"(lb)",{"$f":"IF('Step 3-Air-Conditioning Units'!H26=\"\",\"\",'Step 3-Air-Conditioning Units'!H26)","v":""}]
[{"$nulls":3},"R-407C "]
[{"$nulls":3},"Reclaimed",null,{"$f":"IF('Step 3-Air-Conditioning Units'!$E$12=0,\"\", $E$12*('Step 3-Air-Conditioning Units'!F28/'Step 3-Air-Conditioning Units'!$E$12))","v":""},"(lb)",{"$f":"IF('Step 3-Air-Conditioning Units'!H28=\"\",\"\",'Step 3-Air-Conditioning Units'!H28)","v":""}]
[{"$nulls":3},"Stockpiling with Intent to Reclaim",null,{"$f":"IF('Step 3-Air-Conditioning Units'!$E$12=0,\"\", $E$12*('Step 3-Air-Conditioning Units'!F29/'Step 3-Air-Conditioning Units'!$E$12))","v":""},"(lb)",{"$f":"IF('Step 3-Air-Conditioning Units'!H29=\"\",\"\",'Step 3-Air-Conditioning Units'!H29)","v":""}]
[{"$nulls":3},"Destroyed",null,{"$f":"IF('Step 3-Air-Conditioning Units'!$E$12=0,\"\", $E$12*('Step 3-Air-Conditioning Units'!F30/'Step 3-Air-Conditioning Units'!$E$12))","v":""},"(lb)",{"$f":"IF('Step 3-Air-Conditioning Units'!H30=\"\",\"\",'Step 3-Air-Conditioning Units'!H30)","v":""}]
[{"$nulls":3},"Stockpiling with Intent to Destroy",null,{"$f":"IF('Step 3-Air-Conditioning Units'!$E$12=0,\"\", $E$12*('Step 3-Air-Conditioning Units'!F31/'Step 3-Air-Conditioning Units'!$E$12))","v":""},"(lb)",{"$f":"IF('Step 3-Air-Conditioning Units'!H31=\"\",\"\",'Step 3-Air-Conditioning Units'!H31)","v":""}]
[{"$nulls":3},"R-410A "]
[{"$nulls":3},"Reclaimed",null,{"$f":"IF('Step 3-Air-Conditioning Units'!$E$13=0,\"\", $E$13*('Step 3-Air-Conditioning Units'!F33/'Step 3-Air-Conditioning Units'!$E$13))","v":""},"(lb)",{"$f":"IF('Step 3-Air-Conditioning Units'!H33=\"\",\"\",'Step 3-Air-Conditioning Units'!H33)","v":""}]
[{"$nulls":3},"Stockpiling with Intent to Reclaim",null,{"$f":"IF('Step 3-Air-Conditioning Units'!$E$13=0,\"\", $E$13*('Step 3-Air-Conditioning Units'!F34/'Step 3-Air-Conditioning Units'!$E$13))","v":""},"(lb)",{"$f":"IF('Step 3-Air-Conditioning Units'!H34=\"\",\"\",'Step 3-Air-Conditioning Units'!H34)","v":""}]
[{"$nulls":3},"Destroyed",null,{"$f":"IF('Step 3-Air-Conditioning Units'!$E$13=0,\"\", $E$13*('Step 3-Air-Conditioning Units'!F35/'Step 3-Air-Conditioning Units'!$E$13))","v":""},"(lb)",{"$f":"IF('Step 3-Air-Conditioning Units'!H35=\"\",\"\",'Step 3-Air-Conditioning Units'!H35)","v":""}]
[{"$nulls":3},"Stockpiling with Intent to Destroy",null,{"$f":"IF('Step 3-Air-Conditioning Units'!$E$13=0,\"\", $E$13*('Step 3-Air-Conditioning Units'!F36/'Step 3-Air-Conditioning Units'!$E$13))","v":""},"(lb)",{"$f":"IF('Step 3-Air-Conditioning Units'!H36=\"\",\"\",'Step 3-Air-Conditioning Units'!H36)","v":""}]
[null,null,"Used Oil","Recycled",null,{"$f":"IF('Step 3-Air-Conditioning Units'!$D$8=0,\"\", $D$8*('Step 3-Air-Conditioning Units'!F37/'Step 3-Air-Conditioning Units'!$D$8))","v":""},"(gal)",{"$f":"IF('Step 3-Air-Conditioning Units'!H37=\"\",\"\",'Step 3-Air-Conditioning Units'!H37)","v":""}]
[{"$nulls":3},"Disposed",null,{"$f":"IF('Step 3-Air-Conditioning Units'!$D$8=0,\"\", $D$8*('Step 3-Air-Conditioning Units'!F38/'Step 3-Air-Conditioning Units'!$D$8))","v":""},"(gal)",{"$f":"IF('Step 3-Air-Conditioning Units'!H38=\"\",\"\",'Step 3-Air-Conditioning Units'!H38)","v":""}]
[null,null,"Metal","Ferrous Metal Recycled",null,{"$f":"IF('Step 3-Air-Conditioning Units'!$D$8=0,\"\", $D$8*('Step 3-Air-Conditioning Units'!F39/'Step 3-Air-Conditioning Units'!$D$8))","v":""},"(lb)",{"$f":"IF('Step 3-Air-Conditioning Units'!H39=\"\",\"\",'Step 3-Air-Conditioning Units'!H39)","v":""}]
[{"$nulls":3},"Non-Ferrous Metal Recycled",null,{"$f":"IF('Step 3-Air-Conditioning Units'!$D$8=0,\"\", $D$8*('Step 3-Air-Conditioning Units'!F40/'Step 3-Air-Conditioning Units'!$D$8))","v":""},"(lb)",{"$f":"IF('Step 3-Air-Conditioning Units'!H40=\"\",\"\",'Step 3-Air-Conditioning Units'!H40)","v":""}]
[null,null,"Plastic","Recycled",null,{"$f":"IF('Step 3-Air-Conditioning Units'!$D$8=0,\"\", $D$8*('Step 3-Air-Conditioning Units'!F41/'Step 3-Air-Conditioning Units'!$D$8))","v":""},"(lb)",{"$f":"IF('Step 3-Air-Conditioning Units'!H41=\"\",\"\",'Step 3-Air-Conditioning Units'!H41)","v":""}]
[null,null,"PCB-Containing Capacitors","Destroyed",null,{"$f":"IF('Step 3-Air-Conditioning Units'!$D$8=0,\"\", $D$8*('Step 3-Air-Conditioning Units'!F42/'Step 3-Air-Conditioning Units'!$D$8))","v":""},"(capacitors)",{"$f":"IF('Step 3-Air-Conditioning Units'!H42=\"\",\"\",'Step 3-Air-Conditioning Units'!H42)","v":""}]
[]
[null,null,"Energy Savings"]
[null,null,{"$f":"'Step 3-Air-Conditioning Units'!C45:H45","v":"Please complete the table below if your program provides an incentive (e.g., financial) to encourage the disposal (i.e., without replacement) of old, working refrigerated appliances. The estimates provided should be consistent with that specified in your jurisdiction's deemed savings database, technical reference manual (TRM), or third-party ARP evaluation, as appropriate."}]
[]
[null,null,{"$f":"'Step 3-Air-Conditioning Units'!C47:D47","v":"Average Number of Remaining Years of Useful Life"},null,{"$f":"'Step 3-Air-Conditioning Units'!E47:F47","v":{"v":0,"d":"0.0"}}]
[null,null,{"$f":"'Step 3-Air-Conditioning Units'!C48:D48","v":"Average Energy Consumed/Year/Unit (kWh)"},null,{"$f":"'Step 3-Air-Conditioning Units'!E48:F48","v":{"v":0,"d":"0.0"}}]
[null,null,{"$f":"'Step 3-Air-Conditioning Units'!C49:D49","v":"Average Energy Cost for Residential Consumers ($/kWh) \n[please provide the average cost during the current program period]"},null,{"$f":"'Step 3-Air-Conditioning Units'!E49:F49","v":{"v":0,"d":"$0.00"}}]
[]
[null,null,"Additional Comments:",{"$f":"IFERROR('Step 3-Air-Conditioning Units'!D51,\"\")","v":0}]

{"sheet":"Step 3-Air-Conditioning Units","index":8,"n_rows":59,"n_cols":10,"rows_kept":59,"merged":[[1,8,1,9],[3,2,3,9],[5,2,5,9],[9,6,9,8],[10,6,14,8],[14,9,16,10],[17,2,17,5],[17,7,17,10],[18,2,18,7],[19,2,20,2],[19,3,20,4],[19,5,20,6],[19,7,20,7],[21,2,35,2],[22,3,22,4],[23,3,23,4],[24,3,24,4],[25,3,25,4],[27,3,27,4],[28,3,28,4],[29,3,29,4],[30,3,30,4],[32,3,32,4],[33,3,33,4],[34,3,34,4],[35,3,35,4],[36,2,37,2],[36,3,36,4],[37,3,37,4],[38,2,39,2],[38,3,38,4],[39,3,39,4],[40,3,40,4],[44,2,44,7],[44,8,44,10],[46,2,46,3],[46,4,46,5],[47,2,47,3],[47,4,47,5],[48,2,48,3],[48,4,48,5],[50,3,57,9]]}
[]
[]
[null,null,"Step 3: Activity Data on Air-Conditioning Units",{"$nulls":3},{"$f":"IF('Step 1-Contact and Program Info'!D7=0, \" \",'Step 1-Contact and Program Info'!D7)","v":" "},{"$f":"IF('Step 1-Contact and Program Info'!J7=\"\",\"\",'Step 1-Contact and Program Info'!J7)","v":"MM/DD/YYYY"},{"$f":"IF(H3=\"\",\"\",\"to\")","v":"to"},{"$f":"IF('Step 1-Contact and Program Info'!L7=\"\",\"\",'Step 1-Contact and Program Info'!L7)","v":"MM/DD/YYYY"}]
[null,null,"Instructions: All partners should complete Tables A and B. If your program provides an incentive (e.g., financial) to encourage the disposal of old, \nworking refrigerated appliances, please also complete Table C. When populating cells, please use the units provided; do not add text to specify units. This form only recognizes numbers. "]
[null,null,"A. Units Processed"]
[null,null,"Please complete the gray cells below. Enter the total number of units processed by your program by refrigerant type in column D. Specify the number of units processed with refrigerant recovery in cells E11 to E14.  Also, provide the average age of appliances collected (cell D9), and whether the information on refrigerant types is based on assumptions or data (cells F11 to F14).  If any of the units reported in column D were jointly processed/administered with another RAD Utility, Retailer, Manufacturer, State/Local Government, or Waste Removal Service Provider Partner, please indicate the number of these units in Step 4 - Units Jointly Processed; the units reported in this table should be inclusive of the units reported in Step 4. If you wish to provide additional information (e.g., regarding types of refrigerants or insulating materials not listed below) or highlight uncertainties in your reporting, please do so in the “Comments” box."]
[]
[null,null,"Total Number of Units Processed"]
[null,null,"Average Age of Appliances Collected (yrs)"]
[null,null,"Refrigerant Type","Total Number of Units Processed ","Number of Units Processed with Refrigerant Recovery","Refrigerant Type Based On: ","Comments:"]
[null,null,"HCFC-22"]
[null,null,"R-407C"]
[null,null,"R-410A"]
[null,null,"Other"]
[null,null,"Total",{"$f":"SUM(D11:D14)","v":0},{"$f":"SUM(E11:E14)","v":0},{"$nulls":4},{"$f":"IF(AND(D15<>D8,NOT(AND(ISBLANK(D11),ISBLANK(D12), ISBLANK(D13),ISBLANK(D14)))),\"<-- Ensure that total across all refrigerant types (cell D15) matches total number of units entered above (cell D8).\",\"\")","v":""}]
[]
[null,null,"B. Fate and Quantity of Substances Recovered"]
[]
[null,null,"Please complete the table below to provide the total amount of appliance components recovered by your program during the current reporting period. If any substances recovered during the current reporting period are currently in storage, please report on the intended fate of the substance (e.g., stockpiling with intent to reclaim/destroy). Refer back to the Instructions & Definitions tab for definitions of the fates for each component.  For any fields that do not apply to your program, please enter \"0\" under \"Total Amount\" in column F.  For every non-zero value entered in column F, indicate whether the quantity specified is based on actual measurements or on assumptions by selecting the appropriate option in column H. If you wish to clarify uncertainties about the data provided, or wish to provide further information, please use the space for “Additional Comments” at the bottom of this worksheet."]
[null,null,"Appliance Component","Fate of Component",null,"Total Amount",null,"Total Amount Based On: "]
[]
[null,null,"Refrigerant (including that recovered from compressor oil)","HCFC-22"]
[{"$nulls":3},"Reclaimed",null,null,"(lb)"]
[{"$nulls":3},"Stockpiling with Intent to Reclaim",null,null,"(lb)"]
[{"$nulls":3},"Destroyed",null,null,"(lb)"]
[{"$nulls":3},"Stockpiling with Intent to Destroy",null,null,"(lb)"]
[{"$nulls":3},"R-407C "]
[{"$nulls":3},"Reclaimed",null,null,"(lb)"]
[{"$nulls":3},"Stockpiling with Intent to Reclaim",null,null,"(lb)"]
[{"$nulls":3},"Destroyed",null,null,"(lb)"]
[{"$nulls":3},"Stockpiling with Intent to Destroy",null,null,"(lb)"]
[{"$nulls":3},"R-410A "]
[{"$nulls":3},"Reclaimed",null,null,"(lb)"]
[{"$nulls":3},"Stockpiling with Intent to Reclaim",null,null,"(lb)"]
[{"$nulls":3},"Destroyed",null,null,"(lb)"]
[{"$nulls":3},"Stockpiling with Intent to Destroy",null,null,"(lb)"]
[null,null,"Used Oil","Recycled",null,null,"(gal)"]
[{"$nulls":3},"Disposed",null,null,"(gal)"]
[null,null,"Metal","Ferrous Metal Recycled",null,null,"(lb)"]
[{"$nulls":3},"Non-Ferrous Metal Recycled",null,null,"(lb)"]
[null,null,"Plastic","Recycled",null,null,"(lb)"]
[null,null,"PCB-Containing Capacitors","Destroyed",null,null,"(# of capacitors)"]
[]
[null,null,"C. Energy Savings"]
[null,null,"Please complete the table below if your program provides an incentive (e.g., financial) to encourage the disposal (i.e., without replacement) of old, working refrigerated appliances. The estimates provided should be consistent with that specified in your jurisdiction's deemed savings database, technical reference manual (TRM), or third-party ARP evaluation, as appropriate."]
[]
[null,null,"Average Number of Remaining Years of Useful Life"]
[null,null,"Average Energy Consumed/Year/Unit (kWh)"]
[null,null,"Average Energy Cost for Residential Consumers ($/kWh) \n[please provide the average cost during the current program period]"]
[]
[null,null,"Additional Comments:"]
{"$rows_empty":7}
[null,null,{"$f":"'Instructions & Definitions'!C57","v":"EPA Form Number: 5900-482"}]

{"sheet":"Step 3-Dehumidifiers","index":9,"n_rows":71,"n_cols":11,"rows_kept":71,"merged":[[1,8,1,10],[3,2,3,10],[5,2,5,9],[9,6,9,8],[10,6,16,8],[16,9,18,11],[19,2,19,5],[19,7,19,11],[20,2,20,7],[21,2,22,2],[21,3,22,4],[21,5,22,6],[21,7,22,7],[23,2,47,2],[25,3,25,4],[27,3,27,4],[30,3,30,4],[32,3,32,4],[35,3,35,4],[37,3,37,4],[40,3,40,4],[42,3,42,4],[45,3,45,4],[47,3,47,4],[48,2,49,2],[48,3,48,4],[49,3,49,4],[50,2,51,2],[50,3,50,4],[51,3,51,4],[52,3,52,4],[56,2,56,7],[56,8,56,11],[58,4,58,5],[59,4,59,5],[60,2,60,3],[60,4,60,5],[62,3,69,10]]}
[]
[]
[null,null,"Step 3: Activity Data on Dehumidifiers",{"$nulls":4},{"$f":"IF('Step 1-Contact and Program Info'!D7=0, \" \",'Step 1-Contact and Program Info'!D7)","v":" "},{"$f":"IF('Step 1-Contact and Program Info'!J7=\"\",\"\",'Step 1-Contact and Program Info'!J7)","v":"MM/DD/YYYY"},{"$f":"IF(I3=\"\",\"\",\"to\")","v":"to"},{"$f":"IF('Step 1-Contact and Program Info'!L7=\"\",\"\",'Step 1-Contact and Program Info'!L7)","v":"MM/DD/YYYY"}]
[null,null,"Instructions: All partners should complete Tables A and B. If your program provides an incentive (e.g., financial) to encourage the disposal of old, working refrigerated appliances, please also complete Table C. When populating cells, please use the units provided; do not add text to specify units. This form only recognizes numbers. "]
[null,null,"A. Units Processed"]
[null,null,"Please complete the gray cells below. Enter the total number of units processed by your program by refrigerant type in column D. Specify the number of units processed with refrigerant recovery in cells E11 to E16. Also, provide the average age of appliances collected (cell D9), and whether the information on refrigerant types is based on assumptions or data (cells F11 to F16). If any of the units reported in column D were jointly processed/administered with another RAD Utility, Retailer, Manufacturer, State/Local Government, or Waste Removal Service Provider Partner, please indicate the number of these units in Step 4 - Units Jointly Processed; the units reported in this table should be inclusive of the units reported in Step 4. If you wish to provide additional information (e.g., regarding types of refrigerants or insulating materials not listed below) or highlight uncertainties in your reporting, please do so in the “Comments” box."]
[]
[null,null,"Total Number of Units Processed"]
[null,null,"Average Age of Appliances Collected (yrs)"]
[null,null,"Refrigerant Type","Total Number of Units Processed ","Number of Units Processed with Refrigerant Recovery","Refrigerant Type Based On: ","Comments:"]
[null,null,"CFC-12"]
[null,null,"HCFC-22"]
[null,null,"HFC-134a"]
[null,null,"R-500"]
[null,null,"R-410A"]
[null,null,"Other"]
[null,null,"Total",{"$f":"SUM(D11:D16)","v":0},{"$f":"SUM(E11:E16)","v":0},{"$nulls":4},{"$f":"IF(AND(D17<>D8,NOT(AND(ISBLANK(D11),ISBLANK(D12), ISBLANK(D13),ISBLANK(D14),ISBLANK(D15),ISBLANK(D16)))),\"<-- Ensure that total across all refrigerant types (cell D17) matches total number of units entered above (cell D8).\",\"\")","v":""}]
[]
[null,null,"B. Fate and Quantity of Substances Recovered"]
[]
[null,null,"Please complete the table below to provide the total amount of appliance components recovered by your program during the current reporting period.  If any substances recovered during the current reporting period are currently in storage, please report on the intended fate of the substance (e.g., stockpiling with intent to reclaim/destroy). Refer back to the Instructions & Definitions tab for definitions of the fates for each component.  For any fields that do not apply to your program, please enter \"0\" under \"Total Amount\" in column F.  For every non-zero value entered in column F, indicate whether the quantity specified is based on actual measurements or on assumptions by selecting the appropriate option in column H. If you wish to clarify uncertainties about the data provided, or wish to provide further information, please use the space for “Additional Comments” at the bottom of this worksheet."]
[null,null,"Appliance Component","Fate of Component",null,"Total Amount",null,"Total Amount Based On: "]
[]
[null,null,"Refrigerant (including that recovered from compressor oil)","CFC-12"]
[{"$nulls":3},"Reclaimed",null,null,"(lb)"]
[{"$nulls":3},"Stockpiling with Intent to Reclaim",null,null,"(lb)"]
[{"$nulls":3},"Destroyed",null,null,"(lb)"]
[{"$nulls":3},"Stockpiling with Intent to Destroy",null,null,"(lb)"]
[{"$nulls":3},"HCFC-22 "]
[{"$nulls":3},"Reclaimed",null,null,"(lb)"]
[{"$nulls":3},"Stockpiling with Intent to Reclaim",null,null,"(lb)"]
[{"$nulls":3},"Destroyed",null,null,"(lb)"]
[{"$nulls":3},"Stockpiling with Intent to Destroy",null,null,"(lb)"]
[{"$nulls":3},"HFC-134a"]
[{"$nulls":3},"Reclaimed",null,null,"(lb)"]
[{"$nulls":3},"Stockpiling with Intent to Reclaim",null,null,"(lb)"]
[{"$nulls":3},"Destroyed",null,null,"(lb)"]
[{"$nulls":3},"Stockpiling with Intent to Destroy",null,null,"(lb)"]
[{"$nulls":3},"R-500"]
[{"$nulls":3},"Reclaimed",null,null,"(lb)"]
[{"$nulls":3},"Stockpiling with Intent to Reclaim",null,null,"(lb)"]
[{"$nulls":3},"Destroyed",null,null,"(lb)"]
[{"$nulls":3},"Stockpiling with Intent to Destroy",null,null,"(lb)"]
[{"$nulls":3},"R-410A "]
[{"$nulls":3},"Reclaimed",null,null,"(lb)"]
[{"$nulls":3},"Stockpiling with Intent to Reclaim",null,null,"(lb)"]
[{"$nulls":3},"Destroyed",null,null,"(lb)"]
[{"$nulls":3},"Stockpiling with Intent to Destroy",null,null,"(lb)"]
[null,null,"Used Oil","Recycled",null,null,"(gal)"]
[{"$nulls":3},"Disposed",null,null,"(gal)"]
[null,null,"Metal","Ferrous Metal Recycled",null,null,"(lb)"]
[{"$nulls":3},"Non-Ferrous Metal Recycled",null,null,"(lb)"]
[null,null,"Plastic","Recycled",null,null,"(lb)"]
[null,null,"PCB-Containing Capacitors","Destroyed",null,null,"(# of capacitors)"]
[]
[null,null,"C. Energy Savings"]
[null,null,"Please complete the table below if your program provides an incentive (e.g., financial) to encourage the disposal (i.e., without replacement) of old, working refrigerated appliances. The estimates provided should be consistent with that specified in your jurisdiction's deemed savings database, technical reference manual (TRM), or third-party ARP evaluation, as appropriate."]
[]
[null,null,"Average Number of Remaining Years of Useful Life"]
[null,null,"Average Energy Consumed/Year/Unit (kWh)"]
[null,null,"Average Energy Cost for Residential Consumers ($/kWh) \n[please provide the average cost during the current program period]"]
[]
[null,null,"Additional Comments:"]
{"$rows_empty":7}
[null,null,{"$f":"'Instructions & Definitions'!C57","v":"EPA Form Number: 5900-482"}]

{"sheet":"Step 3-Dehumidifiers (B)","index":10,"n_rows":63,"n_cols":10,"rows_kept":63,"hidden":true,"merged":[[3,2,3,8],[5,2,5,9],[9,6,9,8],[10,6,15,8],[18,2,18,5],[18,7,18,10],[19,2,19,7],[20,2,21,2],[20,3,21,4],[20,5,21,6],[20,7,21,7],[22,2,46,2],[24,3,24,4],[26,3,26,4],[29,3,29,4],[31,3,31,4],[34,3,34,4],[36,3,36,4],[39,3,39,4],[41,3,41,4],[44,3,44,4],[46,3,46,4],[47,2,48,2],[49,2,50,2],[55,2,55,10],[57,2,57,3],[57,4,57,5],[58,2,58,3],[58,4,58,5],[59,2,60,3],[59,4,60,5],[62,3,69,9]]}
[]
[]
[null,null,{"$f":"'Step 3-Dehumidifiers'!C3","v":"Step 3: Activity Data on Dehumidifiers"},{"$nulls":3},{"$f":"IF('Step 1-Contact and Program Info'!D7=0, \" \",'Step 1-Contact and Program Info'!D7)","v":" "},{"$f":"'Step 1-Contact and Program Info'!J7","v":"MM/DD/YYYY"},"to",{"$f":"'Step 1-Contact and Program Info'!L7","v":"MM/DD/YYYY"}]
[null,null,{"$f":"'Step 3-Dehumidifiers'!C4:K4","v":"Instructions: All partners should complete Tables A and B. If your program provides an incentive (e.g., financial) to encourage the disposal of old, working refrigerated appliances, please also complete Table C. When populating cells, please use the units provided; do not add text to specify units. This form only recognizes numbers. "}]
[null,null,"Units Processed"]
[null,null,{"$f":"'Step 3-Dehumidifiers'!C6:J6","v":"Please complete the gray cells below. Enter the total number of units processed by your program by refrigerant type in column D. Specify the number of units processed with refrigerant recovery in cells E11 to E16. Also, provide the average age of appliances collected (cell D9), and whether the information on refrigerant types is based on assumptions or data (cells F11 to F16). If any of the units reported in column D were jointly processed/administered with another RAD Utility, Retailer, Manufacturer, State/Local Government, or Waste Removal Service Provider Partner, please indicate the number of these units in Step 4 - Units Jointly Processed; the units reported in this table should be inclusive of the units reported in Step 4. If you wish to provide additional information (e.g., regarding types of refrigerants or insulating materials not listed below) or highlight uncertainties in your reporting, please do so in the “Comments” box."}]
[]
[null,null,"Total Number of Units Processed (excluding units processed by other RAD utilities)",{"$f":"'Step 3-Dehumidifiers'!D8-'Step 4-Units Jointly Processed'!AH55","v":0}]
[null,null,"Average Age of Appliances Collected (yrs)",{"$f":"'Step 3-Dehumidifiers'!D9","v":{"v":0,"d":"0.0"}}]
[null,null,"Refrigerant Type","Total Number of Units Processed ","Number of Units Processed with Refrigerant Recovery","Based On: ","Comments:"]
[null,null,"CFC-12",{"$f":"'Step 3-Dehumidifiers'!D11-'Step 4-Units Jointly Processed'!AH57","v":0},{"$f":"'Step 3-Dehumidifiers'!E11-'Step 4-Units Jointly Processed'!AH57","v":0},{"$f":"'Step 3-Dehumidifiers'!F11","v":0},{"$f":"'Step 3-Dehumidifiers'!G11:I17","v":0}]
[null,null,"HCFC-22",{"$f":"'Step 3-Dehumidifiers'!D12-'Step 4-Units Jointly Processed'!AH58","v":0},{"$f":"'Step 3-Dehumidifiers'!E12-'Step 4-Units Jointly Processed'!AH58","v":0},{"$f":"'Step 3-Dehumidifiers'!F12","v":0}]
[null,null,"HFC-134a",{"$f":"'Step 3-Dehumidifiers'!D13-'Step 4-Units Jointly Processed'!AH59","v":0},{"$f":"'Step 3-Dehumidifiers'!E13-'Step 4-Units Jointly Processed'!AH59","v":0},{"$f":"'Step 3-Dehumidifiers'!F13","v":0}]
[null,null,"R-500",{"$f":"'Step 3-Dehumidifiers'!D14-'Step 4-Units Jointly Processed'!AH60","v":0},{"$f":"'Step 3-Dehumidifiers'!E14-'Step 4-Units Jointly Processed'!AH60","v":0},{"$f":"'Step 3-Dehumidifiers'!F14","v":0}]
[null,null,"R-410A",{"$f":"'Step 3-Dehumidifiers'!D15-'Step 4-Units Jointly Processed'!AH61","v":0},{"$f":"'Step 3-Dehumidifiers'!E15-'Step 4-Units Jointly Processed'!AH61","v":0},{"$f":"'Step 3-Dehumidifiers'!F15","v":0}]
[null,null,"Other",{"$f":"'Step 3-Dehumidifiers'!D16-'Step 4-Units Jointly Processed'!AH62","v":0},{"$f":"'Step 3-Dehumidifiers'!E16-'Step 4-Units Jointly Processed'!AH62","v":0},{"$f":"'Step 3-Dehumidifiers'!F16","v":0}]
[]
[null,null,"Fate and Quantity of Substances Recovered"]
[]
[null,null,{"$f":"'Step 3-Dehumidifiers'!C21:H21","v":"Please complete the table below to provide the total amount of appliance components recovered by your program during the current reporting period.  If any substances recovered during the current reporting period are currently in storage, please report on the intended fate of the substance (e.g., stockpiling with intent to reclaim/destroy). Refer back to the Instructions & Definitions tab for definitions of the fates for each component.  For any fields that do not apply to your program, please enter \"0\" under \"Total Amount\" in column F.  For every non-zero value entered in column F, indicate whether the quantity specified is based on actual measurements or on assumptions by selecting the appropriate option in column H. If you wish to clarify uncertainties about the data provided, or wish to provide further information, please use the space for “Additional Comments” at the bottom of this worksheet."}]
[null,null,"Appliance Component","Fate of Component",null,"Total Amount",null,"Total Amount Based On: "]
[]
[null,null,"Refrigerant (including that recovered from compressor oil)","CFC-12"]
[{"$nulls":3},"Reclaimed",null,{"$f":"IF('Step 3-Dehumidifiers'!$E$11=0,\"\", $E$11*('Step 3-Dehumidifiers'!F25/'Step 3-Dehumidifiers'!$E$11))","v":""},"(lb)",{"$f":"IF('Step 3-Dehumidifiers'!H25=\"\",\"\",'Step 3-Dehumidifiers'!H25)","v":""}]
[{"$nulls":3},"Stockpiling with Intent to Reclaim",null,{"$f":"IF('Step 3-Dehumidifiers'!$E$11=0,\"\", $E$11*('Step 3-Dehumidifiers'!F26/'Step 3-Dehumidifiers'!$E$11))","v":""},"(lb)",{"$f":"IF('Step 3-Dehumidifiers'!H26=\"\",\"\",'Step 3-Dehumidifiers'!H26)","v":""}]
[{"$nulls":3},"Destroyed",null,{"$f":"IF('Step 3-Dehumidifiers'!$E$11=0,\"\", $E$11*('Step 3-Dehumidifiers'!F27/'Step 3-Dehumidifiers'!$E$11))","v":""},"(lb)",{"$f":"IF('Step 3-Dehumidifiers'!H27=\"\",\"\",'Step 3-Dehumidifiers'!H27)","v":""}]
[{"$nulls":3},"Stockpiling with Intent to Destroy",null,{"$f":"IF('Step 3-Dehumidifiers'!$E$11=0,\"\", $E$11*('Step 3-Dehumidifiers'!F28/'Step 3-Dehumidifiers'!$E$11))","v":""},"(lb)",{"$f":"IF('Step 3-Dehumidifiers'!H28=\"\",\"\",'Step 3-Dehumidifiers'!H28)","v":""}]
[{"$nulls":3},"HCFC-22 "]
[{"$nulls":3},"Reclaimed",null,{"$f":"IF('Step 3-Dehumidifiers'!$E$12=0,\"\", $E$12*('Step 3-Dehumidifiers'!F30/'Step 3-Dehumidifiers'!$E$12))","v":""},"(lb)",{"$f":"IF('Step 3-Dehumidifiers'!H30=\"\",\"\",'Step 3-Dehumidifiers'!H30)","v":""}]
[{"$nulls":3},"Stockpiling with Intent to Reclaim",null,{"$f":"IF('Step 3-Dehumidifiers'!$E$12=0,\"\", $E$12*('Step 3-Dehumidifiers'!F31/'Step 3-Dehumidifiers'!$E$12))","v":""},"(lb)",{"$f":"IF('Step 3-Dehumidifiers'!H31=\"\",\"\",'Step 3-Dehumidifiers'!H31)","v":""}]
[{"$nulls":3},"Destroyed",null,{"$f":"IF('Step 3-Dehumidifiers'!$E$12=0,\"\", $E$12*('Step 3-Dehumidifiers'!F32/'Step 3-Dehumidifiers'!$E$12))","v":""},"(lb)",{"$f":"IF('Step 3-Dehumidifiers'!H32=\"\",\"\",'Step 3-Dehumidifiers'!H32)","v":""}]
[{"$nulls":3},"Stockpiling with Intent to Destroy",null,{"$f":"IF('Step 3-Dehumidifiers'!$E$12=0,\"\", $E$12*('Step 3-Dehumidifiers'!F33/'Step 3-Dehumidifiers'!$E$12))","v":""},"(lb)",{"$f":"IF('Step 3-Dehumidifiers'!H33=\"\",\"\",'Step 3-Dehumidifiers'!H33)","v":""}]
[{"$nulls":3},"HFC-134a"]
[{"$nulls":3},"Reclaimed",null,{"$f":"IF('Step 3-Dehumidifiers'!$E$13=0,\"\", $E$13*('Step 3-Dehumidifiers'!F35/'Step 3-Dehumidifiers'!$E$13))","v":""},"(lb)",{"$f":"IF('Step 3-Dehumidifiers'!H35=\"\",\"\",'Step 3-Dehumidifiers'!H35)","v":""}]
[{"$nulls":3},"Stockpiling with Intent to Reclaim",null,{"$f":"IF('Step 3-Dehumidifiers'!$E$13=0,\"\", $E$13*('Step 3-Dehumidifiers'!F36/'Step 3-Dehumidifiers'!$E$13))","v":""},"(lb)",{"$f":"IF('Step 3-Dehumidifiers'!H36=\"\",\"\",'Step 3-Dehumidifiers'!H36)","v":""}]
[{"$nulls":3},"Destroyed",null,{"$f":"IF('Step 3-Dehumidifiers'!$E$13=0,\"\", $E$13*('Step 3-Dehumidifiers'!F37/'Step 3-Dehumidifiers'!$E$13))","v":""},"(lb)",{"$f":"IF('Step 3-Dehumidifiers'!H37=\"\",\"\",'Step 3-Dehumidifiers'!H37)","v":""}]
[{"$nulls":3},"Stockpiling with Intent to Destroy",null,{"$f":"IF('Step 3-Dehumidifiers'!$E$13=0,\"\", $E$13*('Step 3-Dehumidifiers'!F38/'Step 3-Dehumidifiers'!$E$13))","v":""},"(lb)",{"$f":"IF('Step 3-Dehumidifiers'!H38=\"\",\"\",'Step 3-Dehumidifiers'!H38)","v":""}]
[{"$nulls":3},"R-500"]
[{"$nulls":3},"Reclaimed",null,{"$f":"IF('Step 3-Dehumidifiers'!$E$14=0,\"\", $E$14*('Step 3-Dehumidifiers'!F40/'Step 3-Dehumidifiers'!$E$14))","v":""},"(lb)",{"$f":"IF('Step 3-Dehumidifiers'!H40=\"\",\"\",'Step 3-Dehumidifiers'!H40)","v":""}]
[{"$nulls":3},"Stockpiling with Intent to Reclaim",null,{"$f":"IF('Step 3-Dehumidifiers'!$E$14=0,\"\", $E$14*('Step 3-Dehumidifiers'!F41/'Step 3-Dehumidifiers'!$E$14))","v":""},"(lb)",{"$f":"IF('Step 3-Dehumidifiers'!H41=\"\",\"\",'Step 3-Dehumidifiers'!H41)","v":""}]
[{"$nulls":3},"Destroyed",null,{"$f":"IF('Step 3-Dehumidifiers'!$E$14=0,\"\", $E$14*('Step 3-Dehumidifiers'!F42/'Step 3-Dehumidifiers'!$E$14))","v":""},"(lb)",{"$f":"IF('Step 3-Dehumidifiers'!H42=\"\",\"\",'Step 3-Dehumidifiers'!H42)","v":""}]
[{"$nulls":3},"Stockpiling with Intent to Destroy",null,{"$f":"IF('Step 3-Dehumidifiers'!$E$14=0,\"\", $E$14*('Step 3-Dehumidifiers'!F43/'Step 3-Dehumidifiers'!$E$14))","v":""},"(lb)",{"$f":"IF('Step 3-Dehumidifiers'!H43=\"\",\"\",'Step 3-Dehumidifiers'!H43)","v":""}]
[{"$nulls":3},"R-410A "]
[{"$nulls":3},"Reclaimed",null,{"$f":"IF('Step 3-Dehumidifiers'!$E$15=0,\"\", $E$15*('Step 3-Dehumidifiers'!F45/'Step 3-Dehumidifiers'!$E$15))","v":""},"(lb)",{"$f":"IF('Step 3-Dehumidifiers'!H45=\"\",\"\",'Step 3-Dehumidifiers'!H45)","v":""}]
[{"$nulls":3},"Stockpiling with Intent to Reclaim",null,{"$f":"IF('Step 3-Dehumidifiers'!$E$15=0,\"\", $E$15*('Step 3-Dehumidifiers'!F46/'Step 3-Dehumidifiers'!$E$15))","v":""},"(lb)",{"$f":"IF('Step 3-Dehumidifiers'!H46=\"\",\"\",'Step 3-Dehumidifiers'!H46)","v":""}]
[{"$nulls":3},"Destroyed",null,{"$f":"IF('Step 3-Dehumidifiers'!$E$15=0,\"\", $E$15*('Step 3-Dehumidifiers'!F47/'Step 3-Dehumidifiers'!$E$15))","v":""},"(lb)",{"$f":"IF('Step 3-Dehumidifiers'!H47=\"\",\"\",'Step 3-Dehumidifiers'!H47)","v":""}]
[{"$nulls":3},"Stockpiling with Intent to Destroy",null,{"$f":"IF('Step 3-Dehumidifiers'!$E$15=0,\"\", $E$15*('Step 3-Dehumidifiers'!F48/'Step 3-Dehumidifiers'!$E$15))","v":""},"(lb)",{"$f":"IF('Step 3-Dehumidifiers'!H48=\"\",\"\",'Step 3-Dehumidifiers'!H48)","v":""}]
[null,null,"Used Oil","Recycled",null,{"$f":"IF('Step 3-Dehumidifiers'!$D$8=0,\"\", $D$8*('Step 3-Dehumidifiers'!$F$49/'Step 3-Dehumidifiers'!$D$8))","v":""},"(gal)",{"$f":"IF('Step 3-Dehumidifiers'!H49=\"\",\"\",'Step 3-Dehumidifiers'!H49)","v":""}]
[{"$nulls":3},"Disposed",null,{"$f":"IF('Step 3-Dehumidifiers'!$D$8=0,\"\", $D$8*('Step 3-Dehumidifiers'!$F$50/'Step 3-Dehumidifiers'!$D$8))","v":""},"(gal)",{"$f":"IF('Step 3-Dehumidifiers'!H50=\"\",\"\",'Step 3-Dehumidifiers'!H50)","v":""}]
[null,null,"Metal","Ferrous Metal Recycled",null,{"$f":"IF('Step 3-Dehumidifiers'!$D$8=0,\"\", $D$8*('Step 3-Dehumidifiers'!$F$51/'Step 3-Dehumidifiers'!$D$8))","v":""},"(lb)",{"$f":"IF('Step 3-Dehumidifiers'!H51=\"\",\"\",'Step 3-Dehumidifiers'!H51)","v":""}]
[{"$nulls":3},"Non-Ferrous Metal Recycled",null,{"$f":"IF('Step 3-Dehumidifiers'!$D$8=0,\"\", $D$8*('Step 3-Dehumidifiers'!$F$52/'Step 3-Dehumidifiers'!$D$8))","v":""},"(lb)",{"$f":"IF('Step 3-Dehumidifiers'!H52=\"\",\"\",'Step 3-Dehumidifiers'!H52)","v":""}]
[null,null,"Plastic","Recycled",null,{"$f":"IF('Step 3-Dehumidifiers'!$D$8=0,\"\", $D$8*('Step 3-Dehumidifiers'!$F$53/'Step 3-Dehumidifiers'!$D$8))","v":""},"(lb)",{"$f":"IF('Step 3-Dehumidifiers'!H53=\"\",\"\",'Step 3-Dehumidifiers'!H53)","v":""}]
[null,null,"PCB-Containing Capacitors","Destroyed",null,{"$f":"IF('Step 3-Dehumidifiers'!$D$8=0,\"\", $D$8*('Step 3-Dehumidifiers'!$F$54/'Step 3-Dehumidifiers'!$D$8))","v":""},"(capacitors)",{"$f":"IF('Step 3-Dehumidifiers'!H54=\"\",\"\",'Step 3-Dehumidifiers'!H54)","v":""}]
[]
[null,null,"Energy Savings"]
[null,null,{"$f":"'Step 3-Dehumidifiers'!C57:H57","v":"Please complete the table below if your program provides an incentive (e.g., financial) to encourage the disposal (i.e., without replacement) of old, working refrigerated appliances. The estimates provided should be consistent with that specified in your jurisdiction's deemed savings database, technical reference manual (TRM), or third-party ARP evaluation, as appropriate."}]
[]
[null,null,"Average Number of Remaining Years of Useful Life",null,{"$f":"'Step 3-Dehumidifiers'!E59:F59","v":{"v":0,"d":"0.0"}}]
[null,null,"Average Energy Consumed/Year/Unit (kWh)",null,{"$f":"'Step 3-Dehumidifiers'!E60:F60","v":{"v":0,"d":"0.0"}}]
[null,null,"Average Energy Cost for Residential Consumers ($/kWh)  [please provide the average cost during the current program period]",null,{"$f":"'Step 3-Dehumidifiers'!E61:F61","v":{"v":0,"d":"$0.00"}}]
[]
[]
[null,null,"Additional Comments:",{"$f":"'Step 3-Dehumidifiers'!D63:K70","v":0}]

{"sheet":"Step 4-Units Jointly Processed","index":11,"n_rows":75,"n_cols":36,"rows_kept":75,"merged":[[1,34,1,36],[2,2,3,5],[4,2,5,35],[6,7,6,33],[11,2,11,33],[15,34,24,36],[16,2,16,33],[25,34,26,36],[28,2,28,33],[33,34,42,36],[34,2,34,33],[43,34,44,36],[46,2,46,33],[51,34,53,36],[55,2,55,33],[62,34,65,36],[66,3,73,35]]}
[]
[]
[null,null,"Step 4: Units Handled Jointly by Your Organization and Another RAD Partner",{"$nulls":4},{"$f":"IF('Step 1-Contact and Program Info'!D7=0, \" \",'Step 1-Contact and Program Info'!D7)","v":" "},{"$nulls":25},{"$f":"IF('Step 1-Contact and Program Info'!J7=\"\",\"\",'Step 1-Contact and Program Info'!J7)","v":"MM/DD/YYYY"},{"$f":"IF(AH3=\"\",\"\",\"to\")","v":"to"},{"$f":"IF('Step 1-Contact and Program Info'!L7=\"\",\"\",'Step 1-Contact and Program Info'!L7)","v":"MM/DD/YYYY"}]
[]
[null,null,"Instructions: Complete this page if you partner with another RAD Utility, Retailer, Manufacturer, State/Local Government, or Waste Removal Service Provider Partner to jointly process/administer any of your units. The number of units should be reported by partner, in columns D through H. When reporting the units by refrigerant type and blowing agent type, report only the units processed with refrigerant recovery and foam recovery, respectively. If your program jointly processed units with more than five partners, please click on the button below to add additional partner columns. This information is important for ensuring that no units are double-counted when calculating aggregate nationwide benefits achieved by RAD partners.  When populating cells, please use the units provided; do not add text to specify units. If you wish to provide further information, please use the space for \"Additional Comments\" at the bottom of this worksheet."]
[]
[]
[]
[null,null,"Refrigerators ","Partner #1","Partner #2","Partner #3","Partner #4","Partner #5","Partner #6","Partner #7","Partner #8","Partner #9","Partner #10","Partner #11","Partner #12","Partner #13","Partner #14","Partner #15","Partner #16","Partner #17","Partner #18","Partner #19","Partner #20","Partner #21","Partner #22","Partner #23","Partner #24","Partner #25","Partner #26","Partner #27","Partner #28","Partner #29","Partner #30"]
[null,null,"Name of RAD Partner that Jointly Processes Your Units",{"$nulls":30},"Total Number Jointly Processed"]
[null,null,"Total Number of Units Jointly Processed",{"$nulls":30},{"$f":"SUM(D11:AG11)","v":0}]
[null,null,"Number of Units Jointly Processed with Refrigerant Recovery"]
[null,null,"CFC-12",{"$nulls":30},{"$f":"SUM(D13:AG13)","v":0}]
[null,null,"HFC-134a",{"$nulls":30},{"$f":"SUM(D14:AG14)","v":0}]
[null,null,"Other",{"$nulls":30},{"$f":"SUM(D15:AG15)","v":0}]
[null,null,"Total",{"$f":"SUM(D13:D15)","v":0},{"$f":"SUM(E13:E15)","v":0},{"$f":"SUM(F13:F15)","v":0},{"$f":"SUM(G13:G15)","v":0},{"$f":"SUM(H13:H15)","v":0},{"$f":"SUM(I13:I15)","v":0},0,0,0,0,0,0,0,0,0,0,0,0,0,0,0,0,0,0,0,0,0,0,0,0,{"$f":"SUM(AH13:AH15)","v":0}]
[null,null,"Number of Units Jointly Processed with Foam Recovery"]
[null,null,"CFC-11 Blowing Agent",{"$nulls":30},{"$f":"SUM(D18:AG18)","v":0}]
[null,null,"HCFC-141b Blowing Agent",{"$nulls":30},{"$f":"SUM(D19:AG19)","v":0}]
[null,null,"HFC-134a Blowing Agent",{"$nulls":30},0]
[null,null,"HFC-245fa Blowing Agent",{"$nulls":30},0]
[null,null,"Cyclopentane  Blowing Agent",{"$nulls":30},0]
[null,null,"Fiberglass",{"$nulls":30},0]
[null,null,"Other",{"$nulls":30},0]
[null,null,"Total",{"$f":"SUM(D18:D24)","v":0},{"$f":"SUM(E18:E24)","v":0},0,0,0,0,0,0,0,0,0,0,0,0,0,0,0,0,0,0,0,0,0,0,0,0,0,0,0,{"$f":"SUM(AG18:AG24)","v":0},{"$f":"SUM(AH18:AH24)","v":0}]
[null,null,"Stand-Alone Freezers ","Partner #1","Partner #2","Partner #3","Partner #4","Partner #5","Partner #6","Partner #7","Partner #8","Partner #9","Partner #10","Partner #11","Partner #12","Partner #13","Partner #14","Partner #15","Partner #16","Partner #17","Partner #18","Partner #19","Partner #20","Partner #21","Partner #22","Partner #23","Partner #24","Partner #25","Partner #26","Partner #27","Partner #28","Partner #29","Partner #30"]
[null,null,"Name of RAD Partner that Jointly Processes Your Units",{"$f":"IF(ISBLANK(D$10),\"\",D$10)","v":""},{"$f":"IF(ISBLANK(E$10),\"\",E$10)","v":""},{"$f":"IF(ISBLANK(F$10),\"\",F$10)","v":""},{"$f":"IF(ISBLANK(G$10),\"\",G$10)","v":""},{"$f":"IF(ISBLANK(H$10),\"\",H$10)","v":""},{"$nulls":25},"Total Number Jointly Processed"]
[null,null,"Total Number of Units Jointly Processed",{"$nulls":30},{"$f":"SUM(D28:AG28)","v":0}]
[null,null,"Number of Units Jointly Processed with Refrigerant Recovery"]
[null,null,"CFC-12",{"$nulls":30},{"$f":"SUM(D30:AG30)","v":0}]
[null,null,"HCFC-22",{"$nulls":30},{"$f":"SUM(D31:AG31)","v":0}]
[null,null,"HFC-134a",{"$nulls":30},{"$f":"SUM(D32:AG32)","v":0}]
[null,null,"Other",{"$nulls":30},{"$f":"SUM(D33:AG33)","v":0}]
[null,null,"Total",{"$f":"SUM(D30:D33)","v":0},{"$f":"SUM(E30:E33)","v":0},0,0,0,0,0,0,0,0,0,0,0,0,0,0,0,0,0,0,0,0,0,0,0,0,0,0,0,0,{"$f":"SUM(AH30:AH33)","v":0}]
[null,null,"Number of Units Jointly Processed with Foam Recovery"]
[null,null,"CFC-11 Blowing Agent",{"$nulls":30},{"$f":"SUM(D36:AG36)","v":0}]
[null,null,"HCFC-141b Blowing Agent",{"$nulls":30},0]
[null,null,"HFC-134a Blowing Agent",{"$nulls":30},0]
[null,null,"HFC-245fa Blowing Agent",{"$nulls":30},0]
[null,null,"Cyclopentane  Blowing Agent",{"$nulls":30},0]
[null,null,"Fiberglass",{"$nulls":30},0]
[null,null,"Other",{"$nulls":30},0]
[null,null,"Total",{"$f":"SUM(D36:D42)","v":0},0,{"$f":"SUM(F36:F42)","v":0},0,0,0,0,0,0,0,0,0,0,0,0,0,0,0,0,0,0,0,0,0,0,{"$f":"SUM(AC36:AC42)","v":0},0,0,0,{"$f":"SUM(AG36:AG42)","v":0},{"$f":"SUM(AH36:AH42)","v":0}]
[null,null,"Air-Conditioning Units ","Partner #1","Partner #2","Partner #3","Partner #4","Partner #5","Partner #6","Partner #7","Partner #8","Partner #9","Partner #10","Partner #11","Partner #12","Partner #13","Partner #14","Partner #15","Partner #16","Partner #17","Partner #18","Partner #19","Partner #20","Partner #21","Partner #22","Partner #23","Partner #24","Partner #25","Partner #26","Partner #27","Partner #28","Partner #29","Partner #30"]
[null,null,"Name of RAD Partner that Jointly Processes Your Units",{"$f":"IF(ISBLANK(D$10),\"\",D$10)","v":""},{"$f":"IF(ISBLANK(E$10),\"\",E$10)","v":""},{"$f":"IF(ISBLANK(F$10),\"\",F$10)","v":""},{"$f":"IF(ISBLANK(G$10),\"\",G$10)","v":""},{"$f":"IF(ISBLANK(H$10),\"\",H$10)","v":""},{"$nulls":25},"Total Number Jointly Processed"]
[null,null,"Total Number of Units Jointly Processed",{"$nulls":30},{"$f":"SUM(D46:AG46)","v":0}]
[null,null,"Number of Units Jointly Processed with Refrigerant Recovery"]
[null,null,"HCFC-22",{"$nulls":30},{"$f":"SUM(D48:AG48)","v":0}]
[null,null,"R-407C",{"$nulls":30},{"$f":"SUM(D49:AG49)","v":0}]
[null,null,"R-410A",{"$nulls":30},{"$f":"SUM(D50:AG50)","v":0}]
[null,null,"Other",{"$nulls":30},{"$f":"SUM(D51:AG51)","v":0}]
[null,null,"Total",{"$f":"SUM(D48:D51)","v":0},{"$f":"SUM(E48:E51)","v":0},0,0,0,0,0,0,0,0,0,0,0,0,0,0,0,0,0,0,0,0,0,0,0,0,0,0,0,0,0]
[null,null,"Dehumidifiers","Partner #1","Partner #2","Partner #3","Partner #4","Partner #5","Partner #6","Partner #7","Partner #8","Partner #9","Partner #10","Partner #11","Partner #12","Partner #13","Partner #14","Partner #15","Partner #16","Partner #17","Partner #18","Partner #19","Partner #20","Partner #21","Partner #22","Partner #23","Partner #24","Partner #25","Partner #26","Partner #27","Partner #28","Partner #29","Partner #30"]
[null,null,"Name of RAD Partner that Jointly Processes Your Units",{"$f":"IF(ISBLANK(D$10),\"\",D$10)","v":""},{"$f":"IF(ISBLANK(E$10),\"\",E$10)","v":""},{"$f":"IF(ISBLANK(F$10),\"\",F$10)","v":""},{"$f":"IF(ISBLANK(G$10),\"\",G$10)","v":""},{"$f":"IF(ISBLANK(H$10),\"\",H$10)","v":""},{"$nulls":25},"Total Number Jointly Processed"]
[null,null,"Total Number of Units Jointly Processed",{"$nulls":30},{"$f":"SUM(D55:AG55)","v":0}]
[null,null,"Number of Units Jointly Processed with Refrigerant Recovery"]
[null,null,"CFC-12",{"$nulls":30},{"$f":"SUM(D57:AG57)","v":0}]
[null,null,"HCFC-22",{"$nulls":30},0]
[null,null,"HFC-134a",{"$nulls":30},0]
[null,null,"R-500",{"$nulls":30},0]
[null,null,"R-410A",{"$nulls":30},0]
[null,null,"Other",{"$nulls":30},0]
[null,null,"Total",{"$f":"SUM(D57:D62)","v":0},0,0,0,0,0,0,0,0,0,0,0,0,0,0,0,0,0,0,0,0,0,0,0,0,0,0,0,0,0,0]
[]
[]
[]
[null,null,"Additional Comments:"]
{"$rows_empty":7}
[null,null,{"$f":"'Instructions & Definitions'!C57","v":"EPA Form Number: 5900-482"}]

{"sheet":"Step 5-QA_Input Data Summary","index":12,"n_rows":34,"n_cols":7,"rows_kept":34,"merged":[[1,6,1,8],[3,2,3,6],[4,2,4,6],[5,3,5,6]]}
[]
[]
[null,null,"Step 5: Summary of Input Data for Quality Assurance"]
[null,null,"Instructions: Review the input data summarized in the table below to ensure that the data entered in the Step 3 worksheets are error-free. The table below presents the calculated average quantities of refrigerant, foam-blowing agent, and durable materials recovered per appliance and is self-populated based on the activity data reported in the Step 3 worksheet(s). The typical range reported by partners in previous years can be displayed in comments by holding your cursor over each cell, and should be used as guidance to identify potential reporting errors in the Step 3 worksheet(s)."]
[null,null,"Average Quantity Recovered Per Unit, Calculated Based on Reported Total Quantity and Number of Units Processed"]
[{"$nulls":3},"Appliance Type"]
[{"$nulls":3},"Refrigerators","Stand-Alone Freezers","Air-Conditioning Units","Dehumidifiers"]
[null,null,"Number of Units",{"$f":"'Step 3-Refrigerators'!$D$8","v":0},{"$f":"'Step 3-Stand-Alone Freezers'!$D$8","v":0},{"$f":"'Step 3-Air-Conditioning Units'!$D$8","v":0},{"$f":"'Step 3-Dehumidifiers'!$D$8","v":0}]
[null,null,"Refrigerant (lb)*"]
[null,null,"CFC-12",{"$f":"IF(SUM('Step 3-Refrigerators'!F31:F34)=0,\"\",(SUM('Step 3-Refrigerators'!F31:F34))/'Step 3-Refrigerators'!$E11)","v":""},{"$f":"IF(SUM('Step 3-Stand-Alone Freezers'!F32:F35)=0,\"\",(SUM('Step 3-Stand-Alone Freezers'!F32:F35))/'Step 3-Stand-Alone Freezers'!$E$11)","v":""},"NA",{"$f":"IF(SUM('Step 3-Dehumidifiers'!F25:F28)=0,\"\",(SUM('Step 3-Dehumidifiers'!F25:F28))/'Step 3-Dehumidifiers'!$E$11)","v":""}]
[null,null,"HCFC-22","NA",{"$f":"IF(SUM('Step 3-Stand-Alone Freezers'!F37:F40)=0,\"\",(SUM('Step 3-Stand-Alone Freezers'!F37:F40))/'Step 3-Stand-Alone Freezers'!$E$12)","v":""},{"$f":"IF(SUM('Step 3-Air-Conditioning Units'!F23:F26)=0,\"\",(SUM('Step 3-Air-Conditioning Units'!F23:F26))/'Step 3-Air-Conditioning Units'!$E$11)","v":""},{"$f":"IF(SUM('Step 3-Dehumidifiers'!F30:F33)=0,\"\",(SUM('Step 3-Dehumidifiers'!F30:F33))/'Step 3-Dehumidifiers'!$E$12)","v":""}]
[null,null,"HFC-134a",{"$f":"IF(SUM('Step 3-Refrigerators'!F36:F39)=0,\"\",(SUM('Step 3-Refrigerators'!F36:F39))/'Step 3-Refrigerators'!$E12)","v":""},{"$f":"IF(SUM('Step 3-Stand-Alone Freezers'!F42:F45)=0,\"\",(SUM('Step 3-Stand-Alone Freezers'!F42:F45))/'Step 3-Stand-Alone Freezers'!$E$13)","v":""},"NA",{"$f":"IF(SUM('Step 3-Dehumidifiers'!F35:F38)=0,\"\",(SUM('Step 3-Dehumidifiers'!F35:F38))/'Step 3-Dehumidifiers'!$E$13)","v":""}]
[null,null,"R-500A","NA","NA","NA",{"$f":"IF(SUM('Step 3-Dehumidifiers'!F40:F43)=0,\"\",(SUM('Step 3-Dehumidifiers'!F40:F43))/'Step 3-Dehumidifiers'!$E$14)","v":""}]
[null,null,"R-407C","NA","NA",{"$f":"IF(SUM('Step 3-Air-Conditioning Units'!F28:F31)=0,\"\",(SUM('Step 3-Air-Conditioning Units'!F28:F31))/'Step 3-Air-Conditioning Units'!$E$12)","v":""},"NA"]
[null,null,"R-410A","NA","NA",{"$f":"IF(SUM('Step 3-Air-Conditioning Units'!F33:F36)=0,\"\",(SUM('Step 3-Air-Conditioning Units'!F33:F36))/'Step 3-Air-Conditioning Units'!$E$13)","v":""},{"$f":"IF(SUM('Step 3-Dehumidifiers'!F45:F48)=0,\"\",(SUM('Step 3-Dehumidifiers'!F45:F48))/'Step 3-Dehumidifiers'!$E$15)","v":""}]
[null,null,"Average across all units",{"$f":"IF(SUM(Fridge_Refrig_Total)=0,\"\",(SUM(Fridge_Refrig_Total))/SUM('Step 3-Refrigerators'!E11:E12))","v":""},{"$f":"IF(SUM(Freezer_Refrig_Total)=0,\"\",(SUM(Freezer_Refrig_Total))/SUM('Step 3-Stand-Alone Freezers'!E11:E13))","v":""},{"$f":"IF(SUM(AC_Refrigerant)=0,\"\",(SUM(AC_Refrigerant))/SUM('Step 3-Air-Conditioning Units'!E11:E13))","v":""},{"$f":"IF(SUM(Dehumidifiers_Refrigerant)=0,\"\",(SUM(Dehumidifiers_Refrigerant))/SUM('Step 3-Dehumidifiers'!E11:E15))","v":""}]
[null,null,"Foam-Blowing Agent (lb)**"]
[null,null,"CFC-11",{"$f":"IF(SUM('Step 3-Refrigerators'!F41:F44)=0,\"\",((SUM('Step 3-Refrigerators'!F41:F44))/'Step 3-Refrigerators'!$E16))","v":""},{"$f":"IF(SUM('Step 3-Stand-Alone Freezers'!F47:F50)=0,\"\",(SUM('Step 3-Stand-Alone Freezers'!F47:F50))/'Step 3-Stand-Alone Freezers'!$E17)","v":""},"NA","NA"]
[null,null,"HCFC-141b",{"$f":"IF(SUM('Step 3-Refrigerators'!F46:F49)=0,\"\",(SUM('Step 3-Refrigerators'!F46:F49)/'Step 3-Refrigerators'!$E17))","v":""},{"$f":"IF(SUM('Step 3-Stand-Alone Freezers'!F52:F55)=0,\"\",(SUM('Step 3-Stand-Alone Freezers'!F52:F55))/'Step 3-Stand-Alone Freezers'!$E18)","v":""},"NA","NA"]
[null,null,"HFC-134a",{"$f":"IF(SUM('Step 3-Refrigerators'!F51:F54)=0,\"\",(SUM('Step 3-Refrigerators'!F51:F54))/'Step 3-Refrigerators'!$E18)","v":""},{"$f":"IF(SUM('Step 3-Stand-Alone Freezers'!F57:F60)=0,\"\",(SUM('Step 3-Stand-Alone Freezers'!F57:F60))/'Step 3-Stand-Alone Freezers'!$E19)","v":""},"NA","NA"]
[null,null,"HFC-245fa",{"$f":"IF(SUM('Step 3-Refrigerators'!F56:F59)=0,\"\",(SUM('Step 3-Refrigerators'!F56:F59))/'Step 3-Refrigerators'!$E19)","v":""},{"$f":"IF(SUM('Step 3-Stand-Alone Freezers'!F62:F65)=0,\"\",(SUM('Step 3-Stand-Alone Freezers'!F62:F65))/'Step 3-Stand-Alone Freezers'!$E20)","v":""},"NA","NA"]
[null,null,"Average across all units",{"$f":"IF(SUM(Fridge_Foam_Total)=0,\"\",SUM(Fridge_Foam_Total)/SUM('Step 3-Refrigerators'!E16:E19))","v":""},{"$f":"IF(SUM(Freezer_Foam_Total)=0,\"\",SUM(Freezer_Foam_Total)/SUM('Step 3-Stand-Alone Freezers'!E17:E20))","v":""},"NA","NA"]
[null,null,"Durable Materials"]
[null,null,"Used oil (gal)",{"$f":"IF(SUM('Step 3-Refrigerators'!$F$60+'Step 3-Refrigerators'!$F$61)=0,\"\",('Step 3-Refrigerators'!$F$60+'Step 3-Refrigerators'!$F$61)/$D$8)","v":""},{"$f":"IF(SUM('Step 3-Stand-Alone Freezers'!$F$66+'Step 3-Stand-Alone Freezers'!$F$67)=0,\"\",('Step 3-Stand-Alone Freezers'!$F$66+'Step 3-Stand-Alone Freezers'!$F$67)/$E$8)","v":""},{"$f":"IF(SUM('Step 3-Air-Conditioning Units'!$F$37+'Step 3-Air-Conditioning Units'!$F$38)=0,\"\",('Step 3-Air-Conditioning Units'!$F$37+'Step 3-Air-Conditioning Units'!$F$38)/$F$8)","v":""},{"$f":"IF(SUM('Step 3-Dehumidifiers'!$F$49+'Step 3-Dehumidifiers'!$F$50)=0,\"\",('Step 3-Dehumidifiers'!$F$49+'Step 3-Dehumidifiers'!$F$50)/$G$8)","v":""}]
[null,null,"Ferrous metals (lb)",{"$f":"IF('Step 3-Refrigerators'!$F$62=0,\"\",'Step 3-Refrigerators'!$F$62/$D$8)","v":""},{"$f":"IF('Step 3-Stand-Alone Freezers'!$F$68=0,\"\",'Step 3-Stand-Alone Freezers'!$F$68/$E$8)","v":""},{"$f":"IF('Step 3-Air-Conditioning Units'!$F$39=0,\"\",'Step 3-Air-Conditioning Units'!$F$39/$F$8)","v":""},{"$f":"IF('Step 3-Dehumidifiers'!$F$51=0,\"\",'Step 3-Dehumidifiers'!$F$51/$G$8)","v":""}]
[null,null,"Non-ferrous metals (lb)",{"$f":"IF('Step 3-Refrigerators'!$F$63=0,\"\",'Step 3-Refrigerators'!$F$63/$D$8)","v":""},{"$f":"IF('Step 3-Stand-Alone Freezers'!$F$69=0,\"\",'Step 3-Stand-Alone Freezers'!$F$69/$E$8)","v":""},{"$f":"IF('Step 3-Air-Conditioning Units'!$F$40=0,\"\",'Step 3-Air-Conditioning Units'!$F$40/$F$8)","v":""},{"$f":"IF('Step 3-Dehumidifiers'!$F$52=0,\"\",'Step 3-Dehumidifiers'!$F$52/$G$8)","v":""}]
[null,null,"Plastic (lb)",{"$f":"IF('Step 3-Refrigerators'!$F$64=0,\"\",'Step 3-Refrigerators'!$F$64/$D$8)","v":""},{"$f":"IF('Step 3-Stand-Alone Freezers'!$F$70=0,\"\",'Step 3-Stand-Alone Freezers'!$F$70/$E$8)","v":""},{"$f":"IF('Step 3-Air-Conditioning Units'!$F$41=0,\"\",'Step 3-Air-Conditioning Units'!$F$41/$F$8)","v":""},{"$f":"IF('Step 3-Dehumidifiers'!$F$53=0,\"\",'Step 3-Dehumidifiers'!$F$53/$G$8)","v":""}]
[null,null,"Glass (lb)",{"$f":"IF('Step 3-Refrigerators'!$F$65=0,\"\",'Step 3-Refrigerators'!$F$65/$D$8)","v":""},"NA","NA","NA"]
[null,null,"Number of PCB-containing capacitors",{"$f":"IF('Step 3-Refrigerators'!$F$66=0,\"\",'Step 3-Refrigerators'!$F$66/$D$8)","v":""},{"$f":"IF('Step 3-Stand-Alone Freezers'!$F$71=0,\"\",'Step 3-Stand-Alone Freezers'!$F$71/$E$8)","v":""},{"$f":"IF('Step 3-Air-Conditioning Units'!$F$42=0,\"\",'Step 3-Air-Conditioning Units'!$F$42/$F$8)","v":""},{"$f":"IF('Step 3-Dehumidifiers'!$F$54=0,\"\",'Step 3-Dehumidifiers'!$F$54/$G$8)","v":""}]
[null,null,"Number of Mercury-containing components","NA",{"$f":"IF(SUM('Step 3-Stand-Alone Freezers'!$F$72+'Step 3-Stand-Alone Freezers'!$F$73)=0,\"\",('Step 3-Stand-Alone Freezers'!$F$72+'Step 3-Stand-Alone Freezers'!$F$73)/$E$8)","v":""},"NA","NA"]
[null,null,"*Average calculated based on reported number of units processed with refrigerant recovery."]
[null,null,"**Average calculated based on reported number of units processed with foam recovery."]
[]
[null,null,{"$f":"'Instructions & Definitions'!C57","v":"EPA Form Number: 5900-482"}]

{"sheet":"Step 5-Env Benefits","index":13,"n_rows":88,"n_cols":8,"rows_kept":88,"merged":[[1,7,1,8],[3,2,3,7],[5,2,5,7],[6,2,7,2],[6,3,6,4],[6,5,7,6],[6,7,7,7],[9,5,9,6],[10,5,10,6],[11,5,11,6],[12,5,12,6],[13,5,13,6],[14,5,14,6],[15,5,15,6],[16,5,16,6],[17,5,17,6],[18,5,18,6],[19,5,19,6],[20,5,20,6],[21,5,21,6],[22,5,22,6],[23,5,23,6],[24,5,24,6],[25,5,25,6],[26,5,26,6],[27,5,27,6],[28,5,28,6],[29,5,29,6],[30,5,30,6],[31,5,31,6],[32,5,32,6],[33,5,33,6],[34,5,34,6],[35,5,35,6],[36,5,36,6],[37,5,37,6],[39,5,39,6],[40,5,40,6],[41,5,41,6],[42,5,42,6],[43,5,43,6],[44,5,44,6],[45,5,45,6],[46,5,46,6],[47,5,47,6],[48,5,48,6],[49,5,49,6],[50,5,50,6],[51,5,51,6],[52,5,52,6],[53,5,53,6],[54,5,54,6],[55,5,55,6],[56,5,56,6],[57,5,57,6],[58,5,58,6],[59,5,59,6],[61,5,61,6],[62,5,62,6],[63,5,63,6],[64,5,64,6],[65,5,65,6],[67,5,67,6],[68,5,68,6],[70,2,70,7],[71,2,71,7],[72,2,72,7],[73,2,73,7],[74,2,74,7],[75,2,75,7],[77,2,77,3],[78,2,78,7],[80,5,80,6]]}
[]
[]
[null,null,"Step 5: Summary of Program's Environmental Benefits"]
[null,null,"Instructions: No action is required. The tables below are for reference only and are self-populated based on the activity data reported in the Step 3 worksheet(s). "]
[null,null,"Emissions Avoided"]
[null,null,"The table below presents the cumulative avoided emissions of greenhouse gas and ozone depleting substances resulting from your program. It is calculated based on assumptions of destruction and reclamation efficiencies developed by the U.S. EPA.  \nNote: It is assumed that removing units from the electricity grid will only result in environmental benefits if your program offers an incentive to retire old, working appliances. In addition, the estimated ozone and greenhouse gas benefits associated with avoided releases of refrigerant and foam-blowing agent are subject to change as more information becomes available (e.g., regarding loss rates associated with various recovery technologies and practices, baseline emissions, global warming potentials [GWPs], etc.)."]
[null,null,"Appliance Component","Total Amount Prevented from Being Emitted",null,"Greenhouse Gas (GHG) Emissions Avoided (MTCO2eq)a",null,"Ozone Depleting Substances (ODS) Emissions Avoided (ODP-Weighted kg)b"]
[{"$nulls":3},"(lb)","(kg)"]
[null,null,"Refrigerantc"]
[null,null,"CFC-12 Reclaimed",{"$f":"(1-Assumptions!$C$21)*('Step 3-Refrigerators'!$F$31+'Step 3-Stand-Alone Freezers'!$F$32+'Step 3-Dehumidifiers'!$F$25)","v":{"v":0,"d":"0.0"}},{"$f":"D10*Assumptions!$B$37","v":{"v":0,"d":"0.0"}},{"$f":"E10*Assumptions!$D$8*(1/1000)","v":{"v":0,"d":"0.0"}},null,{"$f":"E10*Assumptions!$C$8","v":{"v":0,"d":"0.0"}}]
[null,null,"HCFC-22 Reclaimed",{"$f":"(1-Assumptions!$C$21)*('Step 3-Stand-Alone Freezers'!$F$37+'Step 3-Dehumidifiers'!$F$30+'Step 3-Air-Conditioning Units'!$F$23)","v":{"v":0,"d":"0.0"}},{"$f":"D11*Assumptions!$B$37","v":{"v":0,"d":"0.0"}},{"$f":"E11*Assumptions!$D$10*(1/1000)","v":{"v":0,"d":"0.0"}},null,{"$f":"E11*Assumptions!$C$10","v":{"v":0,"d":"0.0"}}]
[null,null,"HFC-134a Reclaimed",{"$f":"(1-Assumptions!$C$21)*('Step 3-Refrigerators'!$F$36+'Step 3-Stand-Alone Freezers'!$F$42+'Step 3-Dehumidifiers'!$F$35)","v":{"v":0,"d":"0.00"}},{"$f":"D12*Assumptions!$B$37","v":{"v":0,"d":"0.0"}},{"$f":"E12*Assumptions!$D$9*(1/1000)","v":{"v":0,"d":"0.0"}},null,{"$f":"E12*Assumptions!$C$9","v":{"v":0,"d":"0.0"}}]
[null,null,"R-500 Reclaimed",{"$f":"(1-Assumptions!$C$21)*'Step 3-Dehumidifiers'!$F$40","v":{"v":0,"d":"0.0"}},{"$f":"D13*Assumptions!$B$37","v":{"v":0,"d":"0.0"}},{"$f":"E13*Assumptions!$D$12*(1/1000)","v":{"v":0,"d":"0.0"}},null,{"$f":"E13*Assumptions!$C$12","v":{"v":0,"d":"0.0"}}]
[null,null,"R-407C Reclaimed",{"$f":"(1-Assumptions!$C$21)*('Step 3-Air-Conditioning Units'!$F$28)","v":{"v":0,"d":"0.0"}},{"$f":"D14*Assumptions!$B$37","v":{"v":0,"d":"0.0"}},{"$f":"E14*Assumptions!$D$14*(1/1000)","v":{"v":0,"d":"0.0"}},null,{"$f":"E14*Assumptions!$C$14","v":{"v":0,"d":"0.0"}}]
[null,null,"R-410A Reclaimed",{"$f":"(1-Assumptions!$C$21)*('Step 3-Air-Conditioning Units'!$F$33+'Step 3-Dehumidifiers'!$F$45)","v":{"v":0,"d":"0.0"}},{"$f":"D15*Assumptions!$B$37","v":{"v":0,"d":"0.0"}},{"$f":"E15*Assumptions!$D$13*(1/1000)","v":{"v":0,"d":"0.0"}},null,{"$f":"E15*Assumptions!$C$13","v":{"v":0,"d":"0.0"}}]
[null,null,"Reclaimed",{"$f":"SUM(D10:D15)","v":{"v":0,"d":"0.0"}},{"$f":"SUM(E10:E15)","v":{"v":0,"d":"0.0"}},{"$f":"SUM(F10:F15)","v":{"v":0,"d":"0.0"}},null,{"$f":"SUM(H10:H15)","v":{"v":0,"d":"0.0"}}]
[null,null,"CFC-12 Stockpiling with Intent to Reclaim",{"$f":"(1-Assumptions!$C$21)*('Step 3-Refrigerators'!$F$32+'Step 3-Stand-Alone Freezers'!$F$33+'Step 3-Dehumidifiers'!$F$26)","v":{"v":0,"d":"0.0"}},{"$f":"D17*Assumptions!$B$37","v":{"v":0,"d":"0.0"}},{"$f":"E17*Assumptions!$D$8*(1/1000)","v":{"v":0,"d":"0.0"}},null,{"$f":"E17*Assumptions!$C$8","v":{"v":0,"d":"0.0"}}]
[null,null,"HCFC-22 Stockpiling with Intent to Reclaim",{"$f":"(1-Assumptions!$C$21)*('Step 3-Stand-Alone Freezers'!$F$38+'Step 3-Dehumidifiers'!$F$31+'Step 3-Air-Conditioning Units'!$F$24)","v":{"v":0,"d":"0.0"}},{"$f":"D18*Assumptions!$B$37","v":{"v":0,"d":"0.0"}},{"$f":"E18*Assumptions!$D$10*(1/1000)","v":{"v":0,"d":"0.0"}},null,{"$f":"E18*Assumptions!$C$10","v":{"v":0,"d":"0.0"}}]
[null,null,"HFC-134a Stockpiling with Intent to Reclaim",{"$f":"(1-Assumptions!$C$21)*('Step 3-Refrigerators'!$F$37+'Step 3-Stand-Alone Freezers'!$F$43+'Step 3-Dehumidifiers'!$F$36)","v":{"v":0,"d":"0.0"}},{"$f":"D19*Assumptions!$B$37","v":{"v":0,"d":"0.0"}},{"$f":"E19*Assumptions!$D$9*(1/1000)","v":{"v":0,"d":"0.0"}},null,{"$f":"E19*Assumptions!$C$9","v":{"v":0,"d":"0.0"}}]
[null,null,"R-500 Stockpiling with Intent to Reclaim",{"$f":"(1-Assumptions!$C$21)*'Step 3-Dehumidifiers'!$F$41","v":{"v":0,"d":"0.0"}},{"$f":"D20*Assumptions!$B$37","v":{"v":0,"d":"0.0"}},{"$f":"E20*Assumptions!$D$12*(1/1000)","v":{"v":0,"d":"0.0"}},null,{"$f":"E20*Assumptions!$C$12","v":{"v":0,"d":"0.0"}}]
[null,null,"R-407C Stockpiling with Intent to Reclaim",{"$f":"(1-Assumptions!$C$21)*('Step 3-Air-Conditioning Units'!$F$29)","v":{"v":0,"d":"0.0"}},{"$f":"D21*Assumptions!$B$37","v":{"v":0,"d":"0.0"}},{"$f":"E21*Assumptions!$D$14*(1/1000)","v":{"v":0,"d":"0.0"}},null,{"$f":"E21*Assumptions!$C$14","v":{"v":0,"d":"0.0"}}]
[null,null,"R-410A Stockpiling with Intent to Reclaim",{"$f":"(1-Assumptions!$C$21)*('Step 3-Air-Conditioning Units'!$F$34+'Step 3-Dehumidifiers'!$F$46)","v":{"v":0,"d":"0.0"}},{"$f":"D22*Assumptions!$B$37","v":{"v":0,"d":"0.0"}},{"$f":"E22*Assumptions!$D$13*(1/1000)","v":{"v":0,"d":"0.0"}},null,{"$f":"E22*Assumptions!$C$13","v":{"v":0,"d":"0.0"}}]
[null,null,"Stockpiling with Intent to Reclaim",{"$f":"SUM(D17:D22)","v":{"v":0,"d":"0.0"}},{"$f":"SUM(E17:E22)","v":{"v":0,"d":"0.0"}},{"$f":"SUM(F17:F22)","v":{"v":0,"d":"0.0"}},null,{"$f":"SUM(H17:H22)","v":{"v":0,"d":"0.0"}}]
[null,null,"CFC-12 Destroyed",{"$f":"(1-Assumptions!$C$20)*('Step 3-Refrigerators'!$F$33+'Step 3-Stand-Alone Freezers'!$F$34+'Step 3-Dehumidifiers'!$F$27)","v":{"v":0,"d":"0.0"}},{"$f":"D24*Assumptions!$B$37","v":{"v":0,"d":"0.0"}},{"$f":"E24*Assumptions!$D$8*(1/1000)","v":{"v":0,"d":"0.0"}},null,{"$f":"E24*Assumptions!$C$8","v":{"v":0,"d":"0.0"}}]
[null,null,"HCFC-22 Destroyed",{"$f":"(1-Assumptions!$C$20)*('Step 3-Stand-Alone Freezers'!$F$39+'Step 3-Dehumidifiers'!$F$32+'Step 3-Air-Conditioning Units'!$F$25)","v":{"v":0,"d":"0.0"}},{"$f":"D25*Assumptions!$B$37","v":{"v":0,"d":"0.0"}},{"$f":"E25*Assumptions!$D$10*(1/1000)","v":{"v":0,"d":"0.0"}},null,{"$f":"E25*Assumptions!$C$10","v":{"v":0,"d":"0.0"}}]
[null,null,"HFC-134a Destroyed",{"$f":"(1-Assumptions!$C$20)*('Step 3-Refrigerators'!$F$38+'Step 3-Stand-Alone Freezers'!$F$44+'Step 3-Dehumidifiers'!$F$37)","v":{"v":0,"d":"0.0"}},{"$f":"D26*Assumptions!$B$37","v":{"v":0,"d":"0.0"}},{"$f":"E26*Assumptions!$D$9*(1/1000)","v":{"v":0,"d":"0.0"}},null,{"$f":"E26*Assumptions!$C$9","v":{"v":0,"d":"0.0"}}]
[null,null,"R-500 Destroyed",{"$f":"(1-Assumptions!$C$20)*'Step 3-Dehumidifiers'!$F$42","v":{"v":0,"d":"0.0"}},{"$f":"D27*Assumptions!$B$37","v":{"v":0,"d":"0.0"}},{"$f":"E27*Assumptions!$D$12*(1/1000)","v":{"v":0,"d":"0.0"}},null,{"$f":"E27*Assumptions!$C$12","v":{"v":0,"d":"0.0"}}]
[null,null,"R-407C Destroyed",{"$f":"(1-Assumptions!$C$20)*('Step 3-Air-Conditioning Units'!$F$30)","v":{"v":0,"d":"0.0"}},{"$f":"D28*Assumptions!$B$37","v":{"v":0,"d":"0.0"}},{"$f":"E28*Assumptions!$D$14*(1/1000)","v":{"v":0,"d":"0.0"}},null,{"$f":"E28*Assumptions!$C$14","v":{"v":0,"d":"0.0"}}]
[null,null,"R-410A Destroyed",{"$f":"(1-Assumptions!$C$20)*('Step 3-Air-Conditioning Units'!$F$35+'Step 3-Dehumidifiers'!$F$47)","v":{"v":0,"d":"0.0"}},{"$f":"D29*Assumptions!$B$37","v":{"v":0,"d":"0.0"}},{"$f":"E29*Assumptions!$D$13*(1/1000)","v":{"v":0,"d":"0.0"}},null,{"$f":"E29*Assumptions!$C$13","v":{"v":0,"d":"0.0"}}]
[null,null,"Destroyed",{"$f":"SUM(D24:D29)","v":{"v":0,"d":"0.0"}},{"$f":"SUM(E24:E29)","v":{"v":0,"d":"0.0"}},{"$f":"SUM(F24:F29)","v":{"v":0,"d":"0.0"}},null,{"$f":"SUM(H24:H29)","v":{"v":0,"d":"0.0"}}]
[null,null,"CFC-12 Stockpiling with Intent to Destroy",{"$f":"(1-Assumptions!$C$20)*('Step 3-Refrigerators'!$F$34+'Step 3-Stand-Alone Freezers'!$F$35+'Step 3-Dehumidifiers'!$F$28)","v":{"v":0,"d":"0.0"}},{"$f":"D31*Assumptions!$B$37","v":{"v":0,"d":"0.0"}},{"$f":"E31*Assumptions!$D$8*(1/1000)","v":{"v":0,"d":"0.0"}},null,{"$f":"E31*Assumptions!$C$8","v":{"v":0,"d":"0.0"}}]
[null,null,"HCFC-22 Stockpiling with Intent to Destroy",{"$f":"(1-Assumptions!$C$20)*('Step 3-Stand-Alone Freezers'!$F$40+'Step 3-Dehumidifiers'!$F$33+'Step 3-Air-Conditioning Units'!$F$26)","v":{"v":0,"d":"0.0"}},{"$f":"D32*Assumptions!$B$37","v":{"v":0,"d":"0.0"}},{"$f":"E32*Assumptions!$D$10*(1/1000)","v":{"v":0,"d":"0.0"}},null,{"$f":"E32*Assumptions!$C$10","v":{"v":0,"d":"0.0"}}]
[null,null,"HFC-134a Stockpiling with Intent to Destroy",{"$f":"(1-Assumptions!$C$20)*('Step 3-Refrigerators'!$F$39+'Step 3-Stand-Alone Freezers'!$F$45+'Step 3-Dehumidifiers'!$F$38)","v":{"v":0,"d":"0.0"}},{"$f":"D33*Assumptions!$B$37","v":{"v":0,"d":"0.0"}},{"$f":"E33*Assumptions!$D$9*(1/1000)","v":{"v":0,"d":"0.0"}},null,{"$f":"E33*Assumptions!$C$9","v":{"v":0,"d":"0.0"}}]
[null,null,"R-500 Stockpiling with Intent to Destroy",{"$f":"(1-Assumptions!$C$20)*'Step 3-Dehumidifiers'!$F$43","v":{"v":0,"d":"0.0"}},{"$f":"D34*Assumptions!$B$37","v":{"v":0,"d":"0.0"}},{"$f":"E34*Assumptions!$D$12*(1/1000)","v":{"v":0,"d":"0.0"}},null,{"$f":"E34*Assumptions!$C$12","v":{"v":0,"d":"0.0"}}]
[null,null,"R-407C Stockpiling with Intent to Destroy",{"$f":"(1-Assumptions!$C$20)*('Step 3-Air-Conditioning Units'!$F$31)","v":{"v":0,"d":"0.0"}},{"$f":"D35*Assumptions!$B$37","v":{"v":0,"d":"0.0"}},{"$f":"E35*Assumptions!$D$14*(1/1000)","v":{"v":0,"d":"0.0"}},null,{"$f":"E35*Assumptions!$C$14","v":{"v":0,"d":"0.0"}}]
[null,null,"R-410A Stockpiling with Intent to Destroy",{"$f":"(1-Assumptions!$C$20)*('Step 3-Air-Conditioning Units'!$F$36+'Step 3-Dehumidifiers'!$F$48)","v":{"v":0,"d":"0.0"}},{"$f":"D36*Assumptions!$B$37","v":{"v":0,"d":"0.0"}},{"$f":"E36*Assumptions!$D$13*(1/1000)","v":{"v":0,"d":"0.0"}},null,{"$f":"E36*Assumptions!$C$13","v":{"v":0,"d":"0.0"}}]
[null,null,"Stockpiling with Intent to Destroy",{"$f":"SUM(D31:D36)","v":{"v":0,"d":"0.0"}},{"$f":"SUM(E31:E36)","v":{"v":0,"d":"0.0"}},{"$f":"SUM(F31:F36)","v":{"v":0,"d":"0.0"}},null,{"$f":"SUM(H31:H36)","v":{"v":0,"d":"0.0"}}]
[null,null,"Subtotal",{"$f":"SUM(D16,D23,D30,D37)","v":{"v":0,"d":"0.0"}},{"$f":"SUM(E16,E23,E30,E37)","v":{"v":0,"d":"0.0"}},{"$f":"SUM(F16,F23,F30,F37)","v":{"v":0,"d":"0.0"}},null,{"$f":"SUM(H16,H23,H30,H37)","v":{"v":0,"d":"0.0"}}]
[null,null,"Foam-Blowing Agentd"]
[null,null,"CFC-11 Reclaimed",{"$f":"(1-Assumptions!$C$25)*('Step 3-Refrigerators'!$F$41+'Step 3-Stand-Alone Freezers'!$F$47)","v":{"v":0,"d":"0.0"}},{"$f":"D40*Assumptions!$B$37","v":{"v":0,"d":"0.0"}},{"$f":"E40*Assumptions!$D$6*(1/1000)","v":{"v":0,"d":"0.0"}},null,{"$f":"E40*Assumptions!$C$6","v":{"v":0,"d":"0.0"}}]
[null,null,"HCFC-141b Reclaimed",{"$f":"(1-Assumptions!$C$25)*('Step 3-Refrigerators'!$F$46+'Step 3-Stand-Alone Freezers'!$F$52)","v":{"v":0,"d":"0.0"}},{"$f":"D41*Assumptions!$B$37","v":{"v":0,"d":"0.0"}},{"$f":"E41*Assumptions!$D$7*(1/1000)","v":{"v":0,"d":"0.0"}},null,{"$f":"E41*Assumptions!$C$7","v":{"v":0,"d":"0.0"}}]
["HFC-245fa","HFC-245fa","HFC-134a Reclaimed",{"$f":"(1-Assumptions!$C$25)*('Step 3-Refrigerators'!$F$51+'Step 3-Stand-Alone Freezers'!$F$57)","v":{"v":0,"d":"0.0"}},{"$f":"D42*Assumptions!$B$37","v":{"v":0,"d":"0.0"}},{"$f":"E42*Assumptions!$D$9*(1/1000)","v":{"v":0,"d":"0.0"}},null,{"$f":"E42*Assumptions!$C$9","v":{"v":0,"d":"0.0"}}]
["HFC-134a","HFC-134a","HFC-245fa Reclaimed",{"$f":"(1-Assumptions!$C$25)*('Step 3-Refrigerators'!$F$56+'Step 3-Stand-Alone Freezers'!$F$62)","v":{"v":0,"d":"0.0"}},{"$f":"D43*Assumptions!$B$37","v":{"v":0,"d":"0.0"}},{"$f":"E43*Assumptions!$D$15*(1/1000)","v":{"v":0,"d":"0.0"}},null,{"$f":"E43*Assumptions!$C$15","v":{"v":0,"d":"0.0"}}]
[null,null,"Reclaimed",{"$f":"SUM(D40:D43)","v":{"v":0,"d":"0.0"}},{"$f":"SUM(E40:E43)","v":{"v":0,"d":"0.0"}},{"$f":"SUM(F40:F43)","v":{"v":0,"d":"0.0"}},null,{"$f":"SUM(H40:H43)","v":{"v":0,"d":"0.0"}}]
[null,null,"CFC-11 Stockpiling with Intent to Reclaim",{"$f":"(1-Assumptions!$C$25)*('Step 3-Refrigerators'!$F$42+'Step 3-Stand-Alone Freezers'!$F$48)","v":{"v":0,"d":"0.0"}},{"$f":"D45*Assumptions!$B$37","v":{"v":0,"d":"0.0"}},{"$f":"E45*Assumptions!$D$6*(1/1000)","v":{"v":0,"d":"0.0"}},null,{"$f":"E45*Assumptions!$C$6","v":{"v":0,"d":"0.0"}}]
[null,null,"HCFC-141b Stockpiling with Intent to Reclaim",{"$f":"(1-Assumptions!$C$25)*('Step 3-Refrigerators'!$F$47+'Step 3-Stand-Alone Freezers'!$F$53)","v":{"v":0,"d":"0.0"}},{"$f":"D46*Assumptions!$B$37","v":{"v":0,"d":"0.0"}},{"$f":"E46*Assumptions!$D$7*(1/1000)","v":{"v":0,"d":"0.0"}},null,{"$f":"E46*Assumptions!$C$7","v":{"v":0,"d":"0.0"}}]
["HFC-245fa","HFC-245fa","HFC-134a Stockpiling with Intent to Reclaim",{"$f":"(1-Assumptions!$C$25)*('Step 3-Refrigerators'!$F$52+'Step 3-Stand-Alone Freezers'!$F$58)","v":{"v":0,"d":"0.0"}},{"$f":"D47*Assumptions!$B$37","v":{"v":0,"d":"0.0"}},{"$f":"E47*Assumptions!$D$9*(1/1000)","v":{"v":0,"d":"0.0"}},null,{"$f":"E47*Assumptions!$C$9","v":{"v":0,"d":"0.0"}}]
["HFC-134a","HFC-134a","HFC-245fa Stockpiling with Intent to Reclaim",{"$f":"(1-Assumptions!$C$25)*('Step 3-Refrigerators'!$F$57+'Step 3-Stand-Alone Freezers'!$F$63)","v":{"v":0,"d":"0.0"}},{"$f":"D48*Assumptions!$B$37","v":{"v":0,"d":"0.0"}},{"$f":"E48*Assumptions!$D$15*(1/1000)","v":{"v":0,"d":"0.0"}},null,{"$f":"E48*Assumptions!$C$15","v":{"v":0,"d":"0.0"}}]
[null,null,"Stockpiling with Intent to Reclaim",{"$f":"SUM(D45:D48)","v":{"v":0,"d":"0.0"}},{"$f":"SUM(E45:E48)","v":{"v":0,"d":"0.0"}},{"$f":"SUM(F45:F48)","v":{"v":0,"d":"0.0"}},null,{"$f":"SUM(H45:H48)","v":{"v":0,"d":"0.0"}}]
[null,null,"CFC-11 Destroyed",{"$f":"(1-Assumptions!$C$24)*('Step 3-Refrigerators'!$F$43)+(1-Assumptions!$C$24)*('Step 3-Stand-Alone Freezers'!$F$49)","v":{"v":0,"d":"0.0"}},{"$f":"D50*Assumptions!$B$37","v":{"v":0,"d":"0.0"}},{"$f":"E50*Assumptions!$D$6*(1/1000)","v":{"v":0,"d":"0.0"}},null,{"$f":"E50*Assumptions!$C$6","v":{"v":0,"d":"0.0"}}]
[null,null,"HCFC-141b Destroyed",{"$f":"(1-Assumptions!$C$24)*('Step 3-Refrigerators'!$F$48)+(1-Assumptions!$C$24)*('Step 3-Stand-Alone Freezers'!$F$54)","v":{"v":0,"d":"0.0"}},{"$f":"D51*Assumptions!$B$37","v":{"v":0,"d":"0.0"}},{"$f":"E51*Assumptions!$D$7*(1/1000)","v":{"v":0,"d":"0.0"}},null,{"$f":"E51*Assumptions!$C$7","v":{"v":0,"d":"0.0"}}]
["HFC-245fa","HFC-245fa","HFC-134a Destroyed",{"$f":"(1-Assumptions!$C$24)*('Step 3-Refrigerators'!$F$53)+(1-Assumptions!$C$24)*('Step 3-Stand-Alone Freezers'!$F$59)","v":{"v":0,"d":"0.0"}},{"$f":"D52*Assumptions!$B$37","v":{"v":0,"d":"0.0"}},{"$f":"E52*Assumptions!$D$9*(1/1000)","v":{"v":0,"d":"0.0"}},null,{"$f":"E52*Assumptions!$C$9","v":{"v":0,"d":"0.0"}}]
["HFC-134a","HFC-134a","HFC-245fa Destroyed",{"$f":"(1-Assumptions!$C$24)*('Step 3-Refrigerators'!$F$58)+(1-Assumptions!$C$24)*('Step 3-Stand-Alone Freezers'!$F$64)","v":{"v":0,"d":"0.0"}},{"$f":"D53*Assumptions!$B$37","v":{"v":0,"d":"0.0"}},{"$f":"E53*Assumptions!$D$15*(1/1000)","v":{"v":0,"d":"0.0"}},null,{"$f":"E53*Assumptions!$C$15","v":{"v":0,"d":"0.0"}}]
[null,null,"Destroyed",{"$f":"SUM(D50:D53)","v":{"v":0,"d":"0.0"}},{"$f":"SUM(E50:E53)","v":{"v":0,"d":"0.0"}},{"$f":"SUM(F50:F53)","v":{"v":0,"d":"0.0"}},null,{"$f":"SUM(H50:H53)","v":{"v":0,"d":"0.0"}}]
[null,null,"CFC-11 Stockpiling with Intent to Destroy",{"$f":"(1-Assumptions!$C$24)*('Step 3-Refrigerators'!$F$44)+(1-Assumptions!$C$24)*('Step 3-Stand-Alone Freezers'!$F$50)","v":{"v":0,"d":"0.0"}},{"$f":"D55*Assumptions!$B$37","v":{"v":0,"d":"0.0"}},{"$f":"E55*Assumptions!$D$6*(1/1000)","v":{"v":0,"d":"0.0"}},null,{"$f":"E55*Assumptions!$C$6","v":{"v":0,"d":"0.0"}}]
[null,null,"HCFC-141b Stockpiling with Intent to Destroy",{"$f":"(1-Assumptions!$C$24)*('Step 3-Refrigerators'!$F$49)+(1-Assumptions!$C$24)*('Step 3-Stand-Alone Freezers'!$F$55)","v":{"v":0,"d":"0.0"}},{"$f":"D56*Assumptions!$B$37","v":{"v":0,"d":"0.0"}},{"$f":"E56*Assumptions!$D$7*(1/1000)","v":{"v":0,"d":"0.0"}},null,{"$f":"E56*Assumptions!$C$7","v":{"v":0,"d":"0.0"}}]
["HFC-245fa","HFC-245fa","HFC-134a Stockpiling with Intent to Destroy",{"$f":"(1-Assumptions!$C$24)*('Step 3-Refrigerators'!$F$54)+(1-Assumptions!$C$24)*('Step 3-Stand-Alone Freezers'!$F$60)","v":{"v":0,"d":"0.0"}},{"$f":"D57*Assumptions!$B$37","v":{"v":0,"d":"0.0"}},{"$f":"E57*Assumptions!$D$9*(1/1000)","v":{"v":0,"d":"0.0"}},null,{"$f":"E57*Assumptions!$C$9","v":{"v":0,"d":"0.0"}}]
["HFC-134a","HFC-134a","HFC-245fa Stockpiling with Intent to Destroy",{"$f":"(1-Assumptions!$C$24)*('Step 3-Refrigerators'!$F$59)+(1-Assumptions!$C$24)*('Step 3-Stand-Alone Freezers'!$F$65)","v":{"v":0,"d":"0.0"}},{"$f":"D58*Assumptions!$B$37","v":{"v":0,"d":"0.0"}},{"$f":"E58*Assumptions!$D$15*(1/1000)","v":{"v":0,"d":"0.0"}},null,{"$f":"E58*Assumptions!$C$15","v":{"v":0,"d":"0.0"}}]
[null,null,"Stockpiling with Intent to Destroy",{"$f":"SUM(D55:D58)","v":{"v":0,"d":"0.0"}},{"$f":"SUM(E55:E58)","v":{"v":0,"d":"0.0"}},{"$f":"SUM(F55:F58)","v":{"v":0,"d":"0.0"}},null,{"$f":"SUM(H55:H58)","v":{"v":0,"d":"0.0"}}]
[null,null,"Subtotal",{"$f":"SUM(D44,D49,D54,D59)","v":{"v":0,"d":"0.0"}},{"$f":"SUM(E44,E49,E54,E59)","v":{"v":0,"d":"0.0"}},{"$f":"SUM(F44,F49,F54,F59)","v":{"v":0,"d":"0.0"}},null,{"$f":"SUM(H44,H49,H54,H59)","v":{"v":0,"d":"0.0"}}]
[null,null,"Durable Materials"]
[null,null,"Ferrous Metal Recycled",{"$f":"'Step 3-Refrigerators'!$F$62+'Step 3-Stand-Alone Freezers'!$F$68+'Step 3-Dehumidifiers'!$F$51+'Step 3-Air-Conditioning Units'!$F$39","v":{"v":0,"d":"0.0"}},{"$f":"D62*Assumptions!$B$37","v":{"v":0,"d":"0.0"}},{"$f":"E62*Assumptions!E41*(-1)*(1/1000)*(1/Assumptions!$C$29)","v":{"v":0,"d":"0.0"}},null,"NA"]
[null,null,"Non-Ferrous Metal Recycled",{"$f":"'Step 3-Refrigerators'!$F$63+'Step 3-Stand-Alone Freezers'!$F$69+'Step 3-Dehumidifiers'!$F$52+'Step 3-Air-Conditioning Units'!$F$40","v":{"v":0,"d":"0.0"}},{"$f":"D63*Assumptions!$B$37","v":{"v":0,"d":"0.0"}},{"$f":"E63*Assumptions!E42*(-1)*(1/1000)*(1/Assumptions!$C$29)","v":{"v":0,"d":"0.0"}},null,"NA"]
[null,null,"Plastic Recycled",{"$f":"'Step 3-Refrigerators'!$F$64+'Step 3-Stand-Alone Freezers'!$F$70+'Step 3-Dehumidifiers'!$F$53+'Step 3-Air-Conditioning Units'!$F$41","v":{"v":0,"d":"0.0"}},{"$f":"D64*Assumptions!$B$37","v":{"v":0,"d":"0.0"}},{"$f":"E64*Assumptions!E44*(-1)*(1/1000)*(1/Assumptions!$C$29)","v":{"v":0,"d":"0.0"}},null,"NA"]
[null,null,"Glass Recycled",{"$f":"'Step 3-Refrigerators'!$F$65","v":{"v":0,"d":"0.0"}},{"$f":"D65*Assumptions!$B$37","v":{"v":0,"d":"0.0"}},{"$f":"E65*Assumptions!E45*(-1)*(1/1000)*(1/Assumptions!$C$29)","v":{"v":0,"d":"0.0"}},null,"NA"]
[null,null,"Subtotal",{"$f":"SUM(D62:D65 )","v":{"v":0,"d":"0.0"}},{"$f":"SUM(E62:E65 )","v":{"v":0,"d":"0.0"}},{"$f":"SUM(F62:G65)","v":{"v":0,"d":"0.0"}},null,"NA"]
[null,null,"Removing Units from the Grid"]
[null,null,"Subtotal Energy Savings","NA","NA",{"$f":"IFERROR('Step 5-Energy Impacts '!F14*(Assumptions!$B$32/Assumptions!$B$31),\"\")","v":{"v":0,"d":"0.0"}},null,"NA"]
[null,null,"TOTAL","NA","NA",{"$f":"SUM(F60,F38,F66,F68)","v":{"v":0,"d":"0.000"}},null,{"$f":"SUM(H60,H38)","v":{"v":0,"d":"0.0"}}]
[null,null,"NA = not applicable."]
[null,null,"aGWP = global warming potential; the ratio of heat trapped by one unit mass of a gas to that of one unit mass of carbon dioxide. Calculations are based on the direct 100-year GWPs provided in the Intergovernmental Panel on Climate Change Fourth Assessment Report: Climate Change 2007."]
[]
[null,null,"bODP = ozone depleting potential; the ratio of calculated ozone column change for each mass unit of a gas emitted into the atmosphere relative to the calculated depletion for the reference gas CFC-11 (ODP = 1.0). For calculation purposes, ODPs defined in the Montreal Protocol are used."]
[]
[null,null,"cRefrigerant assumptions: destruction results in emissions of 0.01% (assuming destruction occurs using a TEAP-approved technology, with DRE of 99.99%); the reclamation process results in emissions of 1.5%."]
[null,null,"dFoam-blowing agent assumptions: destruction results in emissions of 0.09% (assuming destruction occurs in a municipal solid waste incinerator or waste-to-energy facility with a DRE of 99.91%); the reclamation process results in emissions of 1.5%; baseline emissions are assumed to be 100% (i.e., no anaerobic degradation of CFC blowing agent in landfills is assumed)."]
[]
[null,null,"Hazardous Materials Recovered"]
[null,null,"The table below presents the amounts of hazardous materials avoided from being released to the environment as a result of your program."]
[null,null,"Properly Recovered Component","Total Amount"]
[null,null,"Used Oil Recycled or Properly Disposed (gal)",{"$f":"SUM('Step 3-Refrigerators'!F60:F61,'Step 3-Stand-Alone Freezers'!F66:F67,'Step 3-Air-Conditioning Units'!F37:F38,'Step 3-Dehumidifiers'!F49:F50)","v":{"v":0,"d":"0.0"}}]
[null,null,"PCB-Containing Capacitors"]
[null,null,"Number Destroyed",{"$f":"'Step 3-Refrigerators'!$F$66+'Step 3-Stand-Alone Freezers'!$F$71+'Step 3-Dehumidifiers'!$F$54+'Step 3-Air-Conditioning Units'!$F$42","v":0}]
[null,null,"Mercury-Containing Components"]
[null,null,"Number Recycled",{"$f":"'Step 3-Stand-Alone Freezers'!$F$72","v":0}]
[null,null,"Number Disposed",{"$f":"'Step 3-Stand-Alone Freezers'!$F$73","v":0}]
[]
[null,null,{"$f":"'Instructions & Definitions'!C57","v":"EPA Form Number: 5900-482"}]

{"sheet":"Step 5-Env Benefits (B)","index":14,"n_rows":86,"n_cols":8,"rows_kept":86,"hidden":true,"merged":[[1,7,1,8],[3,2,3,7],[5,2,5,7],[6,2,7,2],[6,3,6,4],[6,5,7,6],[6,7,7,7],[9,5,9,6],[10,5,10,6],[11,5,11,6],[12,5,12,6],[13,5,13,6],[14,5,14,6],[15,5,15,6],[16,5,16,6],[17,5,17,6],[18,5,18,6],[19,5,19,6],[20,5,20,6],[21,5,21,6],[22,5,22,6],[23,5,23,6],[24,5,24,6],[25,5,25,6],[26,5,26,6],[27,5,27,6],[28,5,28,6],[29,5,29,6],[30,5,30,6],[31,5,31,6],[32,5,32,6],[33,5,33,6],[34,5,34,6],[35,5,35,6],[36,5,36,6],[37,5,37,6],[39,5,39,6],[40,5,40,6],[41,5,41,6],[42,5,42,6],[43,5,43,6],[44,5,44,6],[45,5,45,6],[46,5,46,6],[47,5,47,6],[48,5,48,6],[49,5,49,6],[50,5,50,6],[51,5,51,6],[52,5,52,6],[53,5,53,6],[54,5,54,6],[55,5,55,6],[56,5,56,6],[57,5,57,6],[58,5,58,6],[59,5,59,6],[61,5,61,6],[62,5,62,6],[63,5,63,6],[64,5,64,6],[65,5,65,6],[67,5,67,6],[68,5,68,6],[70,2,70,7],[71,2,71,7],[72,2,72,7],[73,2,73,7],[74,2,74,7],[75,2,75,7],[77,2,77,3],[78,2,78,7],[80,5,80,6]]}
[]
[]
[null,null,"Step 4: Summary of Program's Environmental Benefits"]
[null,null,"Instructions: No action is required. The tables below are for reference only and are self-populated based on the activity data reported in the Step 3 worksheet(s). "]
[null,null,"Emissions Avoided"]
[null,null,"The table below presents the cumulative avoided emissions of greenhouse gas and ozone depleting substances resulting from your program. It is calculated based on assumptions of destruction and reclamation efficiencies developed by the U.S. EPA.  \nNote: It is assumed that removing units from the electricity grid will only result in environmental benefits if your program offers an incentive to retire old, working appliances.  In addition, the estimated ozone and greenhouse gas benefits associated with avoided releases of refrigerant and foam-blowing agent are subject to change as more information becomes available (e.g., regarding loss rates associated with various recovery technologies and practices, baseline emissions, global warming potentials [GWPs], etc.)."]
[null,null,"Appliance Component","Total Amount Prevented from Being Emitted",null,"Greenhouse Gas (GHG) Emissions Avoided (MtCO2eq)a",null,"Ozone Depleting Substances (ODS) Emissions Avoided (ODP-Weighted kg)b"]
[{"$nulls":3},"(lb)","(kg)"]
[null,null,"Refrigerantc"]
[null,null,{"$f":"'Step 5-Env Benefits'!C10","v":"CFC-12 Reclaimed"},{"$f":"(1-Assumptions!$C$21)*(SUM('Step 3-Refrigerators (B)'!$F$29)+SUM('Step 3-Stand-Alone Freezers (B)'!$F$30)+SUM('Step 3-Dehumidifiers (B)'!$F$24))","v":{"v":0,"d":"0.0"}},{"$f":"D10*Assumptions!$B$37","v":{"v":0,"d":"0.0"}},{"$f":"E10*Assumptions!$D$8*(1/1000)","v":{"v":0,"d":"0.0"}},null,{"$f":"E10*Assumptions!$C$8","v":{"v":0,"d":"0.0"}}]
[null,null,{"$f":"'Step 5-Env Benefits'!C11","v":"HCFC-22 Reclaimed"},{"$f":"(1-Assumptions!$C$21)*(SUM('Step 3-Stand-Alone Freezers (B)'!$F$35)+SUM('Step 3-Dehumidifiers (B)'!$F$29)+SUM('Step 3-Air-Conditioning Uni (B)'!$F$22))","v":{"v":0,"d":"0.0"}},{"$f":"D11*Assumptions!$B$37","v":{"v":0,"d":"0.0"}},{"$f":"E11*Assumptions!$D$10*(1/1000)","v":{"v":0,"d":"0.0"}},null,{"$f":"E11*Assumptions!$C$10","v":{"v":0,"d":"0.0"}}]
[null,null,{"$f":"'Step 5-Env Benefits'!C12","v":"HFC-134a Reclaimed"},{"$f":"(1-Assumptions!$C$21)*SUM('Step 3-Refrigerators (B)'!$F$34)+(1-Assumptions!$C$21)*SUM('Step 3-Stand-Alone Freezers (B)'!$F$40)+(1-Assumptions!$C$21)*SUM('Step 3-Dehumidifiers (B)'!$F$34)","v":{"v":0,"d":"0.0"}},{"$f":"D12*Assumptions!$B$37","v":{"v":0,"d":"0.0"}},{"$f":"E12*Assumptions!$D$9*(1/1000)","v":{"v":0,"d":"0.0"}},null,{"$f":"E12*Assumptions!$C$9","v":{"v":0,"d":"0.0"}}]
[null,null,{"$f":"'Step 5-Env Benefits'!C13","v":"R-500 Reclaimed"},{"$f":"(1-Assumptions!$C$21)*SUM('Step 3-Dehumidifiers (B)'!$F$39)","v":{"v":0,"d":"0.0"}},{"$f":"D13*Assumptions!$B$37","v":{"v":0,"d":"0.0"}},{"$f":"E13*Assumptions!$D$12*(1/1000)","v":{"v":0,"d":"0.0"}},null,{"$f":"E13*Assumptions!$C$12","v":{"v":0,"d":"0.0"}}]
[null,null,{"$f":"'Step 5-Env Benefits'!C14","v":"R-407C Reclaimed"},{"$f":"(1-Assumptions!$C$21)*SUM('Step 3-Air-Conditioning Uni (B)'!$F$27)","v":{"v":0,"d":"0.0"}},{"$f":"D14*Assumptions!$B$37","v":{"v":0,"d":"0.0"}},{"$f":"E14*Assumptions!$D$14*(1/1000)","v":{"v":0,"d":"0.0"}},null,{"$f":"E14*Assumptions!$C$14","v":{"v":0,"d":"0.0"}}]
[null,null,{"$f":"'Step 5-Env Benefits'!C15","v":"R-410A Reclaimed"},{"v":0,"d":"0.0"},{"$f":"D15*Assumptions!$B$37","v":{"v":0,"d":"0.0"}},{"$f":"E15*Assumptions!$D$13*(1/1000)","v":{"v":0,"d":"0.0"}},null,{"$f":"E15*Assumptions!$C$13","v":{"v":0,"d":"0.0"}}]
[null,null,{"$f":"'Step 5-Env Benefits'!C16","v":"Reclaimed"},{"$f":"SUM(D10:D15)","v":{"v":0,"d":"0.0"}},{"$f":"SUM(E10:E15)","v":{"v":0,"d":"0.0"}},{"$f":"SUM(F10:F15)","v":{"v":0,"d":"0.0"}},null,{"$f":"SUM(H10:H15)","v":{"v":0,"d":"0.0"}}]
[null,null,{"$f":"'Step 5-Env Benefits'!C17","v":"CFC-12 Stockpiling with Intent to Reclaim"},{"$f":"(1-Assumptions!$C$21)*(SUM('Step 3-Refrigerators (B)'!$F$30)+SUM('Step 3-Stand-Alone Freezers (B)'!$F$31)+SUM('Step 3-Dehumidifiers (B)'!$F$25))","v":{"v":0,"d":"0.0"}},{"$f":"D17*Assumptions!$B$37","v":{"v":0,"d":"0.0"}},{"$f":"E17*Assumptions!$D$8*(1/1000)","v":{"v":0,"d":"0.0"}},null,{"$f":"E17*Assumptions!$C$8","v":{"v":0,"d":"0.0"}}]
[null,null,{"$f":"'Step 5-Env Benefits'!C18","v":"HCFC-22 Stockpiling with Intent to Reclaim"},{"$f":"(1-Assumptions!$C$21)*(SUM('Step 3-Stand-Alone Freezers (B)'!$F$36)+SUM('Step 3-Dehumidifiers (B)'!$F$30)+SUM('Step 3-Air-Conditioning Uni (B)'!$F$23))","v":{"v":0,"d":"0.0"}},{"$f":"D18*Assumptions!$B$37","v":{"v":0,"d":"0.0"}},{"$f":"E18*Assumptions!$D$10*(1/1000)","v":{"v":0,"d":"0.0"}},null,{"$f":"E18*Assumptions!$C$10","v":{"v":0,"d":"0.0"}}]
[null,null,{"$f":"'Step 5-Env Benefits'!C19","v":"HFC-134a Stockpiling with Intent to Reclaim"},{"$f":"(1-Assumptions!$C$21)*SUM('Step 3-Refrigerators (B)'!$F$35)+(1-Assumptions!$C$21)*SUM('Step 3-Stand-Alone Freezers (B)'!$F$41)+(1-Assumptions!$C$21)*SUM('Step 3-Dehumidifiers (B)'!$F$35)","v":{"v":0,"d":"0.0"}},{"$f":"D19*Assumptions!$B$37","v":{"v":0,"d":"0.0"}},{"$f":"E19*Assumptions!$D$9*(1/1000)","v":{"v":0,"d":"0.0"}},null,{"$f":"E19*Assumptions!$C$9","v":{"v":0,"d":"0.0"}}]
[null,null,{"$f":"'Step 5-Env Benefits'!C20","v":"R-500 Stockpiling with Intent to Reclaim"},{"$f":"(1-Assumptions!$C$21)*SUM('Step 3-Dehumidifiers (B)'!$F$40)","v":{"v":0,"d":"0.0"}},{"$f":"D20*Assumptions!$B$37","v":{"v":0,"d":"0.0"}},{"$f":"E20*Assumptions!$D$12*(1/1000)","v":{"v":0,"d":"0.0"}},null,{"$f":"E20*Assumptions!$C$12","v":{"v":0,"d":"0.0"}}]
[null,null,{"$f":"'Step 5-Env Benefits'!C21","v":"R-407C Stockpiling with Intent to Reclaim"},{"$f":"(1-Assumptions!$C$21)*SUM('Step 3-Air-Conditioning Uni (B)'!$F$28)","v":{"v":0,"d":"0.0"}},{"$f":"D21*Assumptions!$B$37","v":{"v":0,"d":"0.0"}},{"$f":"E21*Assumptions!$D$14*(1/1000)","v":{"v":0,"d":"0.0"}},null,{"$f":"E21*Assumptions!$C$14","v":{"v":0,"d":"0.0"}}]
[null,null,{"$f":"'Step 5-Env Benefits'!C22","v":"R-410A Stockpiling with Intent to Reclaim"},{"$f":"(1-Assumptions!$C$21)*SUM('Step 3-Air-Conditioning Uni (B)'!$F$33)+(1-Assumptions!$C$21)*SUM('Step 3-Dehumidifiers (B)'!$F$45)","v":{"v":0,"d":"0.0"}},{"$f":"D22*Assumptions!$B$37","v":{"v":0,"d":"0.0"}},{"$f":"E22*Assumptions!$D$13*(1/1000)","v":{"v":0,"d":"0.0"}},null,{"$f":"E22*Assumptions!$C$13","v":{"v":0,"d":"0.0"}}]
[null,null,{"$f":"'Step 5-Env Benefits'!C23","v":"Stockpiling with Intent to Reclaim"},{"$f":"SUM(D17:D22)","v":{"v":0,"d":"0.0"}},{"$f":"SUM(E17:E22)","v":{"v":0,"d":"0.0"}},{"$f":"SUM(F17:F22)","v":{"v":0,"d":"0.0"}},null,{"$f":"SUM(H17:H22)","v":{"v":0,"d":"0.0"}}]
[null,null,{"$f":"'Step 5-Env Benefits'!C24","v":"CFC-12 Destroyed"},{"$f":"(1-Assumptions!$C$20)*(SUM('Step 3-Refrigerators (B)'!$F$31)+SUM('Step 3-Stand-Alone Freezers (B)'!$F$32)+SUM('Step 3-Dehumidifiers (B)'!$F$26))","v":{"v":0,"d":"0.0"}},{"$f":"D24*Assumptions!$B$37","v":{"v":0,"d":"0.0"}},{"$f":"E24*Assumptions!$D$8*(1/1000)","v":{"v":0,"d":"0.0"}},null,{"$f":"E24*Assumptions!$C$8","v":{"v":0,"d":"0.0"}}]
[null,null,{"$f":"'Step 5-Env Benefits'!C25","v":"HCFC-22 Destroyed"},{"$f":"(1-Assumptions!$C$21)*(SUM('Step 3-Stand-Alone Freezers (B)'!$F$37)+SUM('Step 3-Dehumidifiers (B)'!$F$31)+SUM('Step 3-Air-Conditioning Uni (B)'!$F$24))","v":{"v":0,"d":"0.0"}},{"$f":"D25*Assumptions!$B$37","v":{"v":0,"d":"0.0"}},{"$f":"E25*Assumptions!$D$10*(1/1000)","v":{"v":0,"d":"0.0"}},null,{"$f":"E25*Assumptions!$C$10","v":{"v":0,"d":"0.0"}}]
[null,null,{"$f":"'Step 5-Env Benefits'!C26","v":"HFC-134a Destroyed"},{"$f":"(1-Assumptions!$C$20)*SUM('Step 3-Refrigerators (B)'!$F$36)+(1-Assumptions!$C$20)*SUM('Step 3-Stand-Alone Freezers (B)'!$F$42)+SUM(1-Assumptions!$C$20)*SUM('Step 3-Dehumidifiers (B)'!$F$36)","v":{"v":0,"d":"0.0"}},{"$f":"D26*Assumptions!$B$37","v":{"v":0,"d":"0.0"}},{"$f":"E26*Assumptions!$D$9*(1/1000)","v":{"v":0,"d":"0.0"}},null,{"$f":"E26*Assumptions!$C$9","v":{"v":0,"d":"0.0"}}]
[null,null,{"$f":"'Step 5-Env Benefits'!C27","v":"R-500 Destroyed"},{"$f":"(1-Assumptions!$C$21)*SUM('Step 3-Dehumidifiers (B)'!$F$41)","v":{"v":0,"d":"0.0"}},{"$f":"D27*Assumptions!$B$37","v":{"v":0,"d":"0.0"}},{"$f":"E27*Assumptions!$D$12*(1/1000)","v":{"v":0,"d":"0.0"}},null,{"$f":"E27*Assumptions!$C$12","v":{"v":0,"d":"0.0"}}]
[null,null,{"$f":"'Step 5-Env Benefits'!C28","v":"R-407C Destroyed"},{"$f":"(1-Assumptions!$C$20)*SUM('Step 3-Air-Conditioning Uni (B)'!$F$29)","v":{"v":0,"d":"0.0"}},{"$f":"D28*Assumptions!$B$37","v":{"v":0,"d":"0.0"}},{"$f":"E28*Assumptions!$D$14*(1/1000)","v":{"v":0,"d":"0.0"}},null,{"$f":"E28*Assumptions!$C$14","v":{"v":0,"d":"0.0"}}]
[null,null,{"$f":"'Step 5-Env Benefits'!C29","v":"R-410A Destroyed"},{"$f":"(1-Assumptions!$C$20)*SUM('Step 3-Air-Conditioning Uni (B)'!$F$34)+(1-Assumptions!$C$20)*SUM('Step 3-Dehumidifiers (B)'!$F$46)","v":{"v":0,"d":"0.0"}},{"$f":"D29*Assumptions!$B$37","v":{"v":0,"d":"0.0"}},{"$f":"E29*Assumptions!$D$13*(1/1000)","v":{"v":0,"d":"0.0"}},null,{"$f":"E29*Assumptions!$C$13","v":{"v":0,"d":"0.0"}}]
[null,null,{"$f":"'Step 5-Env Benefits'!C30","v":"Destroyed"},{"$f":"SUM(D24:D29)","v":{"v":0,"d":"0.0"}},{"$f":"SUM(E24:E29)","v":{"v":0,"d":"0.0"}},{"$f":"SUM(F24:F29)","v":{"v":0,"d":"0.0"}},null,{"$f":"SUM(H24:H29)","v":{"v":0,"d":"0.0"}}]
[null,null,{"$f":"'Step 5-Env Benefits'!C31","v":"CFC-12 Stockpiling with Intent to Destroy"},{"$f":"(1-Assumptions!$C$20)*(SUM('Step 3-Refrigerators (B)'!$F$32)+SUM('Step 3-Stand-Alone Freezers (B)'!$F$33)+SUM('Step 3-Dehumidifiers (B)'!$F$27))","v":{"v":0,"d":"0.0"}},{"$f":"D31*Assumptions!$B$37","v":{"v":0,"d":"0.0"}},{"$f":"E31*Assumptions!$D$8*(1/1000)","v":{"v":0,"d":"0.0"}},null,{"$f":"E31*Assumptions!$C$8","v":{"v":0,"d":"0.0"}}]
[null,null,{"$f":"'Step 5-Env Benefits'!C32","v":"HCFC-22 Stockpiling with Intent to Destroy"},{"$f":"(1-Assumptions!$C$21)*(SUM('Step 3-Stand-Alone Freezers (B)'!$F$38)+SUM('Step 3-Dehumidifiers (B)'!$F$32)+SUM('Step 3-Air-Conditioning Uni (B)'!$F$25))","v":{"v":0,"d":"0.0"}},{"$f":"D32*Assumptions!$B$37","v":{"v":0,"d":"0.0"}},{"$f":"E32*Assumptions!$D$10*(1/1000)","v":{"v":0,"d":"0.0"}},null,{"$f":"E32*Assumptions!$C$10","v":{"v":0,"d":"0.0"}}]
[null,null,{"$f":"'Step 5-Env Benefits'!C33","v":"HFC-134a Stockpiling with Intent to Destroy"},{"$f":"(1-Assumptions!$C$20)*SUM('Step 3-Refrigerators (B)'!$F$37)+(1-Assumptions!$C$20)*SUM('Step 3-Stand-Alone Freezers (B)'!$F$43)+SUM(1-Assumptions!$C$20)*SUM('Step 3-Dehumidifiers (B)'!$F$37)","v":{"v":0,"d":"0.0"}},{"$f":"D33*Assumptions!$B$37","v":{"v":0,"d":"0.0"}},{"$f":"E33*Assumptions!$D$9*(1/1000)","v":{"v":0,"d":"0.0"}},null,{"$f":"E33*Assumptions!$C$9","v":{"v":0,"d":"0.0"}}]
[null,null,{"$f":"'Step 5-Env Benefits'!C34","v":"R-500 Stockpiling with Intent to Destroy"},{"$f":"(1-Assumptions!$C$21)*SUM('Step 3-Dehumidifiers (B)'!$F$42)","v":{"v":0,"d":"0.0"}},{"$f":"D34*Assumptions!$B$37","v":{"v":0,"d":"0.0"}},{"$f":"E34*Assumptions!$D$12*(1/1000)","v":{"v":0,"d":"0.0"}},null,{"$f":"E34*Assumptions!$C$12","v":{"v":0,"d":"0.0"}}]
[null,null,{"$f":"'Step 5-Env Benefits'!C35","v":"R-407C Stockpiling with Intent to Destroy"},{"$f":"(1-Assumptions!$C$20)*SUM('Step 3-Air-Conditioning Uni (B)'!$F$30)","v":{"v":0,"d":"0.0"}},{"$f":"D35*Assumptions!$B$37","v":{"v":0,"d":"0.0"}},{"$f":"E35*Assumptions!$D$14*(1/1000)","v":{"v":0,"d":"0.0"}},null,{"$f":"E35*Assumptions!$C$14","v":{"v":0,"d":"0.0"}}]
[null,null,{"$f":"'Step 5-Env Benefits'!C36","v":"R-410A Stockpiling with Intent to Destroy"},{"$f":"(1-Assumptions!$C$20)*SUM('Step 3-Air-Conditioning Uni (B)'!$F$35)+(1-Assumptions!$C$20)*SUM('Step 3-Dehumidifiers (B)'!$F$47)","v":{"v":0,"d":"0.0"}},{"$f":"D36*Assumptions!$B$37","v":{"v":0,"d":"0.0"}},{"$f":"E36*Assumptions!$D$13*(1/1000)","v":{"v":0,"d":"0.0"}},null,{"$f":"E36*Assumptions!$C$13","v":{"v":0,"d":"0.0"}}]
[null,null,{"$f":"'Step 5-Env Benefits'!C37","v":"Stockpiling with Intent to Destroy"},{"$f":"SUM(D31:D36)","v":{"v":0,"d":"0.0"}},{"$f":"SUM(E31:E36)","v":{"v":0,"d":"0.0"}},{"$f":"SUM(F31:F36)","v":{"v":0,"d":"0.0"}},null,{"$f":"SUM(H31:H36)","v":{"v":0,"d":"0.0"}}]
[null,null,{"$f":"'Step 5-Env Benefits'!C38","v":"Subtotal"},{"$f":"SUM(D16,D23,D30,D37)","v":{"v":0,"d":"0.0"}},{"$f":"SUM(E16,E30,E23,E37)","v":{"v":0,"d":"0.0"}},{"$f":"SUM(F16,F30,F23,F37)","v":{"v":0,"d":"0.0"}},null,{"$f":"SUM(H16,H30,H23,H37)","v":{"v":0,"d":"0.0"}}]
[null,null,{"$f":"'Step 5-Env Benefits'!C39","v":"Foam-Blowing Agentd"}]
[null,null,{"$f":"'Step 5-Env Benefits'!C40","v":"CFC-11 Reclaimed"},{"$f":"(1-Assumptions!$C$25)*SUM('Step 3-Refrigerators (B)'!$F$39)+(1-Assumptions!$C$25)*SUM('Step 3-Stand-Alone Freezers (B)'!$F$45)","v":{"v":0,"d":"0.0"}},{"$f":"D40*Assumptions!$B$37","v":{"v":0,"d":"0.0"}},{"$f":"E40*Assumptions!$D$6*(1/1000)","v":{"v":0,"d":"0.0"}},null,{"$f":"E40*Assumptions!$C$6","v":{"v":0,"d":"0.0"}}]
[null,null,{"$f":"'Step 5-Env Benefits'!C41","v":"HCFC-141b Reclaimed"},{"$f":"(1-Assumptions!$C$25)*SUM('Step 3-Refrigerators (B)'!$F$44)+(1-Assumptions!$C$25)*SUM('Step 3-Stand-Alone Freezers (B)'!$F$50)","v":{"v":0,"d":"0.0"}},{"$f":"D41*Assumptions!$B$37","v":{"v":0,"d":"0.0"}},{"$f":"E41*Assumptions!$D$7*(1/1000)","v":{"v":0,"d":"0.0"}},null,{"$f":"E41*Assumptions!$C$7","v":{"v":0,"d":"0.0"}}]
[null,null,{"$f":"'Step 5-Env Benefits'!C42","v":"HFC-134a Reclaimed"},{"$f":"(1-Assumptions!$C$25)*SUM('Step 3-Refrigerators (B)'!$F$49)+(1-Assumptions!$C$25)*SUM('Step 3-Stand-Alone Freezers (B)'!$F$55)","v":{"v":0,"d":"0.0"}},{"$f":"D42*Assumptions!$B$37","v":{"v":0,"d":"0.0"}},{"$f":"E42*Assumptions!$D$9*(1/1000)","v":{"v":0,"d":"0.0"}},null,{"$f":"E42*Assumptions!$C$9","v":{"v":0,"d":"0.0"}}]
[null,null,{"$f":"'Step 5-Env Benefits'!C43","v":"HFC-245fa Reclaimed"},{"$f":"(1-Assumptions!$C$25)*SUM('Step 3-Refrigerators (B)'!$F$54)+(1-Assumptions!$C$25)*SUM('Step 3-Stand-Alone Freezers (B)'!$F$60)","v":{"v":0,"d":"0.0"}},{"$f":"D43*Assumptions!$B$37","v":{"v":0,"d":"0.0"}},{"$f":"E43*Assumptions!$D15*(1/1000)","v":{"v":0,"d":"0.0"}},null,{"$f":"E43*Assumptions!$C$15","v":{"v":0,"d":"0.0"}}]
[null,null,{"$f":"'Step 5-Env Benefits'!C44","v":"Reclaimed"},{"$f":"SUM(D40:D43)","v":{"v":0,"d":"0.0"}},{"$f":"SUM(E40:E43)","v":{"v":0,"d":"0.0"}},{"$f":"SUM(F40:F43)","v":{"v":0,"d":"0.0"}},null,{"$f":"SUM(H40:H43)","v":{"v":0,"d":"0.0"}}]
[null,null,{"$f":"'Step 5-Env Benefits'!C45","v":"CFC-11 Stockpiling with Intent to Reclaim"},{"$f":"(1-Assumptions!$C$25)*SUM('Step 3-Refrigerators (B)'!$F$40)+(1-Assumptions!$C$25)*SUM('Step 3-Stand-Alone Freezers (B)'!$F$46)","v":{"v":0,"d":"0.0"}},{"$f":"D45*Assumptions!$B$37","v":{"v":0,"d":"0.0"}},{"$f":"E45*Assumptions!$D$6*(1/1000)","v":{"v":0,"d":"0.0"}},null,{"$f":"E45*Assumptions!$C$6","v":{"v":0,"d":"0.0"}}]
[null,null,{"$f":"'Step 5-Env Benefits'!C46","v":"HCFC-141b Stockpiling with Intent to Reclaim"},{"$f":"(1-Assumptions!$C$25)*SUM('Step 3-Refrigerators (B)'!$F$45)+(1-Assumptions!$C$25)*SUM('Step 3-Stand-Alone Freezers (B)'!$F$51)","v":{"v":0,"d":"0.0"}},{"$f":"D46*Assumptions!$B$37","v":{"v":0,"d":"0.0"}},{"$f":"E46*Assumptions!$D$7*(1/1000)","v":{"v":0,"d":"0.0"}},null,{"$f":"E46*Assumptions!$C$7","v":{"v":0,"d":"0.0"}}]
[null,null,{"$f":"'Step 5-Env Benefits'!C47","v":"HFC-134a Stockpiling with Intent to Reclaim"},{"$f":"(1-Assumptions!$C$25)*SUM('Step 3-Refrigerators (B)'!$F$50)+(1-Assumptions!$C$25)*SUM('Step 3-Stand-Alone Freezers (B)'!$F$56)","v":{"v":0,"d":"0.0"}},{"$f":"D47*Assumptions!$B$37","v":{"v":0,"d":"0.0"}},{"$f":"E47*Assumptions!$D$9*(1/1000)","v":{"v":0,"d":"0.0"}},null,{"$f":"E47*Assumptions!$C$9","v":{"v":0,"d":"0.0"}}]
[null,null,{"$f":"'Step 5-Env Benefits'!C48","v":"HFC-245fa Stockpiling with Intent to Reclaim"},{"$f":"(1-Assumptions!$C$25)*SUM('Step 3-Refrigerators (B)'!$F$55)+(1-Assumptions!$C$25)*SUM('Step 3-Stand-Alone Freezers (B)'!$F$61)","v":{"v":0,"d":"0.0"}},{"$f":"D48*Assumptions!$B$37","v":{"v":0,"d":"0.0"}},{"$f":"E48*Assumptions!$D$15*(1/1000)","v":{"v":0,"d":"0.0"}},null,{"$f":"E48*Assumptions!$C$15","v":{"v":0,"d":"0.0"}}]
[null,null,{"$f":"'Step 5-Env Benefits'!C49","v":"Stockpiling with Intent to Reclaim"},{"$f":"SUM(D45:D48)","v":{"v":0,"d":"0.0"}},{"$f":"SUM(E45:E48)","v":{"v":0,"d":"0.0"}},{"$f":"SUM(F45:F48)","v":{"v":0,"d":"0.0"}},null,{"$f":"SUM(H45:H48)","v":{"v":0,"d":"0.0"}}]
[null,null,{"$f":"'Step 5-Env Benefits'!C50","v":"CFC-11 Destroyed"},{"$f":"(1-Assumptions!$C$24)*SUM('Step 3-Refrigerators (B)'!$F$41)+(1-Assumptions!$C$24)*SUM('Step 3-Stand-Alone Freezers (B)'!$F$47)","v":{"v":0,"d":"0.0"}},{"$f":"D50*Assumptions!$B$37","v":{"v":0,"d":"0.0"}},{"$f":"E50*Assumptions!$D$6*(1/1000)","v":{"v":0,"d":"0.0"}},null,{"$f":"E50*Assumptions!$C$6","v":{"v":0,"d":"0.0"}}]
[null,null,{"$f":"'Step 5-Env Benefits'!C51","v":"HCFC-141b Destroyed"},{"$f":"(1-Assumptions!$C$24)*SUM('Step 3-Refrigerators (B)'!$F$46)+(1-Assumptions!$C$24)*SUM('Step 3-Stand-Alone Freezers (B)'!$F$52)","v":{"v":0,"d":"0.0"}},{"$f":"D51*Assumptions!$B$37","v":{"v":0,"d":"0.0"}},{"$f":"E51*Assumptions!$D$7*(1/1000)","v":{"v":0,"d":"0.0"}},null,{"$f":"E51*Assumptions!$C$7","v":{"v":0,"d":"0.0"}}]
[null,null,{"$f":"'Step 5-Env Benefits'!C52","v":"HFC-134a Destroyed"},{"$f":"(1-Assumptions!$C$24)*SUM('Step 3-Refrigerators (B)'!$F$51)+(1-Assumptions!$C$24)*SUM('Step 3-Stand-Alone Freezers (B)'!$F$57)","v":{"v":0,"d":"0.0"}},{"$f":"D52*Assumptions!$B$37","v":{"v":0,"d":"0.0"}},{"$f":"E52*Assumptions!$D$9*(1/1000)","v":{"v":0,"d":"0.0"}},null,{"$f":"E52*Assumptions!$C$9","v":{"v":0,"d":"0.0"}}]
[null,null,{"$f":"'Step 5-Env Benefits'!C53","v":"HFC-245fa Destroyed"},{"$f":"(1-Assumptions!$C$24)*SUM('Step 3-Refrigerators (B)'!$F$56)+(1-Assumptions!$C$24)*SUM('Step 3-Stand-Alone Freezers (B)'!$F$62)","v":{"v":0,"d":"0.0"}},{"$f":"D53*Assumptions!$B$37","v":{"v":0,"d":"0.0"}},{"$f":"E53*Assumptions!$D$15*(1/1000)","v":{"v":0,"d":"0.0"}},null,{"$f":"E53*Assumptions!$C$15","v":{"v":0,"d":"0.0"}}]
[null,null,{"$f":"'Step 5-Env Benefits'!C54","v":"Destroyed"},{"$f":"SUM(D50:D53)","v":{"v":0,"d":"0.0"}},{"$f":"SUM(E50:E53)","v":{"v":0,"d":"0.0"}},{"$f":"SUM(F50:F53)","v":{"v":0,"d":"0.0"}},null,{"$f":"SUM(H50:I53)","v":{"v":0,"d":"0.0"}}]
[null,null,{"$f":"'Step 5-Env Benefits'!C55","v":"CFC-11 Stockpiling with Intent to Destroy"},{"$f":"(1-Assumptions!$C$24)*SUM('Step 3-Refrigerators (B)'!$F$42)+(1-Assumptions!$C$24)*SUM('Step 3-Stand-Alone Freezers (B)'!$F$48)","v":{"v":0,"d":"0.0"}},{"$f":"D55*Assumptions!$B$37","v":{"v":0,"d":"0.0"}},{"$f":"E55*Assumptions!$D$6*(1/1000)","v":{"v":0,"d":"0.0"}},null,{"$f":"E55*Assumptions!$C$6","v":{"v":0,"d":"0.0"}}]
[null,null,{"$f":"'Step 5-Env Benefits'!C56","v":"HCFC-141b Stockpiling with Intent to Destroy"},{"$f":"(1-Assumptions!$C$24)*SUM('Step 3-Refrigerators (B)'!$F$47)+(1-Assumptions!$C$24)*SUM('Step 3-Stand-Alone Freezers (B)'!$F$53)","v":{"v":0,"d":"0.0"}},{"$f":"D56*Assumptions!$B$37","v":{"v":0,"d":"0.0"}},{"$f":"E56*Assumptions!$D$7*(1/1000)","v":{"v":0,"d":"0.0"}},null,{"$f":"E56*Assumptions!$C$7","v":{"v":0,"d":"0.0"}}]
[null,null,{"$f":"'Step 5-Env Benefits'!C57","v":"HFC-134a Stockpiling with Intent to Destroy"},{"$f":"(1-Assumptions!$C$24)*SUM('Step 3-Refrigerators (B)'!$F$52)+(1-Assumptions!$C$24)*SUM('Step 3-Stand-Alone Freezers (B)'!$F$58)","v":{"v":0,"d":"0.0"}},{"$f":"D57*Assumptions!$B$37","v":{"v":0,"d":"0.0"}},{"$f":"E57*Assumptions!$D$9*(1/1000)","v":{"v":0,"d":"0.0"}},null,{"$f":"E57*Assumptions!$C$9","v":{"v":0,"d":"0.0"}}]
[null,null,{"$f":"'Step 5-Env Benefits'!C58","v":"HFC-245fa Stockpiling with Intent to Destroy"},{"$f":"(1-Assumptions!$C$24)*SUM('Step 3-Refrigerators (B)'!$F$57)+(1-Assumptions!$C$24)*SUM('Step 3-Stand-Alone Freezers (B)'!$F$63)","v":{"v":0,"d":"0.0"}},{"$f":"D58*Assumptions!$B$37","v":{"v":0,"d":"0.0"}},{"$f":"E58*Assumptions!$D$15*(1/1000)","v":{"v":0,"d":"0.0"}},null,{"$f":"E58*Assumptions!$C$15","v":{"v":0,"d":"0.0"}}]
[null,null,{"$f":"'Step 5-Env Benefits'!C59","v":"Stockpiling with Intent to Destroy"},{"$f":"SUM(D55:D58)","v":{"v":0,"d":"0.0"}},{"$f":"SUM(E55:E58)","v":{"v":0,"d":"0.0"}},{"$f":"SUM(F55:F58)","v":{"v":0,"d":"0.0"}},null,{"$f":"SUM(H55:H58)","v":{"v":0,"d":"0.0"}}]
[null,null,{"$f":"'Step 5-Env Benefits'!C60","v":"Subtotal"},{"$f":"SUM(D44,D49,D54,D59)","v":{"v":0,"d":"0.0"}},{"$f":"SUM(E44,E49,E54,E59)","v":{"v":0,"d":"0.0"}},{"$f":"SUM(F44,F49,F54,F59)","v":{"v":0,"d":"0.0"}},null,{"$f":"SUM(H44,H49,H54,H59)","v":{"v":0,"d":"0.0"}}]
[null,null,{"$f":"'Step 5-Env Benefits'!C61","v":"Durable Materials"}]
[null,null,{"$f":"'Step 5-Env Benefits'!C62","v":"Ferrous Metal Recycled"},{"$f":"SUM('Step 3-Refrigerators (B)'!$F$60)+SUM('Step 3-Stand-Alone Freezers (B)'!$F$66)+SUM('Step 3-Dehumidifiers (B)'!$F$50)+SUM('Step 3-Air-Conditioning Uni (B)'!$F$38)","v":{"v":0,"d":"0.0"}},{"$f":"D62*Assumptions!$B$37","v":{"v":0,"d":"0.0"}},{"$f":"E62*Assumptions!E41*(-1)*(1/1000)*(1/Assumptions!$C$29)","v":{"v":0,"d":"0.0"}},null,"NA"]
[null,null,{"$f":"'Step 5-Env Benefits'!C63","v":"Non-Ferrous Metal Recycled"},{"$f":"SUM('Step 3-Refrigerators (B)'!$F$61)+SUM('Step 3-Stand-Alone Freezers (B)'!$F$67)+SUM('Step 3-Dehumidifiers (B)'!$F$51)+SUM('Step 3-Air-Conditioning Uni (B)'!$F$39)","v":{"v":0,"d":"0.0"}},{"$f":"D63*Assumptions!$B$37","v":{"v":0,"d":"0.0"}},{"$f":"E63*Assumptions!E42*(-1)*(1/1000)*(1/Assumptions!$C$29)","v":{"v":0,"d":"0.0"}},null,"NA"]
[null,null,{"$f":"'Step 5-Env Benefits'!C64","v":"Plastic Recycled"},{"$f":"SUM('Step 3-Refrigerators (B)'!$F$62)+SUM('Step 3-Stand-Alone Freezers (B)'!$F$68)+SUM('Step 3-Dehumidifiers (B)'!$F$52)+SUM('Step 3-Air-Conditioning Uni (B)'!$F$40)","v":{"v":0,"d":"0.0"}},{"$f":"D64*Assumptions!$B$37","v":{"v":0,"d":"0.0"}},{"$f":"E64*Assumptions!E44*(-1)*(1/1000)*(1/Assumptions!$C$29)","v":{"v":0,"d":"0.0"}},null,"NA"]
[null,null,{"$f":"'Step 5-Env Benefits'!C65","v":"Glass Recycled"},{"$f":"SUM('Step 3-Refrigerators (B)'!$F$63)","v":{"v":0,"d":"0.0"}},{"$f":"D65*Assumptions!$B$37","v":{"v":0,"d":"0.0"}},{"$f":"E65*Assumptions!E45*(-1)*(1/1000)*(1/Assumptions!$C$29)","v":{"v":0,"d":"0.0"}},null,"NA"]
[null,null,{"$f":"'Step 5-Env Benefits'!C66","v":"Subtotal"},{"$f":"SUM(D62:D65 )","v":{"v":0,"d":"0.0"}},{"$f":"SUM(E62:E65 )","v":{"v":0,"d":"0.0"}},{"$f":"SUM(F62:G65)","v":{"v":0,"d":"0.0"}},null,"NA"]
[null,null,{"$f":"'Step 5-Env Benefits'!C67","v":"Removing Units from the Grid"}]
[null,null,{"$f":"'Step 5-Env Benefits'!C68","v":"Subtotal Energy Savings"},"NA","NA",{"$f":"'Step 5 Energy Impacts (B)'!F14*(Assumptions!$B$32/Assumptions!$B$31)","v":{"$error":"#VALUE!"}},null,"NA"]
[null,null,{"$f":"'Step 5-Env Benefits'!C69","v":"TOTAL"},"NA","NA",{"$f":"SUM(F60,F38,F66,F68)","v":{"$error":"#VALUE!"}},null,{"$f":"SUM(H60,H38)","v":{"v":0,"d":"0.0"}}]
[null,null,"NA = not applicable."]
[null,null,"aGWP = global warming potential; the ratio of heat trapped by one unit mass of a gas to that of one unit mass of carbon dioxide. Calculations are based on the direct 100-year GWPs provided in the Intergovernmental Panel on Climate Change Fourth Assessment Report: Climate Change 2007."]
[]
[null,null,"bODP = ozone depleting potential; the ratio of calculated ozone column change for each mass unit of a gas emitted into the atmosphere relative to the calculated depletion for the reference gas CFC-11 (ODP = 1.0). For calculation purposes, ODPs defined in the Montreal Protocol are used."]
[]
[null,null,"cRefrigerant assumptions: destruction results in emissions of 0.01% (assuming destruction occurs using a TEAP-approved technology, with DRE of 99.99%); the reclamation process results in emissions of 1.5%."]
[null,null,"dFoam-blowing agent assumptions: destruction results in emissions of 0.09% (assuming destruction occurs in a municipal solid waste incinerator or waste-to-energy facility with a DRE of 99.91%); the reclamation process results in emissions of 1.5%; baseline emissions are assumed to be 100% (i.e., no anaerobic degradation of CFC blowing agent in landfills is assumed)."]
[]
[null,null,"Hazardous Materials Recovered"]
[null,null,"The table below presents the amounts of hazardous materials avoided from being released to the environment as a result of your program."]
[null,null,"Properly Recovered Component","Total Amount"]
[null,null,"Used Oil Recycled or Properly Disposed (gal)",{"$f":"(SUM('Step 3-Refrigerators (B)'!$F$58)+SUM('Step 3-Stand-Alone Freezers (B)'!$F$64)+SUM('Step 3-Dehumidifiers (B)'!$F$48)+SUM('Step 3-Air-Conditioning Uni (B)'!$F$36)+SUM('Step 3-Refrigerators (B)'!$F$59)+SUM('Step 3-Stand-Alone Freezers (B)'!$F$65)+SUM('Step 3-Dehumidifiers (B)'!$F$49)+SUM('Step 3-Air-Conditioning Uni (B)'!$F$37))","v":{"v":0,"d":"0.00"}}]
[null,null,"PCB-Containing Capacitors"]
[null,null,"Number Destroyed",{"$f":"SUM('Step 3-Refrigerators (B)'!$F$64)+SUM('Step 3-Stand-Alone Freezers (B)'!$F$69)+SUM('Step 3-Dehumidifiers (B)'!$F$53)+SUM('Step 3-Air-Conditioning Uni (B)'!$F$41)","v":{"v":0,"d":"0.00"}}]
[null,null,"Mercury-Containing Components"]
[null,null,"Number Recycled",{"$f":"SUM('Step 3-Stand-Alone Freezers (B)'!$F$70)","v":{"v":0,"d":"0.00"}}]
[null,null,"Number Disposed",{"$f":"SUM('Step 3-Stand-Alone Freezers (B)'!$F$71)","v":{"v":0,"d":"0.00"}}]

{"sheet":"Step 5-Energy Impacts ","index":15,"n_rows":16,"n_cols":7,"rows_kept":16,"merged":[[1,3,1,5],[1,6,1,7],[2,2,2,6],[4,2,4,7],[8,3,8,4],[9,3,9,4],[10,3,10,4],[11,3,11,4],[12,3,12,4],[13,3,13,4]]}
[]
[]
[null,null,"Step 5: Summary of Program's Gross Energy Impacts from Removal of Old Units"]
[null,null,"(Current Period Dollars)"]
[null,null,"Instructions: No action is required. The table below is for reference only and is self-populated if data are entered in the Step 3 worksheet Energy Savings tables. Data in the table below apply to the current reporting period."]
[]
[null,null,{"$f":"IF(ISBLANK('Step 1-Contact and Program Info'!D7),\"\",'Step 1-Contact and Program Info'!D7)","v":""},{"$f":"IF('Step 1-Contact and Program Info'!J7=\"\",\"\",'Step 1-Contact and Program Info'!J7)","v":"MM/DD/YYYY"},{"$f":"IF(D7=\"\",\"\",\"to\")","v":"to"},{"$f":"IF('Step 1-Contact and Program Info'!L7=\"\",\"\",'Step 1-Contact and Program Info'!L7)","v":"MM/DD/YYYY"}]
[]
[null,null,"Appliance Type","Total # of Units Processed",null,"Total Saved Energy (kWh)","Total Savings to Residential Consumers ($)"]
[null,null,"Refrigerators ",{"$f":"'Step 3-Refrigerators'!$D$8","v":0},null,{"$f":"IFERROR($D$10*'Step 3-Refrigerators'!$E$71*'Step 3-Refrigerators'!$E$72,0)","v":{"v":0,"d":"0.0"}},{"$f":"IFERROR($F$10*'Step 3-Refrigerators'!$E$73,\"\")","v":{"v":0,"d":"$0.00"}}]
[null,null,"Stand Alone Freezers",{"$f":"'Step 3-Stand-Alone Freezers'!$D$8","v":0},null,{"$f":"IFERROR($D$11*'Step 3-Stand-Alone Freezers'!$E$78*'Step 3-Stand-Alone Freezers'!$E$79,0)","v":{"v":0,"d":"0.0"}},{"$f":"IFERROR($F$11*'Step 3-Stand-Alone Freezers'!$E$80,\"\")","v":{"v":0,"d":"$0.00"}}]
[null,null,"Air-Conditioning Units",{"$f":"'Step 3-Air-Conditioning Units'!$D$8","v":0},null,{"$f":"$D$12*'Step 3-Air-Conditioning Units'!$E$47*'Step 3-Air-Conditioning Units'!$E$48","v":{"v":0,"d":"0.0"}},{"$f":"$F$12*'Step 3-Air-Conditioning Units'!$E$49","v":{"v":0,"d":"$0.00"}}]
[null,null,"Dehumidifiers",{"$f":"'Step 3-Dehumidifiers'!$D$8","v":0},null,{"$f":"$D$13*'Step 3-Dehumidifiers'!$E$59*'Step 3-Dehumidifiers'!$E$60","v":{"v":0,"d":"0.0"}},{"$f":"$F$13*'Step 3-Dehumidifiers'!$E$61","v":{"v":0,"d":"$0.00"}}]
[null,null,"Total",{"$f":"SUM(D10:E13)","v":0},null,{"$f":"SUM(F10:F13)","v":{"v":0,"d":"0.0"}},{"$f":"SUM(G10:G13)","v":{"v":0,"d":"$0.00"}}]
[]
[null,null,{"$f":"'Instructions & Definitions'!C57","v":"EPA Form Number: 5900-482"}]

{"sheet":"Step 5 Energy Impacts (B)","index":16,"n_rows":14,"n_cols":7,"rows_kept":14,"hidden":true,"merged":[[1,3,1,5],[1,6,1,7],[2,2,2,6],[4,2,4,7],[8,3,8,4],[9,3,9,4],[10,3,10,4],[11,3,11,4],[12,3,12,4],[13,3,13,4]]}
[]
[]
[null,null,{"$f":"'Step 5-Energy Impacts '!C3:G3","v":"Step 5: Summary of Program's Gross Energy Impacts from Removal of Old Units"}]
[null,null,{"$f":"'Step 5-Energy Impacts '!C4","v":"(Current Period Dollars)"}]
[null,null,{"$f":"'Step 5-Energy Impacts '!C5:H5","v":"Instructions: No action is required. The table below is for reference only and is self-populated if data are entered in the Step 3 worksheet Energy Savings tables. Data in the table below apply to the current reporting period."}]
[]
[null,null,{"$f":"'Step 5-Energy Impacts '!C7","v":""},{"$f":"'Step 1-Contact and Program Info'!$J$7","v":"MM/DD/YYYY"},"to",{"$f":"'Step 1-Contact and Program Info'!$L$7","v":"MM/DD/YYYY"}]
[]
[null,null,"Appliance Type","Total # of Units Processed",null,"Total Saved Energy (kWh)","Total Savings to Residential Consumers ($)"]
[null,null,"Refrigerators",{"$f":"'Step 3-Refrigerators (B)'!$D$8","v":0},null,{"$f":"$D$10*'Step 3-Refrigerators (B)'!$E$69*'Step 3-Refrigerators (B)'!$E$70","v":{"$error":"#VALUE!"}},{"$f":"$F$10*'Step 3-Refrigerators (B)'!$E$71","v":{"$error":"#VALUE!"}}]
[null,null,"Stand Alone Freezers",{"$f":"'Step 3-Stand-Alone Freezers (B)'!$D$8","v":0},null,{"$f":"$D$11*'Step 3-Stand-Alone Freezers (B)'!$E$76*'Step 3-Stand-Alone Freezers (B)'!$E$77","v":{"$error":"#VALUE!"}},{"$f":"$F$11*'Step 3-Stand-Alone Freezers (B)'!$E$78","v":{"$error":"#VALUE!"}}]
[null,null,"Air-Conditioning Units",{"$f":"'Step 3-Air-Conditioning Uni (B)'!$D$8","v":0},null,{"$f":"$D$12*'Step 3-Air-Conditioning Uni (B)'!$E$46*'Step 3-Air-Conditioning Uni (B)'!$E$47","v":{"v":0,"d":"0.0"}},{"$f":"$F$12*'Step 3-Air-Conditioning Uni (B)'!$E$48","v":{"v":0,"d":"$0.00"}}]
[null,null,"Dehumidifiers",{"$f":"'Step 3-Dehumidifiers (B)'!$D$8","v":0},null,{"$f":"$D$13*'Step 3-Dehumidifiers (B)'!$E$58*'Step 3-Dehumidifiers (B)'!$E$59","v":{"v":0,"d":"0.0"}},{"$f":"$F$13*'Step 3-Dehumidifiers (B)'!$E$60","v":{"v":0,"d":"$0.00"}}]
[null,null,"Total",{"$f":"SUM(D10:E13)","v":0},null,{"$f":"SUM(F10:F13)","v":{"$error":"#VALUE!"}},{"$f":"SUM(G10:G13)","v":{"$error":"#VALUE!"}}]

{"sheet":"Step 5-Benefits Messaging","index":17,"n_rows":52,"n_cols":6,"rows_kept":52,"merged":[[1,3,1,5],[1,6,1,7],[2,2,2,6],[3,2,3,7],[4,2,4,6],[5,2,5,6],[7,2,7,6],[8,2,8,6],[9,2,9,5],[10,2,10,5],[11,2,11,5],[12,2,12,6],[13,2,13,6],[15,5,15,6],[17,5,17,6],[19,5,19,6],[21,5,21,6],[23,2,23,6],[24,2,24,6],[25,2,25,6],[27,5,27,6],[29,5,29,6],[32,2,32,6],[33,2,33,6],[35,2,35,6],[36,2,36,6],[37,2,37,3],[38,2,38,3],[39,2,39,3],[40,2,40,3],[41,2,41,3],[42,2,42,3],[43,2,43,3],[44,2,44,3],[45,2,45,3],[47,2,47,6],[48,2,48,6]]}
[]
[]
[null,null,"Step 5: Key Messages and Figures to Promote Program's Benefits"]
[null,null,"Instructions: No action is required. The information below is for reference only and is self-populated based on data entered in the Step 3 worksheets. The purpose of this worksheet is for EPA to provide RAD partners with key messages and figures to promote the benefits of their appliance disposal program."]
[null,null,"RAD Results"]
[null,null,{"$f":"IFERROR(CONCATENATE(\"In \", YEAR('Step 1-Contact and Program Info'!$L$7), \", \", 'Step 1-Contact and Program Info'!$D$7, \" collected and processed a total of \", TEXT(SUM('Step 5-QA_Input Data Summary'!$D$8:$G$8),\"#,###\"), \" refrigerant-containing appliances using best environmental practices. As a result, \",'Step 1-Contact and Program Info'!$D$7,\" successfully reduced emissions of ozone-depleting substances and greenhouse gases as well as reduced energy consumption, increased the recycling of durable materials, and ensured the proper handling of hazardous substances.\"),\"\")","v":""}]
[]
[null,null,"Climate Benefits"]
[null,null,{"$f":"IFERROR(CONCATENATE(\"In \", YEAR('Step 1-Contact and Program Info'!$L$7), \", \", 'Step 1-Contact and Program Info'!$D$7, \" achieved a reduction of \", TEXT(SUM('Step 5-Env Benefits'!$F$38:$G$38,'Step 5-Env Benefits'!$F$60:$G$60,'Step 5-Env Benefits'!$F$66:$G$66,'Step 5-Env Benefits'!$F$68:$G$68),\"#,###\"),\" metric tons of carbon dioxide equivalent, which is equal to: \"),\"\")","v":""}]
[null,null,{"$f":"CONCATENATE(\"greenhouse gas emissions from \",TEXT(PRODUCT('Step 5-Env Benefits'!$F$69:$G$69,Assumptions!$B$49),\"#,###\"), \" passenger vehicles driven for one year.\",\" (-or-)\")","v":"greenhouse gas emissions from  passenger vehicles driven for one year. (-or-)"}]
[null,null,{"$f":"CONCATENATE(\"carbon dioxide emissions from \",TEXT(PRODUCT('Step 5-Env Benefits'!$F$69:$G$69,Assumptions!$B$50),\"#,###\"),\" homes' energy use for one year.\",\" (-or-)\")","v":"carbon dioxide emissions from  homes' energy use for one year. (-or-)"}]
[null,null,{"$f":"CONCATENATE(\"carbon dioxide emissions avoided from \",TEXT(PRODUCT('Step 5-Env Benefits'!$F$69:$G$69,Assumptions!$B$51),\"#,###\"), \" incandescent light bulbs switched to LEDs.\")","v":"carbon dioxide emissions avoided from  incandescent light bulbs switched to LEDs."}]
[]
[null,null,{"$f":"IFERROR(IF('Step 1-Contact and Program Info'!$G$22=\"Utility\",CONCATENATE(\"Of these emissions reduced, \",TEXT(Assumptions!$F$54,\"0.0%\"),\" can be attributed to reclaiming or destroying refrigerants, \",TEXT(Assumptions!$F$55,\"0.0%\"),\" to reclaiming or destroying foam-blowing agents, \",TEXT(Assumptions!$F$56,\"0.0%\"),\" to recycling durable materials (which avoids the need to produce virgin materials),\",\" and \",TEXT(Assumptions!$F$57,\"0.0%\"),\" to removing old units from the grid.\"),CONCATENATE(\"Of these emissions reduced, \",TEXT(Assumptions!$F$54,\"0.0%\"),\" can be attributed to reclaiming or destroying refrigerants, \",TEXT(Assumptions!$F$55,\"0.0%\"),\" to reclaiming or destroying foam-blowing agents, and \",TEXT(Assumptions!$F$56,\"0.0%\"),\" to recycling durable materials (which avoids the need to produce virgin materials).\")),\"\")","v":""}]
[]
[{"$nulls":5},{"$f":"Assumptions!$B$54","v":"Reclaiming or destroying refrigerants"}]
[]
[{"$nulls":5},{"$f":"Assumptions!$B$55","v":"Reclaiming or destroying foam-blowing agents"}]
[]
[{"$nulls":5},{"$f":"Assumptions!$B$56","v":"Recycling durable materials"}]
[]
[{"$nulls":4},{"$f":"IF(Assumptions!C57=0,0,1)","v":0},{"$f":"IF(Assumptions!C57=0,\"\",Assumptions!$B$57)","v":""}]
[]
[null,null,"Stratospheric Ozone Benefits"]
[null,null,{"$f":"IFERROR(CONCATENATE(\"In \", YEAR('Step 1-Contact and Program Info'!$L$7), \", \", 'Step 1-Contact and Program Info'!$D$7, \" avoided the release of \", TEXT(SUM('Step 5-Env Benefits'!$H$69),\"#,###\"),\" ODP-weighted kg of ozone-depleting substances (ODS) which otherwise would have contributed to stratospheric ozone depletion. Ozone depletion causes increased amounts of UV radiation to reach the Earth’s surface.\", \" Overexposure to UV radiation can cause a range of health effects, including skin cancer (melanoma and non melanoma), premature aging of the skin and other skin problems, cataracts and other eye damage, and suppression of the immune system.\"),\"\")","v":""}]
[null,null,{"$f":"IFERROR(CONCATENATE(\"Of the ODS emissions avoided, \",TEXT(Assumptions!$F$60,\"0%\"),\" can be attributed to reclaiming or destroying refrigerants and \",TEXT(Assumptions!$F$61,\"0%\"),\" to reclaiming or destroying foam-blowing agents.\"),\"\")","v":""}]
[]
[{"$nulls":5},{"$f":"Assumptions!$B$54","v":"Reclaiming or destroying refrigerants"}]
[]
[{"$nulls":5},{"$f":"Assumptions!$B$55","v":"Reclaiming or destroying foam-blowing agents"}]
[]
[]
[null,null,{"$f":"IF('Step 1-Contact and Program Info'!$G$22=\"Utility\",\"Energy Savings\",\"Energy Savings*\")","v":"Energy Savings*"}]
[null,null,{"$f":"IF('Step 1-Contact and Program Info'!$G$22=\"Utility\",CONCATENATE(\"RAD’s utility partners are committed to ensuring that old, inefficient appliances being disposed of by one household do not get reused by other households.\",\" The permanent retirement of these appliances translates into both energy and consumer cost savings. \",\"In \",YEAR('Step 1-Contact and Program Info'!$L$7),\", \",'Step 1-Contact and Program Info'!$D$7,\" reduced energy use by \",TEXT(SUM('Step 5-Energy Impacts '!$F$14),\"#,###\"),\" kWh, which is estimated to have saved customers \",TEXT(SUM('Step 5-Energy Impacts '!$G$14),\"$#,###\"),\" on electricity bills.\"),\"*Note: It is assumed that removing units from the electricity grid will only result in environmental benefits if your program offers an incentive to retire old, working appliances.\")","v":"*Note: It is assumed that removing units from the electricity grid will only result in environmental benefits if your program offers an incentive to retire old, working appliances."}]
[]
[null,null,"Environmental Benefits for Communities"]
[null,null,{"$f":"IFERROR(CONCATENATE(\"In \",YEAR('Step 1-Contact and Program Info'!$L$7),\", \",'Step 1-Contact and Program Info'!$D$7,\" further protected the environment by keeping recyclable materials out of landfills and ensuring the proper handling of hazardous waste, as shown below.\"),\"\")","v":""}]
[null,null,"Materials prevented from going to a landfill:"]
[null,null,{"$f":"CONCATENATE(TEXT('Step 5-Env Benefits'!$D$62,\"#,###\"),\" lbs. of ferrous metals (e.g., steel)\")","v":" lbs. of ferrous metals (e.g., steel)"}]
[null,null,{"$f":"CONCATENATE(TEXT('Step 5-Env Benefits'!$D$63,\"#,###\"),\" lbs. of non-ferrous metals (e.g., copper)\")","v":" lbs. of non-ferrous metals (e.g., copper)"}]
[null,null,{"$f":"CONCATENATE(TEXT('Step 5-Env Benefits'!D64,\"#,###\"),\" lbs. of plastic\")","v":" lbs. of plastic"}]
[null,null,{"$f":"CONCATENATE(TEXT('Step 5-Env Benefits'!$D$65,\"#,###\"),\" lbs. of glass\")","v":" lbs. of glass"}]
[null,null,"Materials prevented from going to a landfill:"]
[null,null,{"$f":"CONCATENATE(TEXT('Step 5-Env Benefits'!$D$81,\"#,###\"),\" gallons of used oil\")","v":" gallons of used oil"}]
[null,null,{"$f":"CONCATENATE(ROUND('Step 5-Env Benefits'!$D$83,0),\" PCB-containing capacitors\")","v":"0 PCB-containing capacitors"}]
[null,null,{"$f":"CONCATENATE(ROUND(SUM('Step 5-Env Benefits'!$D$85:$D$86),0),\" mercury-containing capacitors\")","v":"0 mercury-containing capacitors"}]
[]
[null,null,"If released into the environment, used oil can leak into groundwater and major waterways and pollute drinking water sources. In addition to used oil, appliances may contain toxic chemicals and heavy metals—namely PCBs from capacitors and mercury from thermostatic switches. PCBs are regulated by EPA as toxic substances; they may cause cancer and liver damage and can have negative impacts on the neurological development of children, the human reproductive system, the immune system, and the endocrine system. Mercury is toxic and causes a variety of adverse health effects, including tremors, headaches, respiratory failure, reproductive and developmental abnormalities, and potentially, cancers."]
[]
[]
[]
[null,null,{"$f":"'Instructions & Definitions'!C57","v":"EPA Form Number: 5900-482"}]

{"sheet":"Step 6-Partner Feedback","index":18,"n_rows":35,"n_cols":3,"rows_kept":35,"merged":[[1,6,1,8],[3,2,3,6],[6,3,10,6],[7,2,10,2],[12,3,19,6],[13,2,19,2],[21,3,25,6],[22,2,24,2],[27,3,31,6],[28,2,30,2]]}
[]
[]
[null,null,"Step 6: Partner Feedback"]
[null,null,"Instructions: The U.S. EPA is interested in learning more about your program and receiving feedback on the RAD program. Please take a moment to answer the following three questions. "]
[]
[]
[null,null,"Question #1"]
[null,null,"As a RAD Partner, would you be willing to provide a quote or testimonial about the RAD partnership for the RAD website? If so, please provide draft text."]
[]
[]
[]
[]
[null,null,"Question #2"]
[null,null,"As part of your appliance recycling program, have you undertaken any innovative activities during the year to promote the safe disposal of appliances and/or raise consumer awareness? Please describe. You may also send any photos along with this reporting form at the time of submission."]
{"$rows_empty":7}
[null,null,"Question #3"]
[null,null,"As a RAD Partner, what are the greatest benefits that you’ve realized through the Program?"]
[]
[]
[]
[]
[null,null,"Question #4"]
[null,null,"Do you have any suggestions for how the RAD program can be improved? "]
[]
[]
[]
[]
[]
[null,null,{"$f":"'Instructions & Definitions'!C57","v":"EPA Form Number: 5900-482"}]

{"sheet":"Step 7-Confirmation","index":19,"n_rows":15,"n_cols":7,"rows_kept":15,"merged":[[1,8,1,9],[4,2,4,8],[6,2,7,8],[11,3,11,4]]}
[]
[]
[]
[null,null,"Step 7: Confirmation"]
[null,null,"Instructions: Prior to submitting this form, please review all Step 3 worksheet(s) and Step 5 QA Input Data Summary worksheet and confirm below that the information is accurate, to the best of your knowledge. Your name and date must be entered into the cells below in order for this form to be considered complete."]
[]
[null,null,"I certify that I have personally examined and am familiar with the information submitted in this report, and that based on my inquiry of those individuals immediately responsible for obtaining the information, I believe that the submitted information is true, accurate, and complete."]
[]
[]
[]
[]
[null,null,"Name",null,null,"Date","MM/DD/YYYY"]
[]
[]
[null,null,{"$f":"'Instructions & Definitions'!C57","v":"EPA Form Number: 5900-482"}]

{"sheet":"OutputLinker","index":20,"n_rows":901,"n_cols":4,"rows_kept":901,"hidden":true,"merged":[[40,0,40,2],[80,1,89,1],[90,1,109,1],[110,1,111,1],[112,1,113,1],[134,1,143,1],[144,1,163,1],[164,1,165,1],[166,1,167,1],[224,1,238,1],[239,1,258,1],[259,1,260,1],[261,1,262,1],[265,1,266,1],[285,1,299,1],[300,1,319,1],[320,1,321,1],[322,1,323,1],[326,1,327,1],[354,1,368,1],[369,1,370,1],[371,1,372,1],[384,1,398,1],[399,1,400,1],[401,1,402,1],[435,1,459,1],[460,1,461,1],[462,1,463,1],[477,1,501,1],[502,1,503,1],[504,1,505,1],[543,2,544,2]]}
[]
[null,"Step 1 - Contact and Program Info"]
[]
[null,null,{"$f":"'Step 1-Contact and Program Info'!C7","v":"  Name of RAD Partner:"},{"$f":"IF(ISBLANK('Step 1-Contact and Program Info'!D7),\"BLANK\",'Step 1-Contact and Program Info'!D7)","v":"BLANK"}]
[null,null,{"$f":"'Step 1-Contact and Program Info'!I7","v":"Reporting Period:"},{"$f":"IF(ISBLANK('Step 1-Contact and Program Info'!J7),\"BLANK\",'Step 1-Contact and Program Info'!J7)","v":"MM/DD/YYYY"}]
[null,null,{"$f":"'Step 1-Contact and Program Info'!K7","v":"to"},{"$f":"IF(ISBLANK('Step 1-Contact and Program Info'!L7),\"BLANK\",'Step 1-Contact and Program Info'!L7)","v":"MM/DD/YYYY"}]
[null,null,{"$f":"'Step 1-Contact and Program Info'!C10","v":"Primary Contact: "}]
[null,null,{"$f":"'Step 1-Contact and Program Info'!C11","v":"  Contact Name "},{"$f":"IF(ISBLANK('Step 1-Contact and Program Info'!D11),\"BLANK\",'Step 1-Contact and Program Info'!D11)","v":"BLANK"}]
[null,null,{"$f":"'Step 1-Contact and Program Info'!C12","v":"  Address "},{"$f":"IF(ISBLANK('Step 1-Contact and Program Info'!D12),\"BLANK\",'Step 1-Contact and Program Info'!D12)","v":"BLANK"}]
[{"$nulls":3},{"$f":"IF(ISBLANK('Step 1-Contact and Program Info'!D13),\"BLANK\",'Step 1-Contact and Program Info'!D13)","v":"BLANK"}]
[{"$nulls":3},{"$f":"IF(ISBLANK('Step 1-Contact and Program Info'!D14),\"BLANK\",'Step 1-Contact and Program Info'!D14)","v":"BLANK"}]
[null,null,{"$f":"'Step 1-Contact and Program Info'!C15","v":"  Phone "},{"$f":"IF(ISBLANK('Step 1-Contact and Program Info'!D15),\"BLANK\",'Step 1-Contact and Program Info'!D15)","v":"BLANK"}]
[null,null,{"$f":"'Step 1-Contact and Program Info'!C16","v":"  Fax "},{"$f":"IF(ISBLANK('Step 1-Contact and Program Info'!D16),\"BLANK\",'Step 1-Contact and Program Info'!D16)","v":"BLANK"}]
[null,null,{"$f":"'Step 1-Contact and Program Info'!C17","v":"  E-mail Address "},{"$f":"IF(ISBLANK('Step 1-Contact and Program Info'!D17),\"BLANK\",'Step 1-Contact and Program Info'!D17)","v":"BLANK"}]
[null,null,{"$f":"'Step 1-Contact and Program Info'!I10","v":"Alternate Contact: "}]
[null,null,{"$f":"'Step 1-Contact and Program Info'!I11","v":"Contact Name "},{"$f":"IF(ISBLANK('Step 1-Contact and Program Info'!J11),\"BLANK\",'Step 1-Contact and Program Info'!J11)","v":"BLANK"}]
[null,null,{"$f":"'Step 1-Contact and Program Info'!I12","v":"Address "},{"$f":"IF(ISBLANK('Step 1-Contact and Program Info'!J12),\"BLANK\",'Step 1-Contact and Program Info'!J12)","v":"BLANK"}]
[{"$nulls":3},{"$f":"IF(ISBLANK('Step 1-Contact and Program Info'!J13),\"BLANK\",'Step 1-Contact and Program Info'!J13)","v":"BLANK"}]
[{"$nulls":3},{"$f":"IF(ISBLANK('Step 1-Contact and Program Info'!J14),\"BLANK\",'Step 1-Contact and Program Info'!J14)","v":"BLANK"}]
[null,null,{"$f":"'Step 1-Contact and Program Info'!I15","v":"Phone "},{"$f":"IF(ISBLANK('Step 1-Contact and Program Info'!J15),\"BLANK\",'Step 1-Contact and Program Info'!J15)","v":"BLANK"}]
[null,null,{"$f":"'Step 1-Contact and Program Info'!I16","v":"Fax "},{"$f":"IF(ISBLANK('Step 1-Contact and Program Info'!J16),\"BLANK\",'Step 1-Contact and Program Info'!J16)","v":"BLANK"}]
[null,null,{"$f":"'Step 1-Contact and Program Info'!I17","v":"E-mail Address "},{"$f":"IF(ISBLANK('Step 1-Contact and Program Info'!J17),\"BLANK\",'Step 1-Contact and Program Info'!J17)","v":"BLANK"}]
[]
[null,null,{"$f":"'Step 1-Contact and Program Info'!G26","v":"Refrigerators"},{"$f":"'Step 1-Contact and Program Info'!H26","v":0}]
[null,null,{"$f":"'Step 1-Contact and Program Info'!G27","v":"Stand-Alone Freezers"},{"$f":"'Step 1-Contact and Program Info'!H27","v":0}]
[null,null,{"$f":"'Step 1-Contact and Program Info'!G28","v":"Air-Conditioning Units"},{"$f":"'Step 1-Contact and Program Info'!H28","v":0}]
[null,null,{"$f":"'Step 1-Contact and Program Info'!G29","v":"Dehumidifiers"},{"$f":"'Step 1-Contact and Program Info'!H29","v":0}]
[null,null,"Jointly Proccessed Units?",{"$f":"'Step 1-Contact and Program Info'!H31","v":0}]
[null,null,"Incentive offered?",{"$f":"'Step 1-Contact and Program Info'!H33","v":0}]
[]
[null,null,"Partner Type",{"$f":"'Step 1-Contact and Program Info'!G22","v":0}]
[null,null,"# of Households Served",{"$f":"IF('Step 1-Contact and Program Info'!G22=\"Utility\", 'Step 1-Contact and Program Info'!G24, \"BLANK\")","v":"BLANK"}]
[null,null,"# of Stores Served",{"$f":"IF('Step 1-Contact and Program Info'!G22=\"Retailer\", 'Step 1-Contact and Program Info'!G24, \"BLANK\")","v":"BLANK"}]
[null,null,"# of States Served",{"$f":"IF('Step 1-Contact and Program Info'!G22=\"Manufacturer\", 'Step 1-Contact and Program Info'!G24, \"BLANK\")","v":"BLANK"}]
[null,null,"# of Facilities Served",{"$f":"IF('Step 1-Contact and Program Info'!G22=\"State\", 'Step 1-Contact and Program Info'!G24, \"BLANK\")","v":"BLANK"}]
[]
[]
[]
[null,"Step 3 - Refrigerators-Freezers"]
[]
["Units Processed"]
[null,null,{"$f":"'Step 3-Refrigerators'!C8","v":"Total Number of Units Processed"},{"$f":"IF(ISBLANK('Step 3-Refrigerators'!D8),\"BLANK\",'Step 3-Refrigerators'!D8)","v":"BLANK"}]
[null,null,{"$f":"'Step 3-Refrigerators'!C9","v":"Average Age of Appliances Collected (yrs)"},{"$f":"IF(ISBLANK('Step 3-Refrigerators'!D9),\"BLANK\",'Step 3-Refrigerators'!D9)","v":"BLANK"}]
[null,null,{"$f":"'Step 3-Refrigerators'!D10","v":"Total Number of Units Processed "}]
[null,null,{"$f":"'Step 3-Refrigerators'!C11","v":"CFC-12"},{"$f":"IF(ISBLANK('Step 3-Refrigerators'!D11),\"BLANK\",'Step 3-Refrigerators'!D11)","v":"BLANK"}]
[null,null,{"$f":"'Step 3-Refrigerators'!C12","v":"HFC-134a"},{"$f":"IF(ISBLANK('Step 3-Refrigerators'!D12),\"BLANK\",'Step 3-Refrigerators'!D12)","v":"BLANK"}]
[null,null,"Other",{"$f":"IF(ISBLANK('Step 3-Refrigerators'!D13),\"BLANK\",'Step 3-Refrigerators'!D13)","v":"BLANK"}]
[]
[null,null,{"$f":"'Step 3-Refrigerators'!E10","v":"Number of Units Processed with Refrigerant Recovery"}]
[null,null,{"$f":"C45","v":"CFC-12"},{"$f":"IF(ISBLANK('Step 3-Refrigerators'!E11),\"BLANK\",'Step 3-Refrigerators'!E11)","v":"BLANK"}]
[null,null,{"$f":"C46","v":"HFC-134a"},{"$f":"IF(ISBLANK('Step 3-Refrigerators'!E12),\"BLANK\",'Step 3-Refrigerators'!E12)","v":"BLANK"}]
[null,null,{"$f":"C47","v":"Other"},{"$f":"IF(ISBLANK('Step 3-Refrigerators'!E13),\"BLANK\",'Step 3-Refrigerators'!E13)","v":"BLANK"}]
[]
[null,null,{"$f":"'Step 3-Refrigerators'!D15","v":"Total Number of Units Processed "}]
[null,null,{"$f":"'Step 3-Refrigerators'!C16","v":"CFC-11 Blowing Agent"},{"$f":"IF(ISBLANK('Step 3-Refrigerators'!D16),\"BLANK\",'Step 3-Refrigerators'!D16)","v":"BLANK"}]
[null,null,{"$f":"'Step 3-Refrigerators'!C17","v":"HCFC-141b Blowing Agent"},{"$f":"IF(ISBLANK('Step 3-Refrigerators'!D17),\"BLANK\",'Step 3-Refrigerators'!D17)","v":"BLANK"}]
[null,null,{"$f":"'Step 3-Refrigerators'!C18","v":"HFC-134a Blowing Agent"},{"$f":"IF(ISBLANK('Step 3-Refrigerators'!D18),\"BLANK\",'Step 3-Refrigerators'!D18)","v":"BLANK"}]
[null,null,{"$f":"'Step 3-Refrigerators'!C19","v":"HFC-245fa Blowing Agent"},{"$f":"IF(ISBLANK('Step 3-Refrigerators'!D19),\"BLANK\",'Step 3-Refrigerators'!D19)","v":"BLANK"}]
[null,null,{"$f":"'Step 3-Refrigerators'!C20","v":"Cyclopentane Blowing Agent"},{"$f":"IF(ISBLANK('Step 3-Refrigerators'!D20),\"BLANK\",'Step 3-Refrigerators'!D20)","v":"BLANK"}]
[null,null,{"$f":"'Step 3-Refrigerators'!C21","v":"Fiberglass"},{"$f":"IF(ISBLANK('Step 3-Refrigerators'!D21),\"BLANK\",'Step 3-Refrigerators'!D21)","v":"BLANK"}]
[null,null,"Other",{"$f":"IF(ISBLANK('Step 3-Refrigerators'!D22),\"BLANK\",'Step 3-Refrigerators'!D22)","v":"BLANK"}]
[]
[null,null,{"$f":"'Step 3-Refrigerators'!E15","v":"Number of Units Processed with Foam Recovery"}]
[null,null,{"$f":"C55","v":"CFC-11 Blowing Agent"},{"$f":"IF(ISBLANK('Step 3-Refrigerators'!E16),\"BLANK\",'Step 3-Refrigerators'!E16)","v":"BLANK"}]
[null,null,"HCFC-141b Blowing Agent",{"$f":"IF(ISBLANK('Step 3-Refrigerators'!E17),\"BLANK\",'Step 3-Refrigerators'!E17)","v":"BLANK"}]
[null,null,"HFC-134a Blowing Agent",{"$f":"IF(ISBLANK('Step 3-Refrigerators'!E18),\"BLANK\",'Step 3-Refrigerators'!E18)","v":"BLANK"}]
[null,null,"HFC-245fa Blowing Agent",{"$f":"IF(ISBLANK('Step 3-Refrigerators'!E19),\"BLANK\",'Step 3-Refrigerators'!E19)","v":"BLANK"}]
[null,null,"Cyclopentane Blowing Agent",{"$f":"IF(ISBLANK('Step 3-Refrigerators'!E20),\"BLANK\",'Step 3-Refrigerators'!E20)","v":"BLANK"}]
[null,null,"Fiberglass",{"$f":"IF(ISBLANK('Step 3-Refrigerators'!E21),\"BLANK\",'Step 3-Refrigerators'!E21)","v":"BLANK"}]
[null,null,"Other",{"$f":"IF(ISBLANK('Step 3-Refrigerators'!E22),\"BLANK\",'Step 3-Refrigerators'!E22)","v":"BLANK"}]
[]
[null,null,{"$f":"'Step 3-Refrigerators'!F15","v":"Was Foam Recovered From Appliance Doors?"}]
[null,null,{"$f":"C55","v":"CFC-11 Blowing Agent"},{"$f":"IF(ISBLANK('Step 3-Refrigerators'!F16),\"BLANK\",'Step 3-Refrigerators'!F16)","v":"BLANK"}]
[null,null,"HCFC-141b Blowing Agent",{"$f":"IF(ISBLANK('Step 3-Refrigerators'!F17),\"BLANK\",'Step 3-Refrigerators'!F17)","v":"BLANK"}]
[null,null,"HFC-134a Blowing Agent",{"$f":"IF(ISBLANK('Step 3-Refrigerators'!F18),\"BLANK\",'Step 3-Refrigerators'!F18)","v":"BLANK"}]
[null,null,"HFC-245fa Blowing Agent",{"$f":"IF(ISBLANK('Step 3-Refrigerators'!F19),\"BLANK\",'Step 3-Refrigerators'!F19)","v":"BLANK"}]
[null,null,"Cyclopentane Blowing Agent"]
[null,null,"Fiberglass"]
[null,null,"Other"]
[]
[null,"Refrigerant (including that recovered from compressor oil)",{"$f":"'Step 3-Refrigerators'!D30","v":"CFC-12 "}]
[null,null,{"$f":"'Step 3-Refrigerators'!D31","v":"Reclaimed"},{"$f":"IF(ISBLANK('Step 3-Refrigerators'!F31),\"BLANK\",'Step 3-Refrigerators'!F31)","v":"BLANK"}]
[null,null,"Stockpiling with Intent to Reclaim",{"$f":"IF(ISBLANK('Step 3-Refrigerators'!F32),\"BLANK\",'Step 3-Refrigerators'!F32)","v":"BLANK"}]
[null,null,{"$f":"'Step 3-Refrigerators'!D33","v":"Destroyed"},{"$f":"IF(ISBLANK('Step 3-Refrigerators'!F33),\"BLANK\",'Step 3-Refrigerators'!F33)","v":"BLANK"}]
[null,null,"Stockpiling with Intent to Destroy",{"$f":"IF(ISBLANK('Step 3-Refrigerators'!F34),\"BLANK\",'Step 3-Refrigerators'!F34)","v":"BLANK"}]
[null,null,{"$f":"'Step 3-Refrigerators'!D35","v":"HFC-134a "}]
[null,null,{"$f":"'Step 3-Refrigerators'!D36","v":"Reclaimed"},{"$f":"IF(ISBLANK('Step 3-Refrigerators'!F36),\"BLANK\",'Step 3-Refrigerators'!F36)","v":"BLANK"}]
[null,null,"Stockpiling with Intent to Reclaim",{"$f":"IF(ISBLANK('Step 3-Refrigerators'!F37),\"BLANK\",'Step 3-Refrigerators'!F37)","v":"BLANK"}]
[null,null,{"$f":"'Step 3-Refrigerators'!D38","v":"Destroyed"},{"$f":"IF(ISBLANK('Step 3-Refrigerators'!F38),\"BLANK\",'Step 3-Refrigerators'!F38)","v":"BLANK"}]
[null,null,"Stockpiling with Intent to Destroy",{"$f":"IF(ISBLANK('Step 3-Refrigerators'!F39),\"BLANK\",'Step 3-Refrigerators'!F39)","v":"BLANK"}]
[null,"Foam-Blowing Agent*",{"$f":"'Step 3-Refrigerators'!D40","v":"CFC-11"}]
[null,null,{"$f":"'Step 3-Refrigerators'!D41","v":"Reclaimed"},{"$f":"IF(ISBLANK('Step 3-Refrigerators'!F41),\"BLANK\",'Step 3-Refrigerators'!F41)","v":"BLANK"}]
[null,null,"Stockpiling with Intent to Reclaim",{"$f":"IF(ISBLANK('Step 3-Refrigerators'!F42),\"BLANK\",'Step 3-Refrigerators'!F42)","v":"BLANK"}]
[null,null,{"$f":"'Step 3-Refrigerators'!D43","v":"Destroyed"},{"$f":"IF(ISBLANK('Step 3-Refrigerators'!F43),\"BLANK\",'Step 3-Refrigerators'!F43)","v":"BLANK"}]
[null,null,"Stockpiling with Intent to Destroy",{"$f":"IF(ISBLANK('Step 3-Refrigerators'!F44),\"BLANK\",'Step 3-Refrigerators'!F44)","v":"BLANK"}]
[null,null,{"$f":"'Step 3-Refrigerators'!D45","v":"HCFC-141b"}]
[null,null,{"$f":"'Step 3-Refrigerators'!D46","v":"Reclaimed"},{"$f":"IF(ISBLANK('Step 3-Refrigerators'!F46),\"BLANK\",'Step 3-Refrigerators'!F46)","v":"BLANK"}]
[null,null,"Stockpiling with Intent to Reclaim",{"$f":"IF(ISBLANK('Step 3-Refrigerators'!F47),\"BLANK\",'Step 3-Refrigerators'!F47)","v":"BLANK"}]
[null,null,{"$f":"'Step 3-Refrigerators'!D48","v":"Destroyed"},{"$f":"IF(ISBLANK('Step 3-Refrigerators'!F48),\"BLANK\",'Step 3-Refrigerators'!F48)","v":"BLANK"}]
[null,null,"Stockpiling with Intent to Destroy",{"$f":"IF(ISBLANK('Step 3-Refrigerators'!F49),\"BLANK\",'Step 3-Refrigerators'!F49)","v":"BLANK"}]
[null,null,{"$f":"'Step 3-Refrigerators'!D50","v":"HFC-134a"}]
[null,null,{"$f":"'Step 3-Refrigerators'!D51","v":"Reclaimed"},{"$f":"IF(ISBLANK('Step 3-Refrigerators'!F51),\"BLANK\",'Step 3-Refrigerators'!F51)","v":"BLANK"}]
[null,null,"Stockpiling with Intent to Reclaim",{"$f":"IF(ISBLANK('Step 3-Refrigerators'!F52),\"BLANK\",'Step 3-Refrigerators'!F52)","v":"BLANK"}]
[null,null,{"$f":"'Step 3-Refrigerators'!D53","v":"Destroyed"},{"$f":"IF(ISBLANK('Step 3-Refrigerators'!F53),\"BLANK\",'Step 3-Refrigerators'!F53)","v":"BLANK"}]
[null,null,"Stockpiling with Intent to Destroy",{"$f":"IF(ISBLANK('Step 3-Refrigerators'!F54),\"BLANK\",'Step 3-Refrigerators'!F54)","v":"BLANK"}]
[null,null,{"$f":"'Step 3-Refrigerators'!D55","v":"HFC-245fa"}]
[null,null,{"$f":"'Step 3-Refrigerators'!D56","v":"Reclaimed"},{"$f":"IF(ISBLANK('Step 3-Refrigerators'!F56),\"BLANK\",'Step 3-Refrigerators'!F56)","v":"BLANK"}]
[null,null,"Stockpiling with Intent to Reclaim",{"$f":"IF(ISBLANK('Step 3-Refrigerators'!F57),\"BLANK\",'Step 3-Refrigerators'!F57)","v":"BLANK"}]
[null,null,{"$f":"'Step 3-Refrigerators'!D58","v":"Destroyed"},{"$f":"IF(ISBLANK('Step 3-Refrigerators'!F58),\"BLANK\",'Step 3-Refrigerators'!F58)","v":"BLANK"}]
[null,null,"Stockpiling with Intent to Destroy",{"$f":"IF(ISBLANK('Step 3-Refrigerators'!F59),\"BLANK\",'Step 3-Refrigerators'!F59)","v":"BLANK"}]
[null,"Used Oil",{"$f":"'Step 3-Refrigerators'!D60","v":"Recycled"},{"$f":"IF(ISBLANK('Step 3-Refrigerators'!F60),\"BLANK\",'Step 3-Refrigerators'!F60)","v":"BLANK"}]
[null,null,{"$f":"'Step 3-Refrigerators'!D61","v":"Disposed"},{"$f":"IF(ISBLANK('Step 3-Refrigerators'!F61),\"BLANK\",'Step 3-Refrigerators'!F61)","v":"BLANK"}]
[null,"Metal",{"$f":"'Step 3-Refrigerators'!D62","v":"Ferrous Metal Recycled"},{"$f":"IF(ISBLANK('Step 3-Refrigerators'!F62),\"BLANK\",'Step 3-Refrigerators'!F62)","v":"BLANK"}]
[null,null,{"$f":"'Step 3-Refrigerators'!D63","v":"Non-Ferrous Metal Recycled"},{"$f":"IF(ISBLANK('Step 3-Refrigerators'!F63),\"BLANK\",'Step 3-Refrigerators'!F63)","v":"BLANK"}]
[null,"Plastic",{"$f":"'Step 3-Refrigerators'!D64","v":"Recycled"},{"$f":"IF(ISBLANK('Step 3-Refrigerators'!F64),\"BLANK\",'Step 3-Refrigerators'!F64)","v":"BLANK"}]
[null,"Glass",{"$f":"'Step 3-Refrigerators'!D65","v":"Recycled"},{"$f":"IF(ISBLANK('Step 3-Refrigerators'!F65),\"BLANK\",'Step 3-Refrigerators'!F65)","v":"BLANK"}]
[null,"PCB-Containing Capacitors",{"$f":"'Step 3-Refrigerators'!D66","v":"Destroyed"},{"$f":"IF(ISBLANK('Step 3-Refrigerators'!F66),\"BLANK\",'Step 3-Refrigerators'!F66)","v":"BLANK"}]
[]
[null,"Actual Measurement or Assumptions"]
[null,null,{"$f":"'Step 3-Refrigerators'!D10","v":"Total Number of Units Processed "}]
[null,null,{"$f":"'Step 3-Refrigerators'!C11","v":"CFC-12"},{"$f":"IF(ISBLANK('Step 3-Refrigerators'!F11),\"BLANK\",'Step 3-Refrigerators'!F11)","v":"BLANK"}]
[null,null,{"$f":"'Step 3-Refrigerators'!C12","v":"HFC-134a"},{"$f":"IF(ISBLANK('Step 3-Refrigerators'!F12),\"BLANK\",'Step 3-Refrigerators'!F12)","v":"BLANK"}]
[null,null,{"$f":"'Step 3-Refrigerators'!C13","v":"Other"},{"$f":"IF(ISBLANK('Step 3-Refrigerators'!F13),\"BLANK\",'Step 3-Refrigerators'!F13)","v":"BLANK"}]
[null,null,"Comments:",{"$f":"IF(ISBLANK('Step 3-Refrigerators'!G11),\"\",'Step 3-Refrigerators'!G11)","v":""}]
[null,null,{"$f":"'Step 3-Refrigerators'!D15","v":"Total Number of Units Processed "}]
[null,null,{"$f":"'Step 3-Refrigerators'!C16","v":"CFC-11 Blowing Agent"},{"$f":"IF(ISBLANK('Step 3-Refrigerators'!G16),\"BLANK\",'Step 3-Refrigerators'!G16)","v":"BLANK"}]
[null,null,{"$f":"'Step 3-Refrigerators'!C17","v":"HCFC-141b Blowing Agent"},{"$f":"IF(ISBLANK('Step 3-Refrigerators'!G17),\"BLANK\",'Step 3-Refrigerators'!G17)","v":"BLANK"}]
[null,null,{"$f":"'Step 3-Refrigerators'!C18","v":"HFC-134a Blowing Agent"},{"$f":"IF(ISBLANK('Step 3-Refrigerators'!G18),\"BLANK\",'Step 3-Refrigerators'!G18)","v":"BLANK"}]
[null,null,{"$f":"'Step 3-Refrigerators'!C19","v":"HFC-245fa Blowing Agent"},{"$f":"IF(ISBLANK('Step 3-Refrigerators'!G19),\"BLANK\",'Step 3-Refrigerators'!G19)","v":"BLANK"}]
[null,null,{"$f":"'Step 3-Refrigerators'!C20","v":"Cyclopentane Blowing Agent"},{"$f":"IF(ISBLANK('Step 3-Refrigerators'!G20),\"BLANK\",'Step 3-Refrigerators'!G20)","v":"BLANK"}]
[null,null,{"$f":"'Step 3-Refrigerators'!C21","v":"Fiberglass"},{"$f":"IF(ISBLANK('Step 3-Refrigerators'!G21),\"BLANK\",'Step 3-Refrigerators'!G21)","v":"BLANK"}]
[null,null,{"$f":"'Step 3-Refrigerators'!C22","v":"Other"},{"$f":"IF(ISBLANK('Step 3-Refrigerators'!G22),\"BLANK\",'Step 3-Refrigerators'!G22)","v":"BLANK"}]
[null,null,"Comments:",{"$f":"IF(ISBLANK('Step 3-Refrigerators'!H16),\"\",'Step 3-Refrigerators'!H16)","v":""}]
[]
[null,"Refrigerant (including that recovered from compressor oil)",{"$f":"'Step 3-Refrigerators'!D30","v":"CFC-12 "}]
[null,null,{"$f":"'Step 3-Refrigerators'!D31","v":"Reclaimed"},{"$f":"IF(ISBLANK('Step 3-Refrigerators'!H31),\"BLANK\",'Step 3-Refrigerators'!H31)","v":"BLANK"}]
[null,null,"Stockpiling with Intent to Reclaim",{"$f":"IF(ISBLANK('Step 3-Refrigerators'!H32),\"BLANK\",'Step 3-Refrigerators'!H32)","v":"BLANK"}]
[null,null,{"$f":"'Step 3-Refrigerators'!D33","v":"Destroyed"},{"$f":"IF(ISBLANK('Step 3-Refrigerators'!H33),\"BLANK\",'Step 3-Refrigerators'!H33)","v":"BLANK"}]
[null,null,"Stockpiling with Intent to Destroy",{"$f":"IF(ISBLANK('Step 3-Refrigerators'!H34),\"BLANK\",'Step 3-Refrigerators'!H34)","v":"BLANK"}]
[null,null,{"$f":"'Step 3-Refrigerators'!D35","v":"HFC-134a "}]
[null,null,{"$f":"'Step 3-Refrigerators'!D36","v":"Reclaimed"},{"$f":"IF(ISBLANK('Step 3-Refrigerators'!H36),\"BLANK\",'Step 3-Refrigerators'!H36)","v":"BLANK"}]
[null,null,"Stockpiling with Intent to Reclaim",{"$f":"IF(ISBLANK('Step 3-Refrigerators'!H37),\"BLANK\",'Step 3-Refrigerators'!H37)","v":"BLANK"}]
[null,null,{"$f":"'Step 3-Refrigerators'!D38","v":"Destroyed"},{"$f":"IF(ISBLANK('Step 3-Refrigerators'!H38),\"BLANK\",'Step 3-Refrigerators'!H38)","v":"BLANK"}]
[null,null,"Stockpiling with Intent to Destroy",{"$f":"IF(ISBLANK('Step 3-Refrigerators'!H39),\"BLANK\",'Step 3-Refrigerators'!H39)","v":"BLANK"}]
[null,"Foam-Blowing Agent*",{"$f":"'Step 3-Refrigerators'!D40","v":"CFC-11"}]
[null,null,{"$f":"'Step 3-Refrigerators'!D41","v":"Reclaimed"},{"$f":"IF(ISBLANK('Step 3-Refrigerators'!H41),\"BLANK\",'Step 3-Refrigerators'!H41)","v":"BLANK"}]
[null,null,"Stockpiling with Intent to Reclaim",{"$f":"IF(ISBLANK('Step 3-Refrigerators'!H42),\"BLANK\",'Step 3-Refrigerators'!H42)","v":"BLANK"}]
[null,null,{"$f":"'Step 3-Refrigerators'!D43","v":"Destroyed"},{"$f":"IF(ISBLANK('Step 3-Refrigerators'!H43),\"BLANK\",'Step 3-Refrigerators'!H43)","v":"BLANK"}]
[null,null,"Stockpiling with Intent to Destroy",{"$f":"IF(ISBLANK('Step 3-Refrigerators'!H44),\"BLANK\",'Step 3-Refrigerators'!H44)","v":"BLANK"}]
[null,null,{"$f":"'Step 3-Refrigerators'!D45","v":"HCFC-141b"}]
[null,null,{"$f":"'Step 3-Refrigerators'!D46","v":"Reclaimed"},{"$f":"IF(ISBLANK('Step 3-Refrigerators'!H46),\"BLANK\",'Step 3-Refrigerators'!H46)","v":"BLANK"}]
[null,null,"Stockpiling with Intent to Reclaim",{"$f":"IF(ISBLANK('Step 3-Refrigerators'!H47),\"BLANK\",'Step 3-Refrigerators'!H47)","v":"BLANK"}]
[null,null,{"$f":"'Step 3-Refrigerators'!D48","v":"Destroyed"},{"$f":"IF(ISBLANK('Step 3-Refrigerators'!H48),\"BLANK\",'Step 3-Refrigerators'!H48)","v":"BLANK"}]
[null,null,"Stockpiling with Intent to Destroy",{"$f":"IF(ISBLANK('Step 3-Refrigerators'!H49),\"BLANK\",'Step 3-Refrigerators'!H49)","v":"BLANK"}]
[null,null,{"$f":"'Step 3-Refrigerators'!D50","v":"HFC-134a"}]
[null,null,{"$f":"'Step 3-Refrigerators'!D51","v":"Reclaimed"},{"$f":"IF(ISBLANK('Step 3-Refrigerators'!H51),\"BLANK\",'Step 3-Refrigerators'!H51)","v":"BLANK"}]
[null,null,"Stockpiling with Intent to Reclaim",{"$f":"IF(ISBLANK('Step 3-Refrigerators'!H52),\"BLANK\",'Step 3-Refrigerators'!H52)","v":"BLANK"}]
[null,null,{"$f":"'Step 3-Refrigerators'!D53","v":"Destroyed"},{"$f":"IF(ISBLANK('Step 3-Refrigerators'!H53),\"BLANK\",'Step 3-Refrigerators'!H53)","v":"BLANK"}]
[null,null,"Stockpiling with Intent to Destroy",{"$f":"IF(ISBLANK('Step 3-Refrigerators'!H54),\"BLANK\",'Step 3-Refrigerators'!H54)","v":"BLANK"}]
[null,null,{"$f":"'Step 3-Refrigerators'!D55","v":"HFC-245fa"}]
[null,null,{"$f":"'Step 3-Refrigerators'!D56","v":"Reclaimed"},{"$f":"IF(ISBLANK('Step 3-Refrigerators'!H56),\"BLANK\",'Step 3-Refrigerators'!H56)","v":"BLANK"}]
[null,null,"Stockpiling with Intent to Reclaim",{"$f":"IF(ISBLANK('Step 3-Refrigerators'!H57),\"BLANK\",'Step 3-Refrigerators'!H57)","v":"BLANK"}]
[null,null,{"$f":"'Step 3-Refrigerators'!D58","v":"Destroyed"},{"$f":"IF(ISBLANK('Step 3-Refrigerators'!H58),\"BLANK\",'Step 3-Refrigerators'!H58)","v":"BLANK"}]
[null,null,"Stockpiling with Intent to Destroy",{"$f":"IF(ISBLANK('Step 3-Refrigerators'!H59),\"BLANK\",'Step 3-Refrigerators'!H59)","v":"BLANK"}]
[null,"Used Oil",{"$f":"'Step 3-Refrigerators'!D60","v":"Recycled"},{"$f":"IF(ISBLANK('Step 3-Refrigerators'!H60),\"BLANK\",'Step 3-Refrigerators'!H60)","v":"BLANK"}]
[null,null,{"$f":"'Step 3-Refrigerators'!D61","v":"Disposed"},{"$f":"IF(ISBLANK('Step 3-Refrigerators'!H61),\"BLANK\",'Step 3-Refrigerators'!H61)","v":"BLANK"}]
[null,"Metal",{"$f":"'Step 3-Refrigerators'!D62","v":"Ferrous Metal Recycled"},{"$f":"IF(ISBLANK('Step 3-Refrigerators'!H62),\"BLANK\",'Step 3-Refrigerators'!H62)","v":"BLANK"}]
[null,null,{"$f":"'Step 3-Refrigerators'!D63","v":"Non-Ferrous Metal Recycled"},{"$f":"IF(ISBLANK('Step 3-Refrigerators'!H63),\"BLANK\",'Step 3-Refrigerators'!H63)","v":"BLANK"}]
[null,"Plastic",{"$f":"'Step 3-Refrigerators'!D64","v":"Recycled"},{"$f":"IF(ISBLANK('Step 3-Refrigerators'!H64),\"BLANK\",'Step 3-Refrigerators'!H64)","v":"BLANK"}]
[null,"Glass",{"$f":"'Step 3-Refrigerators'!D65","v":"Recycled"},{"$f":"IF(ISBLANK('Step 3-Refrigerators'!H65),\"BLANK\",'Step 3-Refrigerators'!H65)","v":"BLANK"}]
[null,"PCB-Containing Capacitors",{"$f":"'Step 3-Refrigerators'!D66","v":"Destroyed"},{"$f":"IF(ISBLANK('Step 3-Refrigerators'!H66),\"BLANK\",'Step 3-Refrigerators'!H66)","v":"BLANK"}]
[]
[null,null,{"$f":"'Step 3-Refrigerators'!C71","v":"Average Number of Remaining Years of Useful Life"},{"$f":"IF(ISBLANK('Step 3-Refrigerators'!E71),\"BLANK\",'Step 3-Refrigerators'!E71)","v":""}]
[null,null,{"$f":"'Step 3-Refrigerators'!C72","v":"Average Energy Consumed/Year/Unit (kWh)"},{"$f":"IF(ISBLANK('Step 3-Refrigerators'!E72),\"BLANK\",'Step 3-Refrigerators'!E72)","v":"BLANK"}]
[null,null,{"$f":"'Step 3-Refrigerators'!C73","v":"Average Energy Cost for Residential Consumers ($/kWh)  \n[please provide the average cost during the current program period] "},{"$f":"IF(ISBLANK('Step 3-Refrigerators'!E73),\"BLANK\",'Step 3-Refrigerators'!E73)","v":"BLANK"}]
[]
[null,null,{"$f":"'Step 3-Refrigerators'!C75","v":"Additional Comments:"},{"$f":"IF(ISBLANK('Step 3-Refrigerators'!D75),\"BLANK\",'Step 3-Refrigerators'!D75)","v":"BLANK"}]
[]
[]
[]
[null,"Step 3 - Stand Alone Freezers"]
[]
[null,null,"Units Processed"]
[null,null,{"$f":"'Step 3-Stand-Alone Freezers'!C8","v":"Total Number of Units Processed"},{"$f":"IF(ISBLANK('Step 3-Stand-Alone Freezers'!D8),\"BLANK\",'Step 3-Stand-Alone Freezers'!D8)","v":"BLANK"}]
[null,null,{"$f":"'Step 3-Stand-Alone Freezers'!C9","v":"Average Age of Appliances Collected (yrs)"},{"$f":"IF(ISBLANK('Step 3-Stand-Alone Freezers'!D9),\"BLANK\",'Step 3-Stand-Alone Freezers'!D9)","v":"BLANK"}]
[null,null,{"$f":"'Step 3-Stand-Alone Freezers'!C10","v":"Refrigerant Type"}]
[null,null,{"$f":"'Step 3-Stand-Alone Freezers'!C11","v":"CFC-12"},{"$f":"IF(ISBLANK('Step 3-Stand-Alone Freezers'!D11),\"BLANK\",'Step 3-Stand-Alone Freezers'!D11)","v":"BLANK"}]
[null,null,{"$f":"'Step 3-Stand-Alone Freezers'!C12","v":"HCFC-22"},{"$f":"IF(ISBLANK('Step 3-Stand-Alone Freezers'!D12),\"BLANK\",'Step 3-Stand-Alone Freezers'!D12)","v":"BLANK"}]
[null,null,{"$f":"'Step 3-Stand-Alone Freezers'!C13","v":"HFC-134a"},{"$f":"IF(ISBLANK('Step 3-Stand-Alone Freezers'!D13),\"BLANK\",'Step 3-Stand-Alone Freezers'!D13)","v":"BLANK"}]
[null,null,"Other",{"$f":"IF(ISBLANK('Step 3-Stand-Alone Freezers'!D14),\"BLANK\",'Step 3-Stand-Alone Freezers'!D14)","v":"BLANK"}]
[]
[null,null,"Number of Units with Refrigerant Recovery"]
[null,null,{"$f":"C187","v":"CFC-12"},{"$f":"IF(ISBLANK('Step 3-Stand-Alone Freezers'!E11),\"BLANK\",'Step 3-Stand-Alone Freezers'!E11)","v":"BLANK"}]
[null,null,{"$f":"C188","v":"HCFC-22"},{"$f":"IF(ISBLANK('Step 3-Stand-Alone Freezers'!E12),\"BLANK\",'Step 3-Stand-Alone Freezers'!E12)","v":"BLANK"}]
[null,null,{"$f":"C189","v":"HFC-134a"},{"$f":"IF(ISBLANK('Step 3-Stand-Alone Freezers'!E13),\"BLANK\",'Step 3-Stand-Alone Freezers'!E13)","v":"BLANK"}]
[null,null,{"$f":"C190","v":"Other"},{"$f":"IF(ISBLANK('Step 3-Stand-Alone Freezers'!E14),\"BLANK\",'Step 3-Stand-Alone Freezers'!E14)","v":"BLANK"}]
[]
[null,null,{"$f":"'Step 3-Stand-Alone Freezers'!C16","v":"Insulating Material Type"}]
[null,null,{"$f":"'Step 3-Stand-Alone Freezers'!C17","v":"CFC-11 Blowing Agent"},{"$f":"IF(ISBLANK('Step 3-Stand-Alone Freezers'!D17),\"BLANK\",'Step 3-Stand-Alone Freezers'!D17)","v":"BLANK"}]
[null,null,{"$f":"'Step 3-Stand-Alone Freezers'!C18","v":"HCFC-141b Blowing Agent"},{"$f":"IF(ISBLANK('Step 3-Stand-Alone Freezers'!D18),\"BLANK\",'Step 3-Stand-Alone Freezers'!D18)","v":"BLANK"}]
[null,null,{"$f":"'Step 3-Stand-Alone Freezers'!C19","v":"HFC-134a Blowing Agent"},{"$f":"IF(ISBLANK('Step 3-Stand-Alone Freezers'!D19),\"BLANK\",'Step 3-Stand-Alone Freezers'!D19)","v":"BLANK"}]
[null,null,{"$f":"'Step 3-Stand-Alone Freezers'!C20","v":"HFC-245fa Blowing Agent"},{"$f":"IF(ISBLANK('Step 3-Stand-Alone Freezers'!D20),\"BLANK\",'Step 3-Stand-Alone Freezers'!D20)","v":"BLANK"}]
[null,null,{"$f":"'Step 3-Stand-Alone Freezers'!C21","v":"Cyclopentane  Blowing Agent"},{"$f":"IF(ISBLANK('Step 3-Stand-Alone Freezers'!D21),\"BLANK\",'Step 3-Stand-Alone Freezers'!D21)","v":"BLANK"}]
[null,null,{"$f":"'Step 3-Stand-Alone Freezers'!C22","v":"Fiberglass"},{"$f":"IF(ISBLANK('Step 3-Stand-Alone Freezers'!D22),\"BLANK\",'Step 3-Stand-Alone Freezers'!D22)","v":"BLANK"}]
[null,null,"Other",{"$f":"IF(ISBLANK('Step 3-Stand-Alone Freezers'!D23),\"BLANK\",'Step 3-Stand-Alone Freezers'!D23)","v":"BLANK"}]
[]
[null,null,{"$f":"'Step 3-Stand-Alone Freezers'!E16","v":"Number of Units Processed with Foam Recovery"}]
[null,null,{"$f":"C199","v":"CFC-11 Blowing Agent"},{"$f":"IF(ISBLANK('Step 3-Stand-Alone Freezers'!E17),\"BLANK\",'Step 3-Stand-Alone Freezers'!E17)","v":"BLANK"}]
[null,null,"HCFC-141b Blowing Agent",{"$f":"IF(ISBLANK('Step 3-Stand-Alone Freezers'!E18),\"BLANK\",'Step 3-Stand-Alone Freezers'!E18)","v":"BLANK"}]
[null,null,"HFC-134a Blowing Agent",{"$f":"IF(ISBLANK('Step 3-Stand-Alone Freezers'!E19),\"BLANK\",'Step 3-Stand-Alone Freezers'!E19)","v":"BLANK"}]
[null,null,"HFC-245fa Blowing Agent",{"$f":"IF(ISBLANK('Step 3-Stand-Alone Freezers'!E20),\"BLANK\",'Step 3-Stand-Alone Freezers'!E20)","v":"BLANK"}]
[null,null,"Cyclopentane  Blowing Agent",{"$f":"IF(ISBLANK('Step 3-Stand-Alone Freezers'!E21),\"BLANK\",'Step 3-Stand-Alone Freezers'!E21)","v":"BLANK"}]
[null,null,"Fiberglass",{"$f":"IF(ISBLANK('Step 3-Stand-Alone Freezers'!E22),\"BLANK\",'Step 3-Stand-Alone Freezers'!E22)","v":"BLANK"}]
[null,null,"Other",{"$f":"IF(ISBLANK('Step 3-Stand-Alone Freezers'!E23),\"BLANK\",'Step 3-Stand-Alone Freezers'!E23)","v":"BLANK"}]
[]
[null,null,{"$f":"'Step 3-Stand-Alone Freezers'!F16","v":"Was Foam Recovered From Appliance Doors?"}]
[null,null,{"$f":"C199","v":"CFC-11 Blowing Agent"},{"$f":"IF(ISBLANK('Step 3-Stand-Alone Freezers'!F17),\"BLANK\",'Step 3-Stand-Alone Freezers'!F17)","v":"BLANK"}]
[null,null,"HCFC-141b Blowing Agent",{"$f":"IF(ISBLANK('Step 3-Stand-Alone Freezers'!F18),\"BLANK\",'Step 3-Stand-Alone Freezers'!F18)","v":"BLANK"}]
[null,null,"HFC-134a Blowing Agent",{"$f":"IF(ISBLANK('Step 3-Stand-Alone Freezers'!F19),\"BLANK\",'Step 3-Stand-Alone Freezers'!F19)","v":"BLANK"}]
[null,null,"HFC-245fa Blowing Agent",{"$f":"IF(ISBLANK('Step 3-Stand-Alone Freezers'!F20),\"BLANK\",'Step 3-Stand-Alone Freezers'!F20)","v":"BLANK"}]
[null,null,"Cyclopentane  Blowing Agent"]
[null,null,"Fiberglass"]
[null,null,"Other"]
[]
[null,"Refrigerant (including that recovered from compressor oil)",{"$f":"'Step 3-Stand-Alone Freezers'!D31","v":"CFC-12"}]
[null,null,{"$f":"'Step 3-Stand-Alone Freezers'!D32","v":"Reclaimed"},{"$f":"IF(ISBLANK('Step 3-Stand-Alone Freezers'!F32),\"BLANK\",'Step 3-Stand-Alone Freezers'!F32)","v":"BLANK"}]
[null,null,"Stockpiling with Intent to Reclaim",{"$f":"IF(ISBLANK('Step 3-Stand-Alone Freezers'!F33),\"BLANK\",'Step 3-Stand-Alone Freezers'!F33)","v":"BLANK"}]
[null,null,{"$f":"'Step 3-Stand-Alone Freezers'!D34","v":"Destroyed"},{"$f":"IF(ISBLANK('Step 3-Stand-Alone Freezers'!F34),\"BLANK\",'Step 3-Stand-Alone Freezers'!F34)","v":"BLANK"}]
[null,null,"Stockpiling with Intent to Destroy",{"$f":"IF(ISBLANK('Step 3-Stand-Alone Freezers'!F35),\"BLANK\",'Step 3-Stand-Alone Freezers'!F35)","v":"BLANK"}]
[null,null,{"$f":"'Step 3-Stand-Alone Freezers'!D36","v":"HCFC-22"}]
[null,null,{"$f":"'Step 3-Stand-Alone Freezers'!D37","v":"Reclaimed"},{"$f":"IF(ISBLANK('Step 3-Stand-Alone Freezers'!F37),\"BLANK\",'Step 3-Stand-Alone Freezers'!F37)","v":"BLANK"}]
[null,null,"Stockpiling with Intent to Reclaim",{"$f":"IF(ISBLANK('Step 3-Stand-Alone Freezers'!F38),\"BLANK\",'Step 3-Stand-Alone Freezers'!F38)","v":"BLANK"}]
[null,null,{"$f":"'Step 3-Stand-Alone Freezers'!D39","v":"Destroyed"},{"$f":"IF(ISBLANK('Step 3-Stand-Alone Freezers'!F39),\"BLANK\",'Step 3-Stand-Alone Freezers'!F39)","v":"BLANK"}]
[null,null,"Stockpiling with Intent to Destroy",{"$f":"IF(ISBLANK('Step 3-Stand-Alone Freezers'!F40),\"BLANK\",'Step 3-Stand-Alone Freezers'!F40)","v":"BLANK"}]
[null,null,{"$f":"'Step 3-Stand-Alone Freezers'!D41","v":"HFC-134a"}]
[null,null,{"$f":"'Step 3-Stand-Alone Freezers'!D42","v":"Reclaimed"},{"$f":"IF(ISBLANK('Step 3-Stand-Alone Freezers'!F42),\"BLANK\",'Step 3-Stand-Alone Freezers'!F42)","v":"BLANK"}]
[null,null,"Stockpiling with Intent to Reclaim",{"$f":"IF(ISBLANK('Step 3-Stand-Alone Freezers'!F43),\"BLANK\",'Step 3-Stand-Alone Freezers'!F43)","v":"BLANK"}]
[null,null,{"$f":"'Step 3-Stand-Alone Freezers'!D44","v":"Destroyed"},{"$f":"IF(ISBLANK('Step 3-Stand-Alone Freezers'!F44),\"BLANK\",'Step 3-Stand-Alone Freezers'!F44)","v":"BLANK"}]
[null,null,"Stockpiling with Intent to Destroy",{"$f":"IF(ISBLANK('Step 3-Stand-Alone Freezers'!F45),\"BLANK\",'Step 3-Stand-Alone Freezers'!F45)","v":"BLANK"}]
[null,"Foam Blowing Agent",{"$f":"'Step 3-Stand-Alone Freezers'!D46","v":"CFC-11"}]
[null,null,{"$f":"'Step 3-Stand-Alone Freezers'!D47","v":"Reclaimed"},{"$f":"IF(ISBLANK('Step 3-Stand-Alone Freezers'!F47),\"BLANK\",'Step 3-Stand-Alone Freezers'!F47)","v":"BLANK"}]
[null,null,"Stockpiling with Intent to Reclaim",{"$f":"IF(ISBLANK('Step 3-Stand-Alone Freezers'!F48),\"BLANK\",'Step 3-Stand-Alone Freezers'!F48)","v":"BLANK"}]
[null,null,{"$f":"'Step 3-Stand-Alone Freezers'!D49","v":"Destroyed"},{"$f":"IF(ISBLANK('Step 3-Stand-Alone Freezers'!F49),\"BLANK\",'Step 3-Stand-Alone Freezers'!F49)","v":"BLANK"}]
[null,null,"Stockpiling with Intent to Destroy",{"$f":"IF(ISBLANK('Step 3-Stand-Alone Freezers'!F50),\"BLANK\",'Step 3-Stand-Alone Freezers'!F50)","v":"BLANK"}]
[null,null,{"$f":"'Step 3-Stand-Alone Freezers'!D51","v":"HCFC-141b"}]
[null,null,{"$f":"'Step 3-Stand-Alone Freezers'!D52","v":"Reclaimed"},{"$f":"IF(ISBLANK('Step 3-Stand-Alone Freezers'!F52),\"BLANK\",'Step 3-Stand-Alone Freezers'!F52)","v":"BLANK"}]
[null,null,"Stockpiling with Intent to Reclaim",{"$f":"IF(ISBLANK('Step 3-Stand-Alone Freezers'!F53),\"BLANK\",'Step 3-Stand-Alone Freezers'!F53)","v":"BLANK"}]
[null,null,{"$f":"'Step 3-Stand-Alone Freezers'!D54","v":"Destroyed"},{"$f":"IF(ISBLANK('Step 3-Stand-Alone Freezers'!F54),\"BLANK\",'Step 3-Stand-Alone Freezers'!F54)","v":"BLANK"}]
[null,null,"Stockpiling with Intent to Destroy",{"$f":"IF(ISBLANK('Step 3-Stand-Alone Freezers'!F55),\"BLANK\",'Step 3-Stand-Alone Freezers'!F55)","v":"BLANK"}]
[null,null,{"$f":"'Step 3-Stand-Alone Freezers'!D56","v":"HFC-134a"}]
[null,null,{"$f":"'Step 3-Stand-Alone Freezers'!D57","v":"Reclaimed"},{"$f":"IF(ISBLANK('Step 3-Stand-Alone Freezers'!F57),\"BLANK\",'Step 3-Stand-Alone Freezers'!F57)","v":"BLANK"}]
[null,null,"Stockpiling with Intent to Reclaim",{"$f":"IF(ISBLANK('Step 3-Stand-Alone Freezers'!F58),\"BLANK\",'Step 3-Stand-Alone Freezers'!F58)","v":"BLANK"}]
[null,null,{"$f":"'Step 3-Stand-Alone Freezers'!D59","v":"Destroyed"},{"$f":"IF(ISBLANK('Step 3-Stand-Alone Freezers'!F59),\"BLANK\",'Step 3-Stand-Alone Freezers'!F59)","v":"BLANK"}]
[null,null,"Stockpiling with Intent to Destroy",{"$f":"IF(ISBLANK('Step 3-Stand-Alone Freezers'!F60),\"BLANK\",'Step 3-Stand-Alone Freezers'!F60)","v":"BLANK"}]
[null,null,{"$f":"'Step 3-Stand-Alone Freezers'!D61","v":"HFC-245fa"}]
[null,null,{"$f":"'Step 3-Stand-Alone Freezers'!D62","v":"Reclaimed"},{"$f":"IF(ISBLANK('Step 3-Stand-Alone Freezers'!F62),\"BLANK\",'Step 3-Stand-Alone Freezers'!F62)","v":"BLANK"}]
[null,null,"Stockpiling with Intent to Reclaim",{"$f":"IF(ISBLANK('Step 3-Stand-Alone Freezers'!F63),\"BLANK\",'Step 3-Stand-Alone Freezers'!F63)","v":"BLANK"}]
[null,null,{"$f":"'Step 3-Stand-Alone Freezers'!D64","v":"Destroyed"},{"$f":"IF(ISBLANK('Step 3-Stand-Alone Freezers'!F64),\"BLANK\",'Step 3-Stand-Alone Freezers'!F64)","v":"BLANK"}]
[null,null,"Stockpiling with Intent to Destroy",{"$f":"IF(ISBLANK('Step 3-Stand-Alone Freezers'!F65),\"BLANK\",'Step 3-Stand-Alone Freezers'!F65)","v":"BLANK"}]
[null,"Used Oil",{"$f":"'Step 3-Stand-Alone Freezers'!D66","v":"Recycled"},{"$f":"IF(ISBLANK('Step 3-Stand-Alone Freezers'!F66),\"BLANK\",'Step 3-Stand-Alone Freezers'!F66)","v":"BLANK"}]
[null,0,{"$f":"'Step 3-Stand-Alone Freezers'!D67","v":"Disposed"},{"$f":"IF(ISBLANK('Step 3-Stand-Alone Freezers'!F67),\"BLANK\",'Step 3-Stand-Alone Freezers'!F67)","v":"BLANK"}]
[null,"Metal",{"$f":"'Step 3-Stand-Alone Freezers'!D68","v":"Ferrous Metal Recycled"},{"$f":"IF(ISBLANK('Step 3-Stand-Alone Freezers'!F68),\"BLANK\",'Step 3-Stand-Alone Freezers'!F68)","v":"BLANK"}]
[null,0,{"$f":"'Step 3-Stand-Alone Freezers'!D69","v":"Non-Ferrous Metal Recycled"},{"$f":"IF(ISBLANK('Step 3-Stand-Alone Freezers'!F69),\"BLANK\",'Step 3-Stand-Alone Freezers'!F69)","v":"BLANK"}]
[null,"Plastic",{"$f":"'Step 3-Stand-Alone Freezers'!D70","v":"Recycled"},{"$f":"IF(ISBLANK('Step 3-Stand-Alone Freezers'!F70),\"BLANK\",'Step 3-Stand-Alone Freezers'!F70)","v":"BLANK"}]
[null,"Capacitors",{"$f":"'Step 3-Stand-Alone Freezers'!D71","v":"Destroyed"},{"$f":"IF(ISBLANK('Step 3-Stand-Alone Freezers'!F71),\"BLANK\",'Step 3-Stand-Alone Freezers'!F71)","v":"BLANK"}]
[null,"Mercury-Containing Components",{"$f":"'Step 3-Stand-Alone Freezers'!D72","v":"Recycled"},{"$f":"IF(ISBLANK('Step 3-Stand-Alone Freezers'!F72),\"BLANK\",'Step 3-Stand-Alone Freezers'!F72)","v":"BLANK"}]
[null,0,{"$f":"'Step 3-Stand-Alone Freezers'!D73","v":"Disposed"},{"$f":"IF(ISBLANK('Step 3-Stand-Alone Freezers'!F73),\"BLANK\",'Step 3-Stand-Alone Freezers'!F73)","v":"BLANK"}]
[]
[null,"Actual Measurement or Assumptions"]
[null,null,{"$f":"'Step 3-Stand-Alone Freezers'!C10","v":"Refrigerant Type"}]
[null,null,{"$f":"'Step 3-Stand-Alone Freezers'!C11","v":"CFC-12"},{"$f":"IF(ISBLANK('Step 3-Stand-Alone Freezers'!F11),\"BLANK\",'Step 3-Stand-Alone Freezers'!F11)","v":"BLANK"}]
[null,null,{"$f":"'Step 3-Stand-Alone Freezers'!C12","v":"HCFC-22"},{"$f":"IF(ISBLANK('Step 3-Stand-Alone Freezers'!F12),\"BLANK\",'Step 3-Stand-Alone Freezers'!F12)","v":"BLANK"}]
[null,null,{"$f":"'Step 3-Stand-Alone Freezers'!C13","v":"HFC-134a"},{"$f":"IF(ISBLANK('Step 3-Stand-Alone Freezers'!F13),\"BLANK\",'Step 3-Stand-Alone Freezers'!F13)","v":"BLANK"}]
[null,null,{"$f":"'Step 3-Stand-Alone Freezers'!C14","v":"Other"},{"$f":"IF(ISBLANK('Step 3-Stand-Alone Freezers'!F14),\"BLANK\",'Step 3-Stand-Alone Freezers'!F14)","v":"BLANK"}]
[null,null,"Comments:",{"$f":"IF(ISBLANK('Step 3-Stand-Alone Freezers'!G11),\"BLANK\",('Step 3-Stand-Alone Freezers'!G11))","v":"BLANK"}]
[null,null,{"$f":"'Step 3-Stand-Alone Freezers'!C16","v":"Insulating Material Type"}]
[null,null,{"$f":"'Step 3-Stand-Alone Freezers'!C17","v":"CFC-11 Blowing Agent"},{"$f":"IF(ISBLANK('Step 3-Stand-Alone Freezers'!G17),\"BLANK\",'Step 3-Stand-Alone Freezers'!G17)","v":"BLANK"}]
[null,null,{"$f":"'Step 3-Stand-Alone Freezers'!C18","v":"HCFC-141b Blowing Agent"},{"$f":"IF(ISBLANK('Step 3-Stand-Alone Freezers'!G18),\"BLANK\",'Step 3-Stand-Alone Freezers'!G18)","v":"BLANK"}]
[null,null,{"$f":"'Step 3-Stand-Alone Freezers'!C19","v":"HFC-134a Blowing Agent"},{"$f":"IF(ISBLANK('Step 3-Stand-Alone Freezers'!G19),\"BLANK\",'Step 3-Stand-Alone Freezers'!G19)","v":"BLANK"}]
[null,null,{"$f":"'Step 3-Stand-Alone Freezers'!C20","v":"HFC-245fa Blowing Agent"},{"$f":"IF(ISBLANK('Step 3-Stand-Alone Freezers'!G20),\"BLANK\",'Step 3-Stand-Alone Freezers'!G20)","v":"BLANK"}]
[null,null,{"$f":"'Step 3-Stand-Alone Freezers'!C21","v":"Cyclopentane  Blowing Agent"},{"$f":"IF(ISBLANK('Step 3-Stand-Alone Freezers'!G21),\"BLANK\",'Step 3-Stand-Alone Freezers'!G21)","v":"BLANK"}]
[null,null,{"$f":"'Step 3-Stand-Alone Freezers'!C22","v":"Fiberglass"},{"$f":"IF(ISBLANK('Step 3-Stand-Alone Freezers'!G22),\"BLANK\",'Step 3-Stand-Alone Freezers'!G22)","v":"BLANK"}]
[null,null,{"$f":"'Step 3-Stand-Alone Freezers'!C23","v":"Other"},{"$f":"IF(ISBLANK('Step 3-Stand-Alone Freezers'!G23),\"BLANK\",'Step 3-Stand-Alone Freezers'!G23)","v":"BLANK"}]
[null,null,"Comments:",{"$f":"IF(ISBLANK('Step 3-Stand-Alone Freezers'!H17),\"BLANK\",('Step 3-Stand-Alone Freezers'!H17))","v":"BLANK"}]
[]
[null,"Refrigerant (including that recovered from compressor oil)","CFC-12"]
[null,null,"Reclaimed",{"$f":"IF(ISBLANK('Step 3-Stand-Alone Freezers'!H32),\"BLANK\",'Step 3-Stand-Alone Freezers'!H32)","v":"BLANK"}]
[null,null,"Stockpiling with Intent to Reclaim",{"$f":"IF(ISBLANK('Step 3-Stand-Alone Freezers'!H33),\"BLANK\",'Step 3-Stand-Alone Freezers'!H33)","v":"BLANK"}]
[null,null,"Destroyed",{"$f":"IF(ISBLANK('Step 3-Stand-Alone Freezers'!H34),\"BLANK\",'Step 3-Stand-Alone Freezers'!H34)","v":"BLANK"}]
[null,null,"Stockpiling with Intent to Destroy",{"$f":"IF(ISBLANK('Step 3-Stand-Alone Freezers'!H35),\"BLANK\",'Step 3-Stand-Alone Freezers'!H35)","v":"BLANK"}]
[null,null,"HCFC-22"]
[null,null,"Reclaimed",{"$f":"IF(ISBLANK('Step 3-Stand-Alone Freezers'!H37),\"BLANK\",'Step 3-Stand-Alone Freezers'!H37)","v":"BLANK"}]
[null,null,"Stockpiling with Intent to Reclaim",{"$f":"IF(ISBLANK('Step 3-Stand-Alone Freezers'!H38),\"BLANK\",'Step 3-Stand-Alone Freezers'!H38)","v":"BLANK"}]
[null,null,"Destroyed",{"$f":"IF(ISBLANK('Step 3-Stand-Alone Freezers'!H39),\"BLANK\",'Step 3-Stand-Alone Freezers'!H39)","v":"BLANK"}]
[null,null,"Stockpiling with Intent to Destroy",{"$f":"IF(ISBLANK('Step 3-Stand-Alone Freezers'!H40),\"BLANK\",'Step 3-Stand-Alone Freezers'!H40)","v":"BLANK"}]
[null,null,"HFC-134a"]
[null,null,"Reclaimed",{"$f":"IF(ISBLANK('Step 3-Stand-Alone Freezers'!H42),\"BLANK\",'Step 3-Stand-Alone Freezers'!H42)","v":"BLANK"}]
[null,null,"Stockpiling with Intent to Reclaim",{"$f":"IF(ISBLANK('Step 3-Stand-Alone Freezers'!H43),\"BLANK\",'Step 3-Stand-Alone Freezers'!H43)","v":"BLANK"}]
[null,null,"Destroyed",{"$f":"IF(ISBLANK('Step 3-Stand-Alone Freezers'!H44),\"BLANK\",'Step 3-Stand-Alone Freezers'!H44)","v":"BLANK"}]
[null,null,"Stockpiling with Intent to Destroy",{"$f":"IF(ISBLANK('Step 3-Stand-Alone Freezers'!H45),\"BLANK\",'Step 3-Stand-Alone Freezers'!H45)","v":"BLANK"}]
[null,"Foam Blowing Agent","CFC-11"]
[null,null,"Reclaimed",{"$f":"IF(ISBLANK('Step 3-Stand-Alone Freezers'!H47),\"BLANK\",'Step 3-Stand-Alone Freezers'!H47)","v":"BLANK"}]
[null,null,"Stockpiling with Intent to Reclaim",{"$f":"IF(ISBLANK('Step 3-Stand-Alone Freezers'!H48),\"BLANK\",'Step 3-Stand-Alone Freezers'!H48)","v":"BLANK"}]
[null,null,"Destroyed",{"$f":"IF(ISBLANK('Step 3-Stand-Alone Freezers'!H49),\"BLANK\",'Step 3-Stand-Alone Freezers'!H49)","v":"BLANK"}]
[null,null,"Stockpiling with Intent to Destroy",{"$f":"IF(ISBLANK('Step 3-Stand-Alone Freezers'!H50),\"BLANK\",'Step 3-Stand-Alone Freezers'!H50)","v":"BLANK"}]
[null,null,"HCFC-141b"]
[null,null,"Reclaimed",{"$f":"IF(ISBLANK('Step 3-Stand-Alone Freezers'!H52),\"BLANK\",'Step 3-Stand-Alone Freezers'!H52)","v":"BLANK"}]
[null,null,"Stockpiling with Intent to Reclaim",{"$f":"IF(ISBLANK('Step 3-Stand-Alone Freezers'!H53),\"BLANK\",'Step 3-Stand-Alone Freezers'!H53)","v":"BLANK"}]
[null,null,"Destroyed",{"$f":"IF(ISBLANK('Step 3-Stand-Alone Freezers'!H54),\"BLANK\",'Step 3-Stand-Alone Freezers'!H54)","v":"BLANK"}]
[null,null,"Stockpiling with Intent to Destroy",{"$f":"IF(ISBLANK('Step 3-Stand-Alone Freezers'!H55),\"BLANK\",'Step 3-Stand-Alone Freezers'!H55)","v":"BLANK"}]
[null,null,"HFC-134a"]
[null,null,"Reclaimed",{"$f":"IF(ISBLANK('Step 3-Stand-Alone Freezers'!H57),\"BLANK\",'Step 3-Stand-Alone Freezers'!H57)","v":"BLANK"}]
[null,null,"Stockpiling with Intent to Reclaim",{"$f":"IF(ISBLANK('Step 3-Stand-Alone Freezers'!H58),\"BLANK\",'Step 3-Stand-Alone Freezers'!H58)","v":"BLANK"}]
[null,null,"Destroyed",{"$f":"IF(ISBLANK('Step 3-Stand-Alone Freezers'!H59),\"BLANK\",'Step 3-Stand-Alone Freezers'!H59)","v":"BLANK"}]
[null,null,"Stockpiling with Intent to Destroy",{"$f":"IF(ISBLANK('Step 3-Stand-Alone Freezers'!H60),\"BLANK\",'Step 3-Stand-Alone Freezers'!H60)","v":"BLANK"}]
[null,null,"HFC-245fa"]
[null,null,"Reclaimed",{"$f":"IF(ISBLANK('Step 3-Stand-Alone Freezers'!H62),\"BLANK\",'Step 3-Stand-Alone Freezers'!H62)","v":"BLANK"}]
[null,null,"Stockpiling with Intent to Reclaim",{"$f":"IF(ISBLANK('Step 3-Stand-Alone Freezers'!H63),\"BLANK\",'Step 3-Stand-Alone Freezers'!H63)","v":"BLANK"}]
[null,null,"Destroyed",{"$f":"IF(ISBLANK('Step 3-Stand-Alone Freezers'!H64),\"BLANK\",'Step 3-Stand-Alone Freezers'!H64)","v":"BLANK"}]
[null,null,"Stockpiling with Intent to Destroy",{"$f":"IF(ISBLANK('Step 3-Stand-Alone Freezers'!H65),\"BLANK\",'Step 3-Stand-Alone Freezers'!H65)","v":"BLANK"}]
[null,"Used Oil","Recycled",{"$f":"IF(ISBLANK('Step 3-Stand-Alone Freezers'!H66),\"BLANK\",'Step 3-Stand-Alone Freezers'!H66)","v":"BLANK"}]
[null,0,"Disposed",{"$f":"IF(ISBLANK('Step 3-Stand-Alone Freezers'!H67),\"BLANK\",'Step 3-Stand-Alone Freezers'!H67)","v":"BLANK"}]
[null,"Metal","Ferrous Metal Recycled",{"$f":"IF(ISBLANK('Step 3-Stand-Alone Freezers'!H68),\"BLANK\",'Step 3-Stand-Alone Freezers'!H68)","v":"BLANK"}]
[null,0,"Non-Ferrous Metal Recycled",{"$f":"IF(ISBLANK('Step 3-Stand-Alone Freezers'!H69),\"BLANK\",'Step 3-Stand-Alone Freezers'!H69)","v":"BLANK"}]
[null,"Plastic","Recycled",{"$f":"IF(ISBLANK('Step 3-Stand-Alone Freezers'!H70),\"BLANK\",'Step 3-Stand-Alone Freezers'!H70)","v":"BLANK"}]
[null,"Capacitors","Destroyed",{"$f":"IF(ISBLANK('Step 3-Stand-Alone Freezers'!H71),\"BLANK\",'Step 3-Stand-Alone Freezers'!H71)","v":"BLANK"}]
[null,"Mercury-Containing Components","Recycled",{"$f":"IF(ISBLANK('Step 3-Stand-Alone Freezers'!H72),\"BLANK\",'Step 3-Stand-Alone Freezers'!H72)","v":"BLANK"}]
[null,0,"Disposed",{"$f":"IF(ISBLANK('Step 3-Stand-Alone Freezers'!H73),\"BLANK\",'Step 3-Stand-Alone Freezers'!H73)","v":"BLANK"}]
[]
[null,null,{"$f":"'Step 3-Stand-Alone Freezers'!C78","v":"Average Number of Remaining Years of Useful Life"},{"$f":"IF(ISBLANK('Step 3-Stand-Alone Freezers'!E78),\"BLANK\",'Step 3-Stand-Alone Freezers'!E78)","v":""}]
[null,null,{"$f":"'Step 3-Stand-Alone Freezers'!C79","v":"Average Energy Consumed/Year/Unit (kWh)"},{"$f":"IF(ISBLANK('Step 3-Stand-Alone Freezers'!E79),\"BLANK\",'Step 3-Stand-Alone Freezers'!E79)","v":"BLANK"}]
[null,null,{"$f":"'Step 3-Stand-Alone Freezers'!C80","v":"Average Energy Cost for Residential Consumers ($/kWh)  \n[please provide the average cost during the current program period]"},{"$f":"IF(ISBLANK('Step 3-Stand-Alone Freezers'!E80),\"BLANK\",'Step 3-Stand-Alone Freezers'!E80)","v":"BLANK"}]
[]
[null,null,{"$f":"'Step 3-Stand-Alone Freezers'!C82","v":"Additional Comments:"},{"$f":"IF(ISBLANK('Step 3-Stand-Alone Freezers'!D82),\"BLANK\",'Step 3-Stand-Alone Freezers'!D82)","v":"BLANK"}]
[]
[]
[]
[null,"Step 3 - Air-Conditioning Units"]
[]
[null,null,"Units Processed"]
[null,null,{"$f":"'Step 3-Air-Conditioning Units'!C8","v":"Total Number of Units Processed"},{"$f":"IF(ISBLANK('Step 3-Air-Conditioning Units'!D8),\"BLANK\",'Step 3-Air-Conditioning Units'!D8)","v":"BLANK"}]
[null,null,{"$f":"'Step 3-Air-Conditioning Units'!C9","v":"Average Age of Appliances Collected (yrs)"},{"$f":"IF(ISBLANK('Step 3-Air-Conditioning Units'!D9),\"BLANK\",'Step 3-Air-Conditioning Units'!D9)","v":"BLANK"}]
[null,null,{"$f":"'Step 3-Air-Conditioning Units'!C10","v":"Refrigerant Type"}]
[null,null,{"$f":"'Step 3-Air-Conditioning Units'!C11","v":"HCFC-22"},{"$f":"IF(ISBLANK('Step 3-Air-Conditioning Units'!D11),\"BLANK\",'Step 3-Air-Conditioning Units'!D11)","v":"BLANK"}]
[null,null,{"$f":"'Step 3-Air-Conditioning Units'!C12","v":"R-407C"},{"$f":"IF(ISBLANK('Step 3-Air-Conditioning Units'!D12),\"BLANK\",'Step 3-Air-Conditioning Units'!D12)","v":"BLANK"}]
[null,null,{"$f":"'Step 3-Air-Conditioning Units'!C13","v":"R-410A"},{"$f":"IF(ISBLANK('Step 3-Air-Conditioning Units'!D13),\"BLANK\",'Step 3-Air-Conditioning Units'!D13)","v":"BLANK"}]
[null,null,"Other",{"$f":"IF(ISBLANK('Step 3-Air-Conditioning Units'!D14),\"BLANK\",'Step 3-Air-Conditioning Units'!D14)","v":"BLANK"}]
[]
[null,null,"Units with Refrigerant Recovery"]
[null,null,{"$f":"C344","v":"HCFC-22"},{"$f":"IF(ISBLANK('Step 3-Air-Conditioning Units'!E11),\"BLANK\",'Step 3-Air-Conditioning Units'!E11)","v":"BLANK"}]
[null,null,{"$f":"C345","v":"R-407C"},{"$f":"IF(ISBLANK('Step 3-Air-Conditioning Units'!E12),\"BLANK\",'Step 3-Air-Conditioning Units'!E12)","v":"BLANK"}]
[null,null,{"$f":"C346","v":"R-410A"},{"$f":"IF(ISBLANK('Step 3-Air-Conditioning Units'!E13),\"BLANK\",'Step 3-Air-Conditioning Units'!E13)","v":"BLANK"}]
[null,null,{"$f":"C347","v":"Other"},{"$f":"IF(ISBLANK('Step 3-Air-Conditioning Units'!E14),\"BLANK\",'Step 3-Air-Conditioning Units'!E14)","v":"BLANK"}]
[]
[null,"Refrigerant (including that recovered from compressor oil)","HCFC-22"]
[null,null,"Reclaimed",{"$f":"IF(ISBLANK('Step 3-Air-Conditioning Units'!F23),\"BLANK\",'Step 3-Air-Conditioning Units'!F23)","v":"BLANK"}]
[null,null,"Stockpiling with Intent to Reclaim",{"$f":"IF(ISBLANK('Step 3-Air-Conditioning Units'!F24),\"BLANK\",'Step 3-Air-Conditioning Units'!F24)","v":"BLANK"}]
[null,null,"Destroyed",{"$f":"IF(ISBLANK('Step 3-Air-Conditioning Units'!F25),\"BLANK\",'Step 3-Air-Conditioning Units'!F25)","v":"BLANK"}]
[null,null,"Stockpiling with Intent to Destroy",{"$f":"IF(ISBLANK('Step 3-Air-Conditioning Units'!F26),\"BLANK\",'Step 3-Air-Conditioning Units'!F26)","v":"BLANK"}]
[null,null,"R-407C "]
[null,null,"Reclaimed",{"$f":"IF(ISBLANK('Step 3-Air-Conditioning Units'!F28),\"BLANK\",'Step 3-Air-Conditioning Units'!F28)","v":"BLANK"}]
[null,null,"Stockpiling with Intent to Reclaim",{"$f":"IF(ISBLANK('Step 3-Air-Conditioning Units'!F29),\"BLANK\",'Step 3-Air-Conditioning Units'!F29)","v":"BLANK"}]
[null,null,"Destroyed",{"$f":"IF(ISBLANK('Step 3-Air-Conditioning Units'!F30),\"BLANK\",'Step 3-Air-Conditioning Units'!F30)","v":"BLANK"}]
[null,null,"Stockpiling with Intent to Destroy",{"$f":"IF(ISBLANK('Step 3-Air-Conditioning Units'!F31),\"BLANK\",'Step 3-Air-Conditioning Units'!F31)","v":"BLANK"}]
[null,null,"R-410A "]
[null,null,"Reclaimed",{"$f":"IF(ISBLANK('Step 3-Air-Conditioning Units'!F33),\"BLANK\",'Step 3-Air-Conditioning Units'!F33)","v":"BLANK"}]
[null,null,"Stockpiling with Intent to Reclaim",{"$f":"IF(ISBLANK('Step 3-Air-Conditioning Units'!F34),\"BLANK\",'Step 3-Air-Conditioning Units'!F34)","v":"BLANK"}]
[null,null,"Destroyed",{"$f":"IF(ISBLANK('Step 3-Air-Conditioning Units'!F35),\"BLANK\",'Step 3-Air-Conditioning Units'!F35)","v":"BLANK"}]
[null,null,"Stockpiling with Intent to Destroy",{"$f":"IF(ISBLANK('Step 3-Air-Conditioning Units'!F36),\"BLANK\",'Step 3-Air-Conditioning Units'!F36)","v":"BLANK"}]
[null,"Used Oil","Recycled",{"$f":"IF(ISBLANK('Step 3-Air-Conditioning Units'!F37),\"BLANK\",'Step 3-Air-Conditioning Units'!F37)","v":"BLANK"}]
[null,0,"Disposed",{"$f":"IF(ISBLANK('Step 3-Air-Conditioning Units'!F38),\"BLANK\",'Step 3-Air-Conditioning Units'!F38)","v":"BLANK"}]
[null,"Metal","Ferrous Metal Recycled",{"$f":"IF(ISBLANK('Step 3-Air-Conditioning Units'!F39),\"BLANK\",'Step 3-Air-Conditioning Units'!F39)","v":"BLANK"}]
[null,0,"Non-Ferrous Metal Recycled",{"$f":"IF(ISBLANK('Step 3-Air-Conditioning Units'!F40),\"BLANK\",'Step 3-Air-Conditioning Units'!F40)","v":"BLANK"}]
[null,"Plastic","Recycled",{"$f":"IF(ISBLANK('Step 3-Air-Conditioning Units'!F41),\"BLANK\",'Step 3-Air-Conditioning Units'!F41)","v":"BLANK"}]
[null,"Capacitors","Destroyed",{"$f":"IF(ISBLANK('Step 3-Air-Conditioning Units'!F42),\"BLANK\",'Step 3-Air-Conditioning Units'!F42)","v":"BLANK"}]
[]
[null,"Actual Measurement or Assumptions"]
[null,null,{"$f":"'Step 3-Air-Conditioning Units'!C10","v":"Refrigerant Type"}]
[null,null,{"$f":"'Step 3-Air-Conditioning Units'!C11","v":"HCFC-22"},{"$f":"IF(ISBLANK('Step 3-Air-Conditioning Units'!F11),\"BLANK\",'Step 3-Air-Conditioning Units'!F11)","v":"BLANK"}]
[null,null,{"$f":"'Step 3-Air-Conditioning Units'!C12","v":"R-407C"},{"$f":"IF(ISBLANK('Step 3-Air-Conditioning Units'!F12),\"BLANK\",'Step 3-Air-Conditioning Units'!F12)","v":"BLANK"}]
[null,null,{"$f":"'Step 3-Air-Conditioning Units'!C13","v":"R-410A"},{"$f":"IF(ISBLANK('Step 3-Air-Conditioning Units'!F13),\"BLANK\",'Step 3-Air-Conditioning Units'!F13)","v":"BLANK"}]
[null,null,{"$f":"'Step 3-Air-Conditioning Units'!C14","v":"Other"},{"$f":"IF(ISBLANK('Step 3-Air-Conditioning Units'!F14),\"BLANK\",'Step 3-Air-Conditioning Units'!F14)","v":"BLANK"}]
[null,null,"Comments",{"$f":"IF(ISBLANK('Step 3-Air-Conditioning Units'!G11),\"BLANK\",'Step 3-Air-Conditioning Units'!G11)","v":"BLANK"}]
[]
[null,"Refrigerant (including that recovered from compressor oil)","HCFC-22"]
[null,null,"Reclaimed",{"$f":"IF(ISBLANK('Step 3-Air-Conditioning Units'!H23),\"BLANK\",'Step 3-Air-Conditioning Units'!H23)","v":"BLANK"}]
[null,null,"Stockpiling with Intent to Reclaim",{"$f":"IF(ISBLANK('Step 3-Air-Conditioning Units'!H24),\"BLANK\",'Step 3-Air-Conditioning Units'!H24)","v":"BLANK"}]
[null,null,"Destroyed",{"$f":"IF(ISBLANK('Step 3-Air-Conditioning Units'!H25),\"BLANK\",'Step 3-Air-Conditioning Units'!H25)","v":"BLANK"}]
[null,null,"Stockpiling with Intent to Destroy",{"$f":"IF(ISBLANK('Step 3-Air-Conditioning Units'!H26),\"BLANK\",'Step 3-Air-Conditioning Units'!H26)","v":"BLANK"}]
[null,null,"R-407C "]
[null,null,"Reclaimed",{"$f":"IF(ISBLANK('Step 3-Air-Conditioning Units'!H28),\"BLANK\",'Step 3-Air-Conditioning Units'!H28)","v":"BLANK"}]
[null,null,"Stockpiling with Intent to Reclaim",{"$f":"IF(ISBLANK('Step 3-Air-Conditioning Units'!H29),\"BLANK\",'Step 3-Air-Conditioning Units'!H29)","v":"BLANK"}]
[null,null,"Destroyed",{"$f":"IF(ISBLANK('Step 3-Air-Conditioning Units'!H30),\"BLANK\",'Step 3-Air-Conditioning Units'!H30)","v":"BLANK"}]
[null,null,"Stockpiling with Intent to Destroy",{"$f":"IF(ISBLANK('Step 3-Air-Conditioning Units'!H31),\"BLANK\",'Step 3-Air-Conditioning Units'!H31)","v":"BLANK"}]
[null,null,"R-410A "]
[null,null,"Reclaimed",{"$f":"IF(ISBLANK('Step 3-Air-Conditioning Units'!H33),\"BLANK\",'Step 3-Air-Conditioning Units'!H33)","v":"BLANK"}]
[null,null,"Stockpiling with Intent to Reclaim",{"$f":"IF(ISBLANK('Step 3-Air-Conditioning Units'!H34),\"BLANK\",'Step 3-Air-Conditioning Units'!H34)","v":"BLANK"}]
[null,null,"Destroyed",{"$f":"IF(ISBLANK('Step 3-Air-Conditioning Units'!H35),\"BLANK\",'Step 3-Air-Conditioning Units'!H35)","v":"BLANK"}]
[null,null,"Stockpiling with Intent to Destroy",{"$f":"IF(ISBLANK('Step 3-Air-Conditioning Units'!H36),\"BLANK\",'Step 3-Air-Conditioning Units'!H36)","v":"BLANK"}]
[null,"Used Oil","Recycled",{"$f":"IF(ISBLANK('Step 3-Air-Conditioning Units'!H37),\"BLANK\",'Step 3-Air-Conditioning Units'!H37)","v":"BLANK"}]
[null,0,"Disposed",{"$f":"IF(ISBLANK('Step 3-Air-Conditioning Units'!H38),\"BLANK\",'Step 3-Air-Conditioning Units'!H38)","v":"BLANK"}]
[null,"Metal","Ferrous Metal Recycled",{"$f":"IF(ISBLANK('Step 3-Air-Conditioning Units'!H39),\"BLANK\",'Step 3-Air-Conditioning Units'!H39)","v":"BLANK"}]
[null,0,"Non-Ferrous Metal Recycled",{"$f":"IF(ISBLANK('Step 3-Air-Conditioning Units'!H40),\"BLANK\",'Step 3-Air-Conditioning Units'!H40)","v":"BLANK"}]
[null,"Plastic","Recycled",{"$f":"IF(ISBLANK('Step 3-Air-Conditioning Units'!H41),\"BLANK\",'Step 3-Air-Conditioning Units'!H41)","v":"BLANK"}]
[null,"Capacitors","Destroyed",{"$f":"IF(ISBLANK('Step 3-Air-Conditioning Units'!H42),\"BLANK\",'Step 3-Air-Conditioning Units'!H42)","v":"BLANK"}]
[]
[null,null,{"$f":"'Step 3-Air-Conditioning Units'!C47","v":"Average Number of Remaining Years of Useful Life"},{"$f":"IF(ISBLANK('Step 3-Air-Conditioning Units'!E47),\"BLANK\",'Step 3-Air-Conditioning Units'!E47)","v":"BLANK"}]
[null,null,{"$f":"'Step 3-Air-Conditioning Units'!C48","v":"Average Energy Consumed/Year/Unit (kWh)"},{"$f":"IF(ISBLANK('Step 3-Air-Conditioning Units'!E48),\"BLANK\",'Step 3-Air-Conditioning Units'!E48)","v":"BLANK"}]
[null,null,{"$f":"'Step 3-Air-Conditioning Units'!C49","v":"Average Energy Cost for Residential Consumers ($/kWh) \n[please provide the average cost during the current program period]"},{"$f":"IF(ISBLANK('Step 3-Air-Conditioning Units'!E49),\"BLANK\",'Step 3-Air-Conditioning Units'!E49)","v":"BLANK"}]
[]
[null,null,{"$f":"'Step 3-Air-Conditioning Units'!C51","v":"Additional Comments:"},{"$f":"IF(ISBLANK('Step 3-Air-Conditioning Units'!D51),\"BLANK\",'Step 3-Air-Conditioning Units'!D51)","v":"BLANK"}]
[]
[]
[]
[null,"Step 3 - Dehumidifiers"]
[]
[null,null,"Units Processed"]
[null,null,{"$f":"'Step 3-Dehumidifiers'!C8","v":"Total Number of Units Processed"},{"$f":"IF(ISBLANK('Step 3-Dehumidifiers'!D8),\"BLANK\",'Step 3-Dehumidifiers'!D8)","v":"BLANK"}]
[null,null,{"$f":"'Step 3-Dehumidifiers'!C9","v":"Average Age of Appliances Collected (yrs)"},{"$f":"IF(ISBLANK('Step 3-Dehumidifiers'!D9),\"BLANK\",'Step 3-Dehumidifiers'!D9)","v":"BLANK"}]
[null,null,{"$f":"'Step 3-Dehumidifiers'!C10","v":"Refrigerant Type"}]
[null,null,"CFC-12",{"$f":"IF(ISBLANK('Step 3-Dehumidifiers'!D11),\"BLANK\",'Step 3-Dehumidifiers'!D11)","v":"BLANK"}]
[null,null,{"$f":"'Step 3-Dehumidifiers'!C12","v":"HCFC-22"},{"$f":"IF(ISBLANK('Step 3-Dehumidifiers'!D12),\"BLANK\",'Step 3-Dehumidifiers'!D12)","v":"BLANK"}]
[null,null,{"$f":"'Step 3-Dehumidifiers'!C13","v":"HFC-134a"},{"$f":"IF(ISBLANK('Step 3-Dehumidifiers'!D13),\"BLANK\",'Step 3-Dehumidifiers'!D13)","v":"BLANK"}]
[null,null,"R-500",{"$f":"IF(ISBLANK('Step 3-Dehumidifiers'!D14),\"BLANK\",'Step 3-Dehumidifiers'!D14)","v":"BLANK"}]
[null,null,{"$f":"'Step 3-Dehumidifiers'!C15","v":"R-410A"},{"$f":"IF(ISBLANK('Step 3-Dehumidifiers'!D15),\"BLANK\",'Step 3-Dehumidifiers'!D15)","v":"BLANK"}]
[null,null,"Other",{"$f":"IF(ISBLANK('Step 3-Dehumidifiers'!D16),\"BLANK\",'Step 3-Dehumidifiers'!D16)","v":"BLANK"}]
[]
[null,null,"Units with Refrigerant Recovery"]
[null,null,{"$f":"C421","v":"CFC-12"},{"$f":"IF(ISBLANK('Step 3-Dehumidifiers'!E11),\"BLANK\",'Step 3-Dehumidifiers'!E11)","v":"BLANK"}]
[null,null,"HCFC-22",{"$f":"IF(ISBLANK('Step 3-Dehumidifiers'!E12),\"BLANK\",'Step 3-Dehumidifiers'!E12)","v":"BLANK"}]
[null,null,"HFC-134a",{"$f":"IF(ISBLANK('Step 3-Dehumidifiers'!E13),\"BLANK\",'Step 3-Dehumidifiers'!E13)","v":"BLANK"}]
[null,null,"R-500",{"$f":"IF(ISBLANK('Step 3-Dehumidifiers'!E14),\"BLANK\",'Step 3-Dehumidifiers'!E14)","v":"BLANK"}]
[null,null,"R-410A",{"$f":"IF(ISBLANK('Step 3-Dehumidifiers'!E15),\"BLANK\",'Step 3-Dehumidifiers'!E15)","v":"BLANK"}]
[null,null,"Other",{"$f":"IF(ISBLANK('Step 3-Dehumidifiers'!E16),\"BLANK\",'Step 3-Dehumidifiers'!E16)","v":"BLANK"}]
[]
[null,"Refrigerant (including that recovered from compressor oil)",{"$f":"'Step 3-Dehumidifiers'!D24","v":"CFC-12"},{"$f":"IF(ISBLANK('Step 3-Dehumidifiers'!F24),\"BLANK\",'Step 3-Dehumidifiers'!F24)","v":"BLANK"}]
[null,null,{"$f":"'Step 3-Dehumidifiers'!D25","v":"Reclaimed"},{"$f":"IF(ISBLANK('Step 3-Dehumidifiers'!F25),\"BLANK\",'Step 3-Dehumidifiers'!F25)","v":"BLANK"}]
[null,null,"Stockpiling with Intent to Reclaim",{"$f":"IF(ISBLANK('Step 3-Dehumidifiers'!F26),\"BLANK\",'Step 3-Dehumidifiers'!F26)","v":"BLANK"}]
[null,null,{"$f":"'Step 3-Dehumidifiers'!D27","v":"Destroyed"},{"$f":"IF(ISBLANK('Step 3-Dehumidifiers'!F27),\"BLANK\",'Step 3-Dehumidifiers'!F27)","v":"BLANK"}]
[null,null,"Stockpiling with Intent to Destroy",{"$f":"IF(ISBLANK('Step 3-Dehumidifiers'!F28),\"BLANK\",'Step 3-Dehumidifiers'!F28)","v":"BLANK"}]
[null,null,{"$f":"'Step 3-Dehumidifiers'!D29","v":"HCFC-22 "},{"$f":"IF(ISBLANK('Step 3-Dehumidifiers'!F29),\"BLANK\",'Step 3-Dehumidifiers'!F29)","v":"BLANK"}]
[null,null,{"$f":"'Step 3-Dehumidifiers'!D30","v":"Reclaimed"},{"$f":"IF(ISBLANK('Step 3-Dehumidifiers'!F30),\"BLANK\",'Step 3-Dehumidifiers'!F30)","v":"BLANK"}]
[null,null,"Stockpiling with Intent to Reclaim",{"$f":"IF(ISBLANK('Step 3-Dehumidifiers'!F31),\"BLANK\",'Step 3-Dehumidifiers'!F31)","v":"BLANK"}]
[null,null,{"$f":"'Step 3-Dehumidifiers'!D32","v":"Destroyed"},{"$f":"IF(ISBLANK('Step 3-Dehumidifiers'!F32),\"BLANK\",'Step 3-Dehumidifiers'!F32)","v":"BLANK"}]
[null,null,"Stockpiling with Intent to Destroy",{"$f":"IF(ISBLANK('Step 3-Dehumidifiers'!F33),\"BLANK\",'Step 3-Dehumidifiers'!F33)","v":"BLANK"}]
[null,null,{"$f":"'Step 3-Dehumidifiers'!D34","v":"HFC-134a"}]
[null,null,{"$f":"'Step 3-Dehumidifiers'!D35","v":"Reclaimed"},{"$f":"IF(ISBLANK('Step 3-Dehumidifiers'!F35),\"BLANK\",'Step 3-Dehumidifiers'!F35)","v":"BLANK"}]
[null,null,"Stockpiling with Intent to Reclaim",{"$f":"IF(ISBLANK('Step 3-Dehumidifiers'!F36),\"BLANK\",'Step 3-Dehumidifiers'!F36)","v":"BLANK"}]
[null,null,{"$f":"'Step 3-Dehumidifiers'!D37","v":"Destroyed"},{"$f":"IF(ISBLANK('Step 3-Dehumidifiers'!F37),\"BLANK\",'Step 3-Dehumidifiers'!F37)","v":"BLANK"}]
[null,null,"Stockpiling with Intent to Destroy",{"$f":"IF(ISBLANK('Step 3-Dehumidifiers'!F38),\"BLANK\",'Step 3-Dehumidifiers'!F38)","v":"BLANK"}]
[null,null,{"$f":"'Step 3-Dehumidifiers'!D39","v":"R-500"},{"$f":"IF(ISBLANK('Step 3-Dehumidifiers'!F39),\"BLANK\",'Step 3-Dehumidifiers'!F39)","v":"BLANK"}]
[null,null,{"$f":"'Step 3-Dehumidifiers'!D40","v":"Reclaimed"},{"$f":"IF(ISBLANK('Step 3-Dehumidifiers'!F40),\"BLANK\",'Step 3-Dehumidifiers'!F40)","v":"BLANK"}]
[null,null,"Stockpiling with Intent to Reclaim",{"$f":"IF(ISBLANK('Step 3-Dehumidifiers'!F41),\"BLANK\",'Step 3-Dehumidifiers'!F41)","v":"BLANK"}]
[null,null,{"$f":"'Step 3-Dehumidifiers'!D42","v":"Destroyed"},{"$f":"IF(ISBLANK('Step 3-Dehumidifiers'!F42),\"BLANK\",'Step 3-Dehumidifiers'!F42)","v":"BLANK"}]
[null,null,"Stockpiling with Intent to Destroy",{"$f":"IF(ISBLANK('Step 3-Dehumidifiers'!F43),\"BLANK\",'Step 3-Dehumidifiers'!F43)","v":"BLANK"}]
[null,null,{"$f":"'Step 3-Dehumidifiers'!D44","v":"R-410A "}]
[null,null,{"$f":"'Step 3-Dehumidifiers'!D45","v":"Reclaimed"},{"$f":"IF(ISBLANK('Step 3-Dehumidifiers'!F45),\"BLANK\",'Step 3-Dehumidifiers'!F45)","v":"BLANK"}]
[null,null,"Stockpiling with Intent to Reclaim",{"$f":"IF(ISBLANK('Step 3-Dehumidifiers'!F46),\"BLANK\",'Step 3-Dehumidifiers'!F46)","v":"BLANK"}]
[null,null,{"$f":"'Step 3-Dehumidifiers'!D47","v":"Destroyed"},{"$f":"IF(ISBLANK('Step 3-Dehumidifiers'!F47),\"BLANK\",'Step 3-Dehumidifiers'!F47)","v":"BLANK"}]
[null,null,"Stockpiling with Intent to Destroy",{"$f":"IF(ISBLANK('Step 3-Dehumidifiers'!F48),\"BLANK\",'Step 3-Dehumidifiers'!F48)","v":"BLANK"}]
[null,"Used Oil","Recycled",{"$f":"IF(ISBLANK('Step 3-Dehumidifiers'!F49),\"BLANK\",'Step 3-Dehumidifiers'!F49)","v":"BLANK"}]
[null,0,"Disposed",{"$f":"IF(ISBLANK('Step 3-Dehumidifiers'!F50),\"BLANK\",'Step 3-Dehumidifiers'!F50)","v":"BLANK"}]
[null,"Metal","Ferrous Metal Recycled",{"$f":"IF(ISBLANK('Step 3-Dehumidifiers'!F51),\"BLANK\",'Step 3-Dehumidifiers'!F51)","v":"BLANK"}]
[null,0,"Non-Ferrous Metal Recycled",{"$f":"IF(ISBLANK('Step 3-Dehumidifiers'!F52),\"BLANK\",'Step 3-Dehumidifiers'!F52)","v":"BLANK"}]
[null,"Plastic","Recycled",{"$f":"IF(ISBLANK('Step 3-Dehumidifiers'!F53),\"BLANK\",'Step 3-Dehumidifiers'!F53)","v":"BLANK"}]
[null,"Capacitors","Destroyed",{"$f":"IF(ISBLANK('Step 3-Dehumidifiers'!F54),\"BLANK\",'Step 3-Dehumidifiers'!F54)","v":"BLANK"}]
[]
[null,"Actual Measurement or Assumptions"]
[null,null,{"$f":"'Step 3-Dehumidifiers'!C10","v":"Refrigerant Type"}]
[null,null,"CFC-12",{"$f":"IF(ISBLANK('Step 3-Dehumidifiers'!F11),\"BLANK\",'Step 3-Dehumidifiers'!F11)","v":"BLANK"}]
[null,null,{"$f":"'Step 3-Dehumidifiers'!C12","v":"HCFC-22"},{"$f":"IF(ISBLANK('Step 3-Dehumidifiers'!F12),\"BLANK\",'Step 3-Dehumidifiers'!F12)","v":"BLANK"}]
[null,null,{"$f":"'Step 3-Dehumidifiers'!C13","v":"HFC-134a"},{"$f":"IF(ISBLANK('Step 3-Dehumidifiers'!F13),\"BLANK\",'Step 3-Dehumidifiers'!F13)","v":"BLANK"}]
[null,null,"R-500",{"$f":"IF(ISBLANK('Step 3-Dehumidifiers'!F14),\"BLANK\",'Step 3-Dehumidifiers'!F14)","v":"BLANK"}]
[null,null,{"$f":"'Step 3-Dehumidifiers'!C15","v":"R-410A"},{"$f":"IF(ISBLANK('Step 3-Dehumidifiers'!F15),\"BLANK\",'Step 3-Dehumidifiers'!F15)","v":"BLANK"}]
[null,null,{"$f":"'Step 3-Dehumidifiers'!C16","v":"Other"},{"$f":"IF(ISBLANK('Step 3-Dehumidifiers'!F16),\"BLANK\",'Step 3-Dehumidifiers'!F16)","v":"BLANK"}]
[null,null,"Comments",{"$f":"IF(ISBLANK('Step 3-Dehumidifiers'!G11),\"BLANK\",'Step 3-Dehumidifiers'!G11)","v":"BLANK"}]
[]
[null,"Refrigerant (including that recovered from compressor oil)",{"$f":"C436","v":"CFC-12"},{"$f":"IF(ISBLANK('Step 3-Dehumidifiers'!H24),\"BLANK\",'Step 3-Dehumidifiers'!H24)","v":"BLANK"}]
[null,null,{"$f":"C437","v":"Reclaimed"},{"$f":"IF(ISBLANK('Step 3-Dehumidifiers'!H25),\"BLANK\",'Step 3-Dehumidifiers'!H25)","v":"BLANK"}]
[null,null,"Stockpiling with Intent to Reclaim",{"$f":"IF(ISBLANK('Step 3-Dehumidifiers'!H26),\"BLANK\",'Step 3-Dehumidifiers'!H26)","v":"BLANK"}]
[null,null,{"$f":"C439","v":"Destroyed"},{"$f":"IF(ISBLANK('Step 3-Dehumidifiers'!H27),\"BLANK\",'Step 3-Dehumidifiers'!H27)","v":"BLANK"}]
[null,null,"Stockpiling with Intent to Destroy",{"$f":"IF(ISBLANK('Step 3-Dehumidifiers'!H28),\"BLANK\",'Step 3-Dehumidifiers'!H28)","v":"BLANK"}]
[null,null,{"$f":"C441","v":"HCFC-22 "},{"$f":"IF(ISBLANK('Step 3-Dehumidifiers'!H29),\"BLANK\",'Step 3-Dehumidifiers'!H29)","v":"BLANK"}]
[null,null,{"$f":"C442","v":"Reclaimed"},{"$f":"IF(ISBLANK('Step 3-Dehumidifiers'!H30),\"BLANK\",'Step 3-Dehumidifiers'!H30)","v":"BLANK"}]
[null,null,"Stockpiling with Intent to Reclaim",{"$f":"IF(ISBLANK('Step 3-Dehumidifiers'!H31),\"BLANK\",'Step 3-Dehumidifiers'!H31)","v":"BLANK"}]
[null,null,{"$f":"C444","v":"Destroyed"},{"$f":"IF(ISBLANK('Step 3-Dehumidifiers'!H32),\"BLANK\",'Step 3-Dehumidifiers'!H32)","v":"BLANK"}]
[null,null,"Stockpiling with Intent to Destroy",{"$f":"IF(ISBLANK('Step 3-Dehumidifiers'!H33),\"BLANK\",'Step 3-Dehumidifiers'!H33)","v":"BLANK"}]
[null,null,{"$f":"C446","v":"HFC-134a"}]
[null,null,{"$f":"C447","v":"Reclaimed"},{"$f":"IF(ISBLANK('Step 3-Dehumidifiers'!H35),\"BLANK\",'Step 3-Dehumidifiers'!H35)","v":"BLANK"}]
[null,null,"Stockpiling with Intent to Reclaim",{"$f":"IF(ISBLANK('Step 3-Dehumidifiers'!H36),\"BLANK\",'Step 3-Dehumidifiers'!H36)","v":"BLANK"}]
[null,null,{"$f":"C449","v":"Destroyed"},{"$f":"IF(ISBLANK('Step 3-Dehumidifiers'!H37),\"BLANK\",'Step 3-Dehumidifiers'!H37)","v":"BLANK"}]
[null,null,"Stockpiling with Intent to Destroy",{"$f":"IF(ISBLANK('Step 3-Dehumidifiers'!H38),\"BLANK\",'Step 3-Dehumidifiers'!H38)","v":"BLANK"}]
[null,null,{"$f":"C451","v":"R-500"},{"$f":"IF(ISBLANK('Step 3-Dehumidifiers'!H39),\"BLANK\",'Step 3-Dehumidifiers'!H39)","v":"BLANK"}]
[null,null,{"$f":"C452","v":"Reclaimed"},{"$f":"IF(ISBLANK('Step 3-Dehumidifiers'!H40),\"BLANK\",'Step 3-Dehumidifiers'!H40)","v":"BLANK"}]
[null,null,"Stockpiling with Intent to Reclaim",{"$f":"IF(ISBLANK('Step 3-Dehumidifiers'!H41),\"BLANK\",'Step 3-Dehumidifiers'!H41)","v":"BLANK"}]
[null,null,{"$f":"C454","v":"Destroyed"},{"$f":"IF(ISBLANK('Step 3-Dehumidifiers'!H42),\"BLANK\",'Step 3-Dehumidifiers'!H42)","v":"BLANK"}]
[null,null,"Stockpiling with Intent to Destroy",{"$f":"IF(ISBLANK('Step 3-Dehumidifiers'!H43),\"BLANK\",'Step 3-Dehumidifiers'!H43)","v":"BLANK"}]
[null,null,{"$f":"C456","v":"R-410A "}]
[null,null,{"$f":"C457","v":"Reclaimed"},{"$f":"IF(ISBLANK('Step 3-Dehumidifiers'!H45),\"BLANK\",'Step 3-Dehumidifiers'!H45)","v":"BLANK"}]
[null,null,"Stockpiling with Intent to Reclaim",{"$f":"IF(ISBLANK('Step 3-Dehumidifiers'!H46),\"BLANK\",'Step 3-Dehumidifiers'!H46)","v":"BLANK"}]
[null,null,{"$f":"C459","v":"Destroyed"},{"$f":"IF(ISBLANK('Step 3-Dehumidifiers'!H47),\"BLANK\",'Step 3-Dehumidifiers'!H47)","v":"BLANK"}]
[null,null,"Stockpiling with Intent to Destroy",{"$f":"IF(ISBLANK('Step 3-Dehumidifiers'!H48),\"BLANK\",'Step 3-Dehumidifiers'!H48)","v":"BLANK"}]
[null,"Used Oil","Recycled",{"$f":"IF(ISBLANK('Step 3-Dehumidifiers'!H49),\"BLANK\",'Step 3-Dehumidifiers'!H49)","v":"BLANK"}]
[null,0,"Disposed",{"$f":"IF(ISBLANK('Step 3-Dehumidifiers'!H50),\"BLANK\",'Step 3-Dehumidifiers'!H50)","v":"BLANK"}]
[null,"Metal","Ferrous Metal Recycled",{"$f":"IF(ISBLANK('Step 3-Dehumidifiers'!H51),\"BLANK\",'Step 3-Dehumidifiers'!H51)","v":"BLANK"}]
[null,0,"Non-Ferrous Metal Recycled",{"$f":"IF(ISBLANK('Step 3-Dehumidifiers'!H52),\"BLANK\",'Step 3-Dehumidifiers'!H52)","v":"BLANK"}]
[null,"Plastic","Recycled",{"$f":"IF(ISBLANK('Step 3-Dehumidifiers'!H53),\"BLANK\",'Step 3-Dehumidifiers'!H53)","v":"BLANK"}]
[null,"Capacitors","Destroyed",{"$f":"IF(ISBLANK('Step 3-Dehumidifiers'!H54),\"BLANK\",'Step 3-Dehumidifiers'!H54)","v":"BLANK"}]
[]
[null,null,{"$f":"'Step 3-Dehumidifiers'!C59","v":"Average Number of Remaining Years of Useful Life"},{"$f":"IF(ISBLANK('Step 3-Dehumidifiers'!E59),\"BLANK\",'Step 3-Dehumidifiers'!E59)","v":"BLANK"}]
[null,null,{"$f":"'Step 3-Dehumidifiers'!C60","v":"Average Energy Consumed/Year/Unit (kWh)"},{"$f":"IF(ISBLANK('Step 3-Dehumidifiers'!E60),\"BLANK\",'Step 3-Dehumidifiers'!E60)","v":"BLANK"}]
[null,null,{"$f":"'Step 3-Dehumidifiers'!C61","v":"Average Energy Cost for Residential Consumers ($/kWh) \n[please provide the average cost during the current program period]"},{"$f":"IF(ISBLANK('Step 3-Dehumidifiers'!E61),\"BLANK\",'Step 3-Dehumidifiers'!E61)","v":"BLANK"}]
[]
[null,null,{"$f":"'Step 3-Dehumidifiers'!C63","v":"Additional Comments:"},{"$f":"IF(ISBLANK('Step 3-Dehumidifiers'!D63),\"BLANK\",'Step 3-Dehumidifiers'!D63)","v":"BLANK"}]
[]
[]
[]
[null,"Summary of Gross Energy Impacts "]
[]
[null,null,{"$f":"'Step 5-Energy Impacts '!C9","v":"Appliance Type"},{"$f":"'Step 5-Energy Impacts '!D9","v":"Total # of Units Processed"}]
[null,null,{"$f":"'Step 5-Energy Impacts '!C10","v":"Refrigerators "},{"$f":"IF(ISBLANK('Step 5-Energy Impacts '!D10),\"BLANK\",'Step 5-Energy Impacts '!D10)","v":0}]
[null,null,{"$f":"'Step 5-Energy Impacts '!C11","v":"Stand Alone Freezers"},{"$f":"IF(ISBLANK('Step 5-Energy Impacts '!D11),\"BLANK\",'Step 5-Energy Impacts '!D11)","v":0}]
[null,null,{"$f":"'Step 5-Energy Impacts '!C12","v":"Air-Conditioning Units"},{"$f":"IF(ISBLANK('Step 5-Energy Impacts '!D12),\"BLANK\",'Step 5-Energy Impacts '!D12)","v":0}]
[null,null,{"$f":"'Step 5-Energy Impacts '!C13","v":"Dehumidifiers"},{"$f":"IF(ISBLANK('Step 5-Energy Impacts '!D13),\"BLANK\",'Step 5-Energy Impacts '!D13)","v":0}]
[null,null,{"$f":"'Step 5-Energy Impacts '!C14","v":"Total"},{"$f":"IF(ISBLANK('Step 5-Energy Impacts '!D14),\"BLANK\",'Step 5-Energy Impacts '!D14)","v":0}]
[{"$nulls":3},{"$f":"'Step 5-Energy Impacts '!F9","v":"Total Saved Energy (kWh)"}]
[null,null,"Refrigerator-Freezers",{"$f":"IF(ISBLANK('Step 5-Energy Impacts '!F10),\"BLANK\",'Step 5-Energy Impacts '!F10)","v":{"v":0,"d":"0.0"}}]
[null,null,"Stand Alone Freezers",{"$f":"IF(ISBLANK('Step 5-Energy Impacts '!F11),\"BLANK\",'Step 5-Energy Impacts '!F11)","v":{"v":0,"d":"0.0"}}]
[null,null,"Air Conditioning Units",{"$f":"IF(ISBLANK('Step 5-Energy Impacts '!F12),\"BLANK\",'Step 5-Energy Impacts '!F12)","v":{"v":0,"d":"0.0"}}]
[null,null,"Dehumidifiers",{"$f":"IF(ISBLANK('Step 5-Energy Impacts '!F13),\"BLANK\",'Step 5-Energy Impacts '!F13)","v":{"v":0,"d":"0.0"}}]
[null,null,"Total",{"$f":"IF(ISBLANK('Step 5-Energy Impacts '!F14),\"BLANK\",'Step 5-Energy Impacts '!F14)","v":{"v":0,"d":"0.0"}}]
[{"$nulls":3},{"$f":"'Step 5-Energy Impacts '!G9","v":"Total Savings to Residential Consumers ($)"}]
[null,null,"Refrigerator-Freezers",{"$f":"IF(ISBLANK('Step 5-Energy Impacts '!G10),\"BLANK\",'Step 5-Energy Impacts '!G10)","v":{"v":0,"d":"$0.00"}}]
[null,null,"Stand Alone Freezers",{"$f":"IF(ISBLANK('Step 5-Energy Impacts '!G11),\"BLANK\",'Step 5-Energy Impacts '!G11)","v":{"v":0,"d":"$0.00"}}]
[null,null,"Air Conditioning Units",{"$f":"IF(ISBLANK('Step 5-Energy Impacts '!G12),\"BLANK\",'Step 5-Energy Impacts '!G12)","v":{"v":0,"d":"$0.00"}}]
[null,null,"Dehumidifiers",{"$f":"IF(ISBLANK('Step 5-Energy Impacts '!G13),\"BLANK\",'Step 5-Energy Impacts '!G13)","v":{"v":0,"d":"$0.00"}}]
[null,null,"Total",{"$f":"IF(ISBLANK('Step 5-Energy Impacts '!G14),\"BLANK\",'Step 5-Energy Impacts '!G14)","v":{"v":0,"d":"$0.00"}}]
[]
[]
[]
[null,"Summary of Environmental Benefits"]
[]
[null,null,"Refrigerant and Foam Reclamation and Destruction"]
[null,null,{"$f":"'Step 5-Env Benefits'!C7","v":"Appliance Component"},{"$f":"'Step 5-Env Benefits'!D7:E7","v":"Total Amount Prevented from Being Emitted"}]
[{"$nulls":3},{"$f":"'Step 5-Env Benefits'!D8","v":"(lb)"}]
[null,null,{"$f":"'Step 5-Env Benefits'!C9","v":"Refrigerantc"},{"$f":"'Step 5-Env Benefits'!D61","v":0}]
[null,null,{"$f":"'Step 5-Env Benefits'!C10","v":"CFC-12 Reclaimed"},{"$f":"IF(ISBLANK('Step 5-Env Benefits'!D10),\"BLANK\",'Step 5-Env Benefits'!D10)","v":{"v":0,"d":"0.00"}}]
[null,null,{"$f":"'Step 5-Env Benefits'!C11","v":"HCFC-22 Reclaimed"},{"$f":"IF(ISBLANK('Step 5-Env Benefits'!D11),\"BLANK\",'Step 5-Env Benefits'!D11)","v":{"v":0,"d":"0.00"}}]
[null,null,{"$f":"'Step 5-Env Benefits'!C12","v":"HFC-134a Reclaimed"},{"$f":"IF(ISBLANK('Step 5-Env Benefits'!D12),\"BLANK\",'Step 5-Env Benefits'!D12)","v":{"v":0,"d":"0.00"}}]
[null,null,{"$f":"'Step 5-Env Benefits'!C13","v":"R-500 Reclaimed"},{"$f":"IF(ISBLANK('Step 5-Env Benefits'!D13),\"BLANK\",'Step 5-Env Benefits'!D13)","v":{"v":0,"d":"0.00"}}]
[null,null,{"$f":"'Step 5-Env Benefits'!C14","v":"R-407C Reclaimed"},{"$f":"IF(ISBLANK('Step 5-Env Benefits'!D14),\"BLANK\",'Step 5-Env Benefits'!D14)","v":{"v":0,"d":"0.00"}}]
[null,null,{"$f":"'Step 5-Env Benefits'!C15","v":"R-410A Reclaimed"},{"$f":"IF(ISBLANK('Step 5-Env Benefits'!D15),\"BLANK\",'Step 5-Env Benefits'!D15)","v":{"v":0,"d":"0.00"}}]
[null,null,{"$f":"'Step 5-Env Benefits'!C16","v":"Reclaimed"},{"$f":"IF(ISBLANK('Step 5-Env Benefits'!D16),\"BLANK\",'Step 5-Env Benefits'!D16)","v":{"v":0,"d":"0.00"}}]
[null,null,{"$f":"'Step 5-Env Benefits'!C17","v":"CFC-12 Stockpiling with Intent to Reclaim"},{"$f":"IF(ISBLANK('Step 5-Env Benefits'!D17),\"BLANK\",'Step 5-Env Benefits'!D17)","v":{"v":0,"d":"0.00"}}]
[null,null,{"$f":"'Step 5-Env Benefits'!C18","v":"HCFC-22 Stockpiling with Intent to Reclaim"},{"$f":"IF(ISBLANK('Step 5-Env Benefits'!D18),\"BLANK\",'Step 5-Env Benefits'!D18)","v":{"v":0,"d":"0.00"}}]
[null,null,{"$f":"'Step 5-Env Benefits'!C19","v":"HFC-134a Stockpiling with Intent to Reclaim"},{"$f":"IF(ISBLANK('Step 5-Env Benefits'!D19),\"BLANK\",'Step 5-Env Benefits'!D19)","v":{"v":0,"d":"0.00"}}]
[null,null,{"$f":"'Step 5-Env Benefits'!C20","v":"R-500 Stockpiling with Intent to Reclaim"},{"$f":"IF(ISBLANK('Step 5-Env Benefits'!D20),\"BLANK\",'Step 5-Env Benefits'!D20)","v":{"v":0,"d":"0.00"}}]
[null,null,{"$f":"'Step 5-Env Benefits'!C21","v":"R-407C Stockpiling with Intent to Reclaim"},{"$f":"IF(ISBLANK('Step 5-Env Benefits'!D21),\"BLANK\",'Step 5-Env Benefits'!D21)","v":{"v":0,"d":"0.00"}}]
[null,null,{"$f":"'Step 5-Env Benefits'!C22","v":"R-410A Stockpiling with Intent to Reclaim"},{"$f":"IF(ISBLANK('Step 5-Env Benefits'!D22),\"BLANK\",'Step 5-Env Benefits'!D22)","v":{"v":0,"d":"0.00"}}]
[null,null,{"$f":"'Step 5-Env Benefits'!C23","v":"Stockpiling with Intent to Reclaim"},{"$f":"IF(ISBLANK('Step 5-Env Benefits'!D23),\"BLANK\",'Step 5-Env Benefits'!D23)","v":{"v":0,"d":"0.00"}}]
[null,null,{"$f":"'Step 5-Env Benefits'!C24","v":"CFC-12 Destroyed"},{"$f":"IF(ISBLANK('Step 5-Env Benefits'!D24),\"BLANK\",'Step 5-Env Benefits'!D24)","v":{"v":0,"d":"0.00"}}]
[null,null,{"$f":"'Step 5-Env Benefits'!C25","v":"HCFC-22 Destroyed"},{"$f":"IF(ISBLANK('Step 5-Env Benefits'!D25),\"BLANK\",'Step 5-Env Benefits'!D25)","v":{"v":0,"d":"0.00"}}]
[null,null,{"$f":"'Step 5-Env Benefits'!C26","v":"HFC-134a Destroyed"},{"$f":"IF(ISBLANK('Step 5-Env Benefits'!D26),\"BLANK\",'Step 5-Env Benefits'!D26)","v":{"v":0,"d":"0.00"}}]
[null,null,{"$f":"'Step 5-Env Benefits'!C27","v":"R-500 Destroyed"},{"$f":"IF(ISBLANK('Step 5-Env Benefits'!D27),\"BLANK\",'Step 5-Env Benefits'!D27)","v":{"v":0,"d":"0.00"}}]
[null,null,{"$f":"'Step 5-Env Benefits'!C28","v":"R-407C Destroyed"},{"$f":"IF(ISBLANK('Step 5-Env Benefits'!D28),\"BLANK\",'Step 5-Env Benefits'!D28)","v":{"v":0,"d":"0.00"}}]
[null,null,{"$f":"'Step 5-Env Benefits'!C29","v":"R-410A Destroyed"},{"$f":"IF(ISBLANK('Step 5-Env Benefits'!D29),\"BLANK\",'Step 5-Env Benefits'!D29)","v":{"v":0,"d":"0.00"}}]
[null,null,{"$f":"'Step 5-Env Benefits'!C30","v":"Destroyed"},{"$f":"IF(ISBLANK('Step 5-Env Benefits'!D30),\"BLANK\",'Step 5-Env Benefits'!D30)","v":{"v":0,"d":"0.00"}}]
[null,null,{"$f":"'Step 5-Env Benefits'!C31","v":"CFC-12 Stockpiling with Intent to Destroy"},{"$f":"IF(ISBLANK('Step 5-Env Benefits'!D31),\"BLANK\",'Step 5-Env Benefits'!D31)","v":{"v":0,"d":"0.00"}}]
[null,null,{"$f":"'Step 5-Env Benefits'!C32","v":"HCFC-22 Stockpiling with Intent to Destroy"},{"$f":"IF(ISBLANK('Step 5-Env Benefits'!D32),\"BLANK\",'Step 5-Env Benefits'!D32)","v":{"v":0,"d":"0.00"}}]
[null,null,{"$f":"'Step 5-Env Benefits'!C33","v":"HFC-134a Stockpiling with Intent to Destroy"},{"$f":"IF(ISBLANK('Step 5-Env Benefits'!D33),\"BLANK\",'Step 5-Env Benefits'!D33)","v":{"v":0,"d":"0.00"}}]
[null,null,{"$f":"'Step 5-Env Benefits'!C34","v":"R-500 Stockpiling with Intent to Destroy"},{"$f":"IF(ISBLANK('Step 5-Env Benefits'!D34),\"BLANK\",'Step 5-Env Benefits'!D34)","v":{"v":0,"d":"0.00"}}]
[null,null,{"$f":"'Step 5-Env Benefits'!C35","v":"R-407C Stockpiling with Intent to Destroy"},{"$f":"IF(ISBLANK('Step 5-Env Benefits'!D35),\"BLANK\",'Step 5-Env Benefits'!D35)","v":{"v":0,"d":"0.00"}}]
[null,null,{"$f":"'Step 5-Env Benefits'!C36","v":"R-410A Stockpiling with Intent to Destroy"},{"$f":"IF(ISBLANK('Step 5-Env Benefits'!D36),\"BLANK\",'Step 5-Env Benefits'!D36)","v":{"v":0,"d":"0.00"}}]
[null,null,{"$f":"'Step 5-Env Benefits'!C37","v":"Stockpiling with Intent to Destroy"},{"$f":"IF(ISBLANK('Step 5-Env Benefits'!D37),\"BLANK\",'Step 5-Env Benefits'!D37)","v":{"v":0,"d":"0.00"}}]
[null,null,{"$f":"'Step 5-Env Benefits'!C38","v":"Subtotal"},{"$f":"IF(ISBLANK('Step 5-Env Benefits'!D38),\"BLANK\",'Step 5-Env Benefits'!D38)","v":{"v":0,"d":"0.00"}}]
[null,null,{"$f":"'Step 5-Env Benefits'!C39","v":"Foam-Blowing Agentd"},{"$f":"IF(ISBLANK('Step 5-Env Benefits'!D39),\"BLANK\",'Step 5-Env Benefits'!D39)","v":"BLANK"}]
[null,null,{"$f":"'Step 5-Env Benefits'!C40","v":"CFC-11 Reclaimed"},{"$f":"IF(ISBLANK('Step 5-Env Benefits'!D40),\"BLANK\",'Step 5-Env Benefits'!D40)","v":{"v":0,"d":"0.00"}}]
[null,null,{"$f":"'Step 5-Env Benefits'!C41","v":"HCFC-141b Reclaimed"},{"$f":"IF(ISBLANK('Step 5-Env Benefits'!D41),\"BLANK\",'Step 5-Env Benefits'!D41)","v":{"v":0,"d":"0.00"}}]
[null,null,{"$f":"'Step 5-Env Benefits'!C42","v":"HFC-134a Reclaimed"},{"$f":"IF(ISBLANK('Step 5-Env Benefits'!D42),\"BLANK\",'Step 5-Env Benefits'!D42)","v":{"v":0,"d":"0.00"}}]
[null,null,{"$f":"'Step 5-Env Benefits'!C43","v":"HFC-245fa Reclaimed"},{"$f":"IF(ISBLANK('Step 5-Env Benefits'!D43),\"BLANK\",'Step 5-Env Benefits'!D43)","v":{"v":0,"d":"0.00"}}]
[null,null,{"$f":"'Step 5-Env Benefits'!C44","v":"Reclaimed"},{"$f":"IF(ISBLANK('Step 5-Env Benefits'!D44),\"BLANK\",'Step 5-Env Benefits'!D44)","v":{"v":0,"d":"0.00"}}]
[null,null,{"$f":"'Step 5-Env Benefits'!C45","v":"CFC-11 Stockpiling with Intent to Reclaim"},{"$f":"IF(ISBLANK('Step 5-Env Benefits'!D45),\"BLANK\",'Step 5-Env Benefits'!D45)","v":{"v":0,"d":"0.00"}}]
[null,null,{"$f":"'Step 5-Env Benefits'!C46","v":"HCFC-141b Stockpiling with Intent to Reclaim"},{"$f":"IF(ISBLANK('Step 5-Env Benefits'!D46),\"BLANK\",'Step 5-Env Benefits'!D46)","v":{"v":0,"d":"0.00"}}]
[null,null,{"$f":"'Step 5-Env Benefits'!C47","v":"HFC-134a Stockpiling with Intent to Reclaim"},{"$f":"IF(ISBLANK('Step 5-Env Benefits'!D47),\"BLANK\",'Step 5-Env Benefits'!D47)","v":{"v":0,"d":"0.00"}}]
[null,null,{"$f":"'Step 5-Env Benefits'!C48","v":"HFC-245fa Stockpiling with Intent to Reclaim"},{"$f":"IF(ISBLANK('Step 5-Env Benefits'!D48),\"BLANK\",'Step 5-Env Benefits'!D48)","v":{"v":0,"d":"0.00"}}]
[null,null,{"$f":"'Step 5-Env Benefits'!C49","v":"Stockpiling with Intent to Reclaim"},{"$f":"IF(ISBLANK('Step 5-Env Benefits'!D49),\"BLANK\",'Step 5-Env Benefits'!D49)","v":{"v":0,"d":"0.00"}}]
[null,null,{"$f":"'Step 5-Env Benefits'!C50","v":"CFC-11 Destroyed"},{"$f":"IF(ISBLANK('Step 5-Env Benefits'!D50),\"BLANK\",'Step 5-Env Benefits'!D50)","v":{"v":0,"d":"0.00"}}]
[null,null,{"$f":"'Step 5-Env Benefits'!C51","v":"HCFC-141b Destroyed"},{"$f":"IF(ISBLANK('Step 5-Env Benefits'!D51),\"BLANK\",'Step 5-Env Benefits'!D51)","v":{"v":0,"d":"0.00"}}]
[null,null,{"$f":"'Step 5-Env Benefits'!C52","v":"HFC-134a Destroyed"},{"$f":"IF(ISBLANK('Step 5-Env Benefits'!D52),\"BLANK\",'Step 5-Env Benefits'!D52)","v":{"v":0,"d":"0.00"}}]
[null,null,{"$f":"'Step 5-Env Benefits'!C53","v":"HFC-245fa Destroyed"},{"$f":"IF(ISBLANK('Step 5-Env Benefits'!D53),\"BLANK\",'Step 5-Env Benefits'!D53)","v":{"v":0,"d":"0.00"}}]
[null,null,{"$f":"'Step 5-Env Benefits'!C54","v":"Destroyed"},{"$f":"IF(ISBLANK('Step 5-Env Benefits'!D54),\"BLANK\",'Step 5-Env Benefits'!D54)","v":{"v":0,"d":"0.00"}}]
[null,null,{"$f":"'Step 5-Env Benefits'!C55","v":"CFC-11 Stockpiling with Intent to Destroy"},{"$f":"IF(ISBLANK('Step 5-Env Benefits'!D55),\"BLANK\",'Step 5-Env Benefits'!D55)","v":{"v":0,"d":"0.00"}}]
[null,null,{"$f":"'Step 5-Env Benefits'!C56","v":"HCFC-141b Stockpiling with Intent to Destroy"},{"$f":"IF(ISBLANK('Step 5-Env Benefits'!D56),\"BLANK\",'Step 5-Env Benefits'!D56)","v":{"v":0,"d":"0.00"}}]
[null,null,{"$f":"'Step 5-Env Benefits'!C57","v":"HFC-134a Stockpiling with Intent to Destroy"},{"$f":"IF(ISBLANK('Step 5-Env Benefits'!D57),\"BLANK\",'Step 5-Env Benefits'!D57)","v":{"v":0,"d":"0.00"}}]
[null,null,{"$f":"'Step 5-Env Benefits'!C58","v":"HFC-245fa Stockpiling with Intent to Destroy"},{"$f":"IF(ISBLANK('Step 5-Env Benefits'!D58),\"BLANK\",'Step 5-Env Benefits'!D58)","v":{"v":0,"d":"0.00"}}]
[null,null,{"$f":"'Step 5-Env Benefits'!C59","v":"Stockpiling with Intent to Destroy"},{"$f":"IF(ISBLANK('Step 5-Env Benefits'!D59),\"BLANK\",'Step 5-Env Benefits'!D59)","v":{"v":0,"d":"0.00"}}]
[null,null,"Subtotal",{"$f":"IF(ISBLANK('Step 5-Env Benefits'!D60),\"BLANK\",'Step 5-Env Benefits'!D60)","v":{"v":0,"d":"0.00"}}]
[{"$nulls":3},"kg"]
[null,null,{"$f":"'Step 5-Env Benefits'!C9","v":"Refrigerantc"}]
[null,null,{"$f":"'Step 5-Env Benefits'!C10","v":"CFC-12 Reclaimed"},{"$f":"IF(ISBLANK('Step 5-Env Benefits'!E10),\"BLANK\",'Step 5-Env Benefits'!E10)","v":{"v":0,"d":"0.00"}}]
[null,null,{"$f":"'Step 5-Env Benefits'!C11","v":"HCFC-22 Reclaimed"},{"$f":"IF(ISBLANK('Step 5-Env Benefits'!E11),\"BLANK\",'Step 5-Env Benefits'!E11)","v":{"v":0,"d":"0.00"}}]
[null,null,{"$f":"'Step 5-Env Benefits'!C12","v":"HFC-134a Reclaimed"},{"$f":"IF(ISBLANK('Step 5-Env Benefits'!E12),\"BLANK\",'Step 5-Env Benefits'!E12)","v":{"v":0,"d":"0.00"}}]
[null,null,{"$f":"'Step 5-Env Benefits'!C13","v":"R-500 Reclaimed"},{"$f":"IF(ISBLANK('Step 5-Env Benefits'!E13),\"BLANK\",'Step 5-Env Benefits'!E13)","v":{"v":0,"d":"0.00"}}]
[null,null,{"$f":"'Step 5-Env Benefits'!C14","v":"R-407C Reclaimed"},{"$f":"IF(ISBLANK('Step 5-Env Benefits'!E14),\"BLANK\",'Step 5-Env Benefits'!E14)","v":{"v":0,"d":"0.00"}}]
[null,null,{"$f":"'Step 5-Env Benefits'!C15","v":"R-410A Reclaimed"},{"$f":"IF(ISBLANK('Step 5-Env Benefits'!E15),\"BLANK\",'Step 5-Env Benefits'!E15)","v":{"v":0,"d":"0.00"}}]
[null,null,{"$f":"'Step 5-Env Benefits'!C16","v":"Reclaimed"},{"$f":"IF(ISBLANK('Step 5-Env Benefits'!E16),\"BLANK\",'Step 5-Env Benefits'!E16)","v":{"v":0,"d":"0.00"}}]
[null,null,{"$f":"'Step 5-Env Benefits'!C17","v":"CFC-12 Stockpiling with Intent to Reclaim"},{"$f":"IF(ISBLANK('Step 5-Env Benefits'!E17),\"BLANK\",'Step 5-Env Benefits'!E17)","v":{"v":0,"d":"0.00"}}]
[null,null,{"$f":"'Step 5-Env Benefits'!C18","v":"HCFC-22 Stockpiling with Intent to Reclaim"},{"$f":"IF(ISBLANK('Step 5-Env Benefits'!E18),\"BLANK\",'Step 5-Env Benefits'!E18)","v":{"v":0,"d":"0.00"}}]
[null,null,{"$f":"'Step 5-Env Benefits'!C19","v":"HFC-134a Stockpiling with Intent to Reclaim"},{"$f":"IF(ISBLANK('Step 5-Env Benefits'!E19),\"BLANK\",'Step 5-Env Benefits'!E19)","v":{"v":0,"d":"0.00"}}]
[null,null,{"$f":"'Step 5-Env Benefits'!C20","v":"R-500 Stockpiling with Intent to Reclaim"},{"$f":"IF(ISBLANK('Step 5-Env Benefits'!E20),\"BLANK\",'Step 5-Env Benefits'!E20)","v":{"v":0,"d":"0.00"}}]
[null,null,{"$f":"'Step 5-Env Benefits'!C21","v":"R-407C Stockpiling with Intent to Reclaim"},{"$f":"IF(ISBLANK('Step 5-Env Benefits'!E21),\"BLANK\",'Step 5-Env Benefits'!E21)","v":{"v":0,"d":"0.00"}}]
[null,null,{"$f":"'Step 5-Env Benefits'!C22","v":"R-410A Stockpiling with Intent to Reclaim"},{"$f":"IF(ISBLANK('Step 5-Env Benefits'!E22),\"BLANK\",'Step 5-Env Benefits'!E22)","v":{"v":0,"d":"0.00"}}]
[null,null,{"$f":"'Step 5-Env Benefits'!C23","v":"Stockpiling with Intent to Reclaim"},{"$f":"IF(ISBLANK('Step 5-Env Benefits'!E23),\"BLANK\",'Step 5-Env Benefits'!E23)","v":{"v":0,"d":"0.00"}}]
[null,null,{"$f":"'Step 5-Env Benefits'!C24","v":"CFC-12 Destroyed"},{"$f":"IF(ISBLANK('Step 5-Env Benefits'!E24),\"BLANK\",'Step 5-Env Benefits'!E24)","v":{"v":0,"d":"0.00"}}]
[null,null,{"$f":"'Step 5-Env Benefits'!C25","v":"HCFC-22 Destroyed"},{"$f":"IF(ISBLANK('Step 5-Env Benefits'!E25),\"BLANK\",'Step 5-Env Benefits'!E25)","v":{"v":0,"d":"0.00"}}]
[null,null,{"$f":"'Step 5-Env Benefits'!C26","v":"HFC-134a Destroyed"},{"$f":"IF(ISBLANK('Step 5-Env Benefits'!E26),\"BLANK\",'Step 5-Env Benefits'!E26)","v":{"v":0,"d":"0.00"}}]
[null,null,{"$f":"'Step 5-Env Benefits'!C27","v":"R-500 Destroyed"},{"$f":"IF(ISBLANK('Step 5-Env Benefits'!E27),\"BLANK\",'Step 5-Env Benefits'!E27)","v":{"v":0,"d":"0.00"}}]
[null,null,{"$f":"'Step 5-Env Benefits'!C28","v":"R-407C Destroyed"},{"$f":"IF(ISBLANK('Step 5-Env Benefits'!E28),\"BLANK\",'Step 5-Env Benefits'!E28)","v":{"v":0,"d":"0.00"}}]
[null,null,{"$f":"'Step 5-Env Benefits'!C29","v":"R-410A Destroyed"},{"$f":"IF(ISBLANK('Step 5-Env Benefits'!E29),\"BLANK\",'Step 5-Env Benefits'!E29)","v":{"v":0,"d":"0.00"}}]
[null,null,{"$f":"'Step 5-Env Benefits'!C30","v":"Destroyed"},{"$f":"IF(ISBLANK('Step 5-Env Benefits'!E30),\"BLANK\",'Step 5-Env Benefits'!E30)","v":{"v":0,"d":"0.00"}}]
[null,null,{"$f":"'Step 5-Env Benefits'!C31","v":"CFC-12 Stockpiling with Intent to Destroy"},{"$f":"IF(ISBLANK('Step 5-Env Benefits'!E31),\"BLANK\",'Step 5-Env Benefits'!E31)","v":{"v":0,"d":"0.00"}}]
[null,null,{"$f":"'Step 5-Env Benefits'!C32","v":"HCFC-22 Stockpiling with Intent to Destroy"},{"$f":"IF(ISBLANK('Step 5-Env Benefits'!E32),\"BLANK\",'Step 5-Env Benefits'!E32)","v":{"v":0,"d":"0.00"}}]
[null,null,{"$f":"'Step 5-Env Benefits'!C33","v":"HFC-134a Stockpiling with Intent to Destroy"},{"$f":"IF(ISBLANK('Step 5-Env Benefits'!E33),\"BLANK\",'Step 5-Env Benefits'!E33)","v":{"v":0,"d":"0.00"}}]
[null,null,{"$f":"'Step 5-Env Benefits'!C34","v":"R-500 Stockpiling with Intent to Destroy"},{"$f":"IF(ISBLANK('Step 5-Env Benefits'!E34),\"BLANK\",'Step 5-Env Benefits'!E34)","v":{"v":0,"d":"0.00"}}]
[null,null,{"$f":"'Step 5-Env Benefits'!C35","v":"R-407C Stockpiling with Intent to Destroy"},{"$f":"IF(ISBLANK('Step 5-Env Benefits'!E35),\"BLANK\",'Step 5-Env Benefits'!E35)","v":{"v":0,"d":"0.00"}}]
[null,null,{"$f":"'Step 5-Env Benefits'!C36","v":"R-410A Stockpiling with Intent to Destroy"},{"$f":"IF(ISBLANK('Step 5-Env Benefits'!E36),\"BLANK\",'Step 5-Env Benefits'!E36)","v":{"v":0,"d":"0.00"}}]
[null,null,{"$f":"'Step 5-Env Benefits'!C37","v":"Stockpiling with Intent to Destroy"},{"$f":"IF(ISBLANK('Step 5-Env Benefits'!E37),\"BLANK\",'Step 5-Env Benefits'!E37)","v":{"v":0,"d":"0.00"}}]
[null,null,{"$f":"'Step 5-Env Benefits'!C38","v":"Subtotal"},{"$f":"IF(ISBLANK('Step 5-Env Benefits'!E38),\"BLANK\",'Step 5-Env Benefits'!E38)","v":{"v":0,"d":"0.00"}}]
[null,null,{"$f":"'Step 5-Env Benefits'!C39","v":"Foam-Blowing Agentd"}]
[null,null,{"$f":"'Step 5-Env Benefits'!C40","v":"CFC-11 Reclaimed"},{"$f":"IF(ISBLANK('Step 5-Env Benefits'!E40),\"BLANK\",'Step 5-Env Benefits'!E40)","v":{"v":0,"d":"0.00"}}]
[null,null,{"$f":"'Step 5-Env Benefits'!C41","v":"HCFC-141b Reclaimed"},{"$f":"IF(ISBLANK('Step 5-Env Benefits'!E41),\"BLANK\",'Step 5-Env Benefits'!E41)","v":{"v":0,"d":"0.00"}}]
[null,null,{"$f":"'Step 5-Env Benefits'!C42","v":"HFC-134a Reclaimed"},{"$f":"IF(ISBLANK('Step 5-Env Benefits'!E42),\"BLANK\",'Step 5-Env Benefits'!E42)","v":{"v":0,"d":"0.00"}}]
[null,null,{"$f":"'Step 5-Env Benefits'!C43","v":"HFC-245fa Reclaimed"},{"$f":"IF(ISBLANK('Step 5-Env Benefits'!E43),\"BLANK\",'Step 5-Env Benefits'!E43)","v":{"v":0,"d":"0.00"}}]
[null,null,{"$f":"'Step 5-Env Benefits'!C44","v":"Reclaimed"},{"$f":"IF(ISBLANK('Step 5-Env Benefits'!E44),\"BLANK\",'Step 5-Env Benefits'!E44)","v":{"v":0,"d":"0.00"}}]
[null,null,{"$f":"'Step 5-Env Benefits'!C45","v":"CFC-11 Stockpiling with Intent to Reclaim"},{"$f":"IF(ISBLANK('Step 5-Env Benefits'!E45),\"BLANK\",'Step 5-Env Benefits'!E45)","v":{"v":0,"d":"0.00"}}]
[null,null,{"$f":"'Step 5-Env Benefits'!C46","v":"HCFC-141b Stockpiling with Intent to Reclaim"},{"$f":"IF(ISBLANK('Step 5-Env Benefits'!E46),\"BLANK\",'Step 5-Env Benefits'!E46)","v":{"v":0,"d":"0.00"}}]
[null,null,{"$f":"'Step 5-Env Benefits'!C47","v":"HFC-134a Stockpiling with Intent to Reclaim"},{"$f":"IF(ISBLANK('Step 5-Env Benefits'!E47),\"BLANK\",'Step 5-Env Benefits'!E47)","v":{"v":0,"d":"0.00"}}]
[null,null,{"$f":"'Step 5-Env Benefits'!C48","v":"HFC-245fa Stockpiling with Intent to Reclaim"},{"$f":"IF(ISBLANK('Step 5-Env Benefits'!E48),\"BLANK\",'Step 5-Env Benefits'!E48)","v":{"v":0,"d":"0.00"}}]
[null,null,{"$f":"'Step 5-Env Benefits'!C49","v":"Stockpiling with Intent to Reclaim"},{"$f":"IF(ISBLANK('Step 5-Env Benefits'!E49),\"BLANK\",'Step 5-Env Benefits'!E49)","v":{"v":0,"d":"0.00"}}]
[null,null,{"$f":"'Step 5-Env Benefits'!C50","v":"CFC-11 Destroyed"},{"$f":"IF(ISBLANK('Step 5-Env Benefits'!E50),\"BLANK\",'Step 5-Env Benefits'!E50)","v":{"v":0,"d":"0.00"}}]
[null,null,{"$f":"'Step 5-Env Benefits'!C51","v":"HCFC-141b Destroyed"},{"$f":"IF(ISBLANK('Step 5-Env Benefits'!E51),\"BLANK\",'Step 5-Env Benefits'!E51)","v":{"v":0,"d":"0.00"}}]
[null,null,{"$f":"'Step 5-Env Benefits'!C52","v":"HFC-134a Destroyed"},{"$f":"IF(ISBLANK('Step 5-Env Benefits'!E52),\"BLANK\",'Step 5-Env Benefits'!E52)","v":{"v":0,"d":"0.00"}}]
[null,null,{"$f":"'Step 5-Env Benefits'!C53","v":"HFC-245fa Destroyed"},{"$f":"IF(ISBLANK('Step 5-Env Benefits'!E53),\"BLANK\",'Step 5-Env Benefits'!E53)","v":{"v":0,"d":"0.00"}}]
[null,null,{"$f":"'Step 5-Env Benefits'!C54","v":"Destroyed"},{"$f":"IF(ISBLANK('Step 5-Env Benefits'!E54),\"BLANK\",'Step 5-Env Benefits'!E54)","v":{"v":0,"d":"0.00"}}]
[null,null,{"$f":"'Step 5-Env Benefits'!C55","v":"CFC-11 Stockpiling with Intent to Destroy"},{"$f":"IF(ISBLANK('Step 5-Env Benefits'!E55),\"BLANK\",'Step 5-Env Benefits'!E55)","v":{"v":0,"d":"0.00"}}]
[null,null,{"$f":"'Step 5-Env Benefits'!C56","v":"HCFC-141b Stockpiling with Intent to Destroy"},{"$f":"IF(ISBLANK('Step 5-Env Benefits'!E56),\"BLANK\",'Step 5-Env Benefits'!E56)","v":{"v":0,"d":"0.00"}}]
[null,null,{"$f":"'Step 5-Env Benefits'!C57","v":"HFC-134a Stockpiling with Intent to Destroy"},{"$f":"IF(ISBLANK('Step 5-Env Benefits'!E57),\"BLANK\",'Step 5-Env Benefits'!E57)","v":{"v":0,"d":"0.00"}}]
[null,null,{"$f":"'Step 5-Env Benefits'!C58","v":"HFC-245fa Stockpiling with Intent to Destroy"},{"$f":"IF(ISBLANK('Step 5-Env Benefits'!E58),\"BLANK\",'Step 5-Env Benefits'!E58)","v":{"v":0,"d":"0.00"}}]
[null,null,{"$f":"'Step 5-Env Benefits'!C59","v":"Stockpiling with Intent to Destroy"},{"$f":"IF(ISBLANK('Step 5-Env Benefits'!E59),\"BLANK\",'Step 5-Env Benefits'!E59)","v":{"v":0,"d":"0.00"}}]
[null,null,{"$f":"'Step 5-Env Benefits'!C60","v":"Subtotal"},{"$f":"IF(ISBLANK('Step 5-Env Benefits'!E60),\"BLANK\",'Step 5-Env Benefits'!E60)","v":{"v":0,"d":"0.00"}}]
[]
[{"$nulls":3},{"$f":"'Step 5-Env Benefits'!F7","v":"Greenhouse Gas (GHG) Emissions Avoided (MTCO2eq)a"}]
[null,null,{"$f":"'Step 5-Env Benefits'!C9","v":"Refrigerantc"},{"$f":"'Step 5-Env Benefits'!F8","v":{"v":0,"d":"0.00"}}]
[null,null,{"$f":"'Step 5-Env Benefits'!C10","v":"CFC-12 Reclaimed"},{"$f":"'Step 5-Env Benefits'!F10","v":{"v":0,"d":"0.00"}}]
[null,null,{"$f":"'Step 5-Env Benefits'!C11","v":"HCFC-22 Reclaimed"},{"$f":"'Step 5-Env Benefits'!F11","v":{"v":0,"d":"0.00"}}]
[null,null,{"$f":"'Step 5-Env Benefits'!C12","v":"HFC-134a Reclaimed"},{"$f":"'Step 5-Env Benefits'!F12","v":{"v":0,"d":"0.00"}}]
[null,null,{"$f":"'Step 5-Env Benefits'!C13","v":"R-500 Reclaimed"},{"$f":"'Step 5-Env Benefits'!F13","v":{"v":0,"d":"0.00"}}]
[null,null,{"$f":"'Step 5-Env Benefits'!C14","v":"R-407C Reclaimed"},{"$f":"'Step 5-Env Benefits'!F14","v":{"v":0,"d":"0.00"}}]
[null,null,{"$f":"'Step 5-Env Benefits'!C15","v":"R-410A Reclaimed"},{"$f":"'Step 5-Env Benefits'!F15","v":{"v":0,"d":"0.00"}}]
[null,null,{"$f":"'Step 5-Env Benefits'!C16","v":"Reclaimed"},{"$f":"'Step 5-Env Benefits'!F16","v":{"v":0,"d":"0.00"}}]
[null,null,{"$f":"'Step 5-Env Benefits'!C17","v":"CFC-12 Stockpiling with Intent to Reclaim"},{"$f":"'Step 5-Env Benefits'!F17","v":{"v":0,"d":"0.00"}}]
[null,null,{"$f":"'Step 5-Env Benefits'!C18","v":"HCFC-22 Stockpiling with Intent to Reclaim"},{"$f":"'Step 5-Env Benefits'!F18","v":{"v":0,"d":"0.00"}}]
[null,null,{"$f":"'Step 5-Env Benefits'!C19","v":"HFC-134a Stockpiling with Intent to Reclaim"},{"$f":"'Step 5-Env Benefits'!F19","v":{"v":0,"d":"0.00"}}]
[null,null,{"$f":"'Step 5-Env Benefits'!C20","v":"R-500 Stockpiling with Intent to Reclaim"},{"$f":"'Step 5-Env Benefits'!F20","v":{"v":0,"d":"0.00"}}]
[null,null,{"$f":"'Step 5-Env Benefits'!C21","v":"R-407C Stockpiling with Intent to Reclaim"},{"$f":"'Step 5-Env Benefits'!F21","v":{"v":0,"d":"0.00"}}]
[null,null,{"$f":"'Step 5-Env Benefits'!C22","v":"R-410A Stockpiling with Intent to Reclaim"},{"$f":"'Step 5-Env Benefits'!F22","v":{"v":0,"d":"0.00"}}]
[null,null,{"$f":"'Step 5-Env Benefits'!C23","v":"Stockpiling with Intent to Reclaim"},{"$f":"'Step 5-Env Benefits'!F23","v":{"v":0,"d":"0.00"}}]
[null,null,{"$f":"'Step 5-Env Benefits'!C24","v":"CFC-12 Destroyed"},{"$f":"'Step 5-Env Benefits'!F24","v":{"v":0,"d":"0.00"}}]
[null,null,{"$f":"'Step 5-Env Benefits'!C25","v":"HCFC-22 Destroyed"},{"$f":"'Step 5-Env Benefits'!F25","v":{"v":0,"d":"0.00"}}]
[null,null,{"$f":"'Step 5-Env Benefits'!C26","v":"HFC-134a Destroyed"},{"$f":"'Step 5-Env Benefits'!F26","v":{"v":0,"d":"0.00"}}]
[null,null,{"$f":"'Step 5-Env Benefits'!C27","v":"R-500 Destroyed"},{"$f":"'Step 5-Env Benefits'!F27","v":{"v":0,"d":"0.00"}}]
[null,null,{"$f":"'Step 5-Env Benefits'!C28","v":"R-407C Destroyed"},{"$f":"'Step 5-Env Benefits'!F28","v":{"v":0,"d":"0.00"}}]
[null,null,{"$f":"'Step 5-Env Benefits'!C29","v":"R-410A Destroyed"},{"$f":"'Step 5-Env Benefits'!F29","v":{"v":0,"d":"0.00"}}]
[null,null,{"$f":"'Step 5-Env Benefits'!C30","v":"Destroyed"},{"$f":"'Step 5-Env Benefits'!F30","v":{"v":0,"d":"0.00"}}]
[null,null,{"$f":"'Step 5-Env Benefits'!C31","v":"CFC-12 Stockpiling with Intent to Destroy"},{"$f":"'Step 5-Env Benefits'!F31","v":{"v":0,"d":"0.00"}}]
[null,null,{"$f":"'Step 5-Env Benefits'!C32","v":"HCFC-22 Stockpiling with Intent to Destroy"},{"$f":"'Step 5-Env Benefits'!F32","v":{"v":0,"d":"0.00"}}]
[null,null,{"$f":"'Step 5-Env Benefits'!C33","v":"HFC-134a Stockpiling with Intent to Destroy"},{"$f":"'Step 5-Env Benefits'!F33","v":{"v":0,"d":"0.00"}}]
[null,null,{"$f":"'Step 5-Env Benefits'!C34","v":"R-500 Stockpiling with Intent to Destroy"},{"$f":"'Step 5-Env Benefits'!F34","v":{"v":0,"d":"0.00"}}]
[null,null,{"$f":"'Step 5-Env Benefits'!C35","v":"R-407C Stockpiling with Intent to Destroy"},{"$f":"'Step 5-Env Benefits'!F35","v":{"v":0,"d":"0.00"}}]
[null,null,{"$f":"'Step 5-Env Benefits'!C36","v":"R-410A Stockpiling with Intent to Destroy"},{"$f":"'Step 5-Env Benefits'!F36","v":{"v":0,"d":"0.00"}}]
[null,null,{"$f":"'Step 5-Env Benefits'!C37","v":"Stockpiling with Intent to Destroy"},{"$f":"'Step 5-Env Benefits'!F37","v":{"v":0,"d":"0.00"}}]
[null,null,{"$f":"'Step 5-Env Benefits'!C38","v":"Subtotal"},{"$f":"'Step 5-Env Benefits'!F38","v":{"v":0,"d":"0.00"}}]
[null,null,{"$f":"'Step 5-Env Benefits'!C39","v":"Foam-Blowing Agentd"},{"$f":"'Step 5-Env Benefits'!F38","v":{"v":0,"d":"0.00"}}]
[null,null,{"$f":"'Step 5-Env Benefits'!C40","v":"CFC-11 Reclaimed"},{"$f":"'Step 5-Env Benefits'!F40","v":{"v":0,"d":"0.00"}}]
[null,null,{"$f":"'Step 5-Env Benefits'!C41","v":"HCFC-141b Reclaimed"},{"$f":"'Step 5-Env Benefits'!F41","v":{"v":0,"d":"0.00"}}]
[null,null,{"$f":"'Step 5-Env Benefits'!C42","v":"HFC-134a Reclaimed"},{"$f":"'Step 5-Env Benefits'!F42","v":{"v":0,"d":"0.00"}}]
[null,null,{"$f":"'Step 5-Env Benefits'!C43","v":"HFC-245fa Reclaimed"},{"$f":"'Step 5-Env Benefits'!F43","v":{"v":0,"d":"0.00"}}]
[null,null,{"$f":"'Step 5-Env Benefits'!C44","v":"Reclaimed"},{"$f":"'Step 5-Env Benefits'!F44","v":{"v":0,"d":"0.00"}}]
[null,null,{"$f":"'Step 5-Env Benefits'!C45","v":"CFC-11 Stockpiling with Intent to Reclaim"},{"$f":"'Step 5-Env Benefits'!F45","v":{"v":0,"d":"0.00"}}]
[null,null,{"$f":"'Step 5-Env Benefits'!C46","v":"HCFC-141b Stockpiling with Intent to Reclaim"},{"$f":"'Step 5-Env Benefits'!F46","v":{"v":0,"d":"0.00"}}]
[null,null,{"$f":"'Step 5-Env Benefits'!C47","v":"HFC-134a Stockpiling with Intent to Reclaim"},{"$f":"'Step 5-Env Benefits'!F47","v":{"v":0,"d":"0.00"}}]
[null,null,{"$f":"'Step 5-Env Benefits'!C48","v":"HFC-245fa Stockpiling with Intent to Reclaim"},{"$f":"'Step 5-Env Benefits'!F48","v":{"v":0,"d":"0.00"}}]
[null,null,{"$f":"'Step 5-Env Benefits'!C49","v":"Stockpiling with Intent to Reclaim"},{"$f":"'Step 5-Env Benefits'!F49","v":{"v":0,"d":"0.00"}}]
[null,null,{"$f":"'Step 5-Env Benefits'!C50","v":"CFC-11 Destroyed"},{"$f":"'Step 5-Env Benefits'!F50","v":{"v":0,"d":"0.00"}}]
[null,null,{"$f":"'Step 5-Env Benefits'!C51","v":"HCFC-141b Destroyed"},{"$f":"'Step 5-Env Benefits'!F51","v":{"v":0,"d":"0.00"}}]
[null,null,{"$f":"'Step 5-Env Benefits'!C52","v":"HFC-134a Destroyed"},{"$f":"'Step 5-Env Benefits'!F52","v":{"v":0,"d":"0.00"}}]
[null,null,{"$f":"'Step 5-Env Benefits'!C53","v":"HFC-245fa Destroyed"},{"$f":"'Step 5-Env Benefits'!F53","v":{"v":0,"d":"0.00"}}]
[null,null,{"$f":"'Step 5-Env Benefits'!C54","v":"Destroyed"},{"$f":"'Step 5-Env Benefits'!F54","v":{"v":0,"d":"0.00"}}]
[null,null,{"$f":"'Step 5-Env Benefits'!C55","v":"CFC-11 Stockpiling with Intent to Destroy"},{"$f":"'Step 5-Env Benefits'!F55","v":{"v":0,"d":"0.00"}}]
[null,null,{"$f":"'Step 5-Env Benefits'!C56","v":"HCFC-141b Stockpiling with Intent to Destroy"},{"$f":"'Step 5-Env Benefits'!F56","v":{"v":0,"d":"0.00"}}]
[null,null,{"$f":"'Step 5-Env Benefits'!C57","v":"HFC-134a Stockpiling with Intent to Destroy"},{"$f":"'Step 5-Env Benefits'!F57","v":{"v":0,"d":"0.00"}}]
[null,null,{"$f":"'Step 5-Env Benefits'!C58","v":"HFC-245fa Stockpiling with Intent to Destroy"},{"$f":"'Step 5-Env Benefits'!F58","v":{"v":0,"d":"0.00"}}]
[null,null,{"$f":"'Step 5-Env Benefits'!C59","v":"Stockpiling with Intent to Destroy"},{"$f":"'Step 5-Env Benefits'!F59","v":{"v":0,"d":"0.00"}}]
[null,null,{"$f":"'Step 5-Env Benefits'!C60","v":"Subtotal"},{"$f":"'Step 5-Env Benefits'!F60","v":{"v":0,"d":"0.00"}}]
[]
[]
[{"$nulls":3},{"$f":"'Step 5-Env Benefits'!H7","v":"Ozone Depleting Substances (ODS) Emissions Avoided (ODP-Weighted kg)b"}]
[null,null,{"$f":"'Step 5-Env Benefits'!C9","v":"Refrigerantc"},{"$f":"'Step 5-Env Benefits'!H8","v":{"v":0,"d":"0.00"}}]
[null,null,{"$f":"'Step 5-Env Benefits'!C10","v":"CFC-12 Reclaimed"},{"$f":"'Step 5-Env Benefits'!H10","v":{"v":0,"d":"0.00"}}]
[null,null,{"$f":"'Step 5-Env Benefits'!C11","v":"HCFC-22 Reclaimed"},{"$f":"'Step 5-Env Benefits'!H11","v":{"v":0,"d":"0.00"}}]
[null,null,{"$f":"'Step 5-Env Benefits'!C12","v":"HFC-134a Reclaimed"},{"$f":"'Step 5-Env Benefits'!H12","v":{"v":0,"d":"0.00"}}]
[null,null,{"$f":"'Step 5-Env Benefits'!C13","v":"R-500 Reclaimed"},{"$f":"'Step 5-Env Benefits'!H13","v":{"v":0,"d":"0.00"}}]
[null,null,{"$f":"'Step 5-Env Benefits'!C14","v":"R-407C Reclaimed"},{"$f":"'Step 5-Env Benefits'!H14","v":{"v":0,"d":"0.00"}}]
[null,null,{"$f":"'Step 5-Env Benefits'!C15","v":"R-410A Reclaimed"},{"$f":"'Step 5-Env Benefits'!H15","v":{"v":0,"d":"0.00"}}]
[null,null,{"$f":"'Step 5-Env Benefits'!C16","v":"Reclaimed"},{"$f":"'Step 5-Env Benefits'!H16","v":{"v":0,"d":"0.00"}}]
[null,null,{"$f":"'Step 5-Env Benefits'!C17","v":"CFC-12 Stockpiling with Intent to Reclaim"},{"$f":"'Step 5-Env Benefits'!H17","v":{"v":0,"d":"0.00"}}]
[null,null,{"$f":"'Step 5-Env Benefits'!C18","v":"HCFC-22 Stockpiling with Intent to Reclaim"},{"$f":"'Step 5-Env Benefits'!H18","v":{"v":0,"d":"0.00"}}]
[null,null,{"$f":"'Step 5-Env Benefits'!C19","v":"HFC-134a Stockpiling with Intent to Reclaim"},{"$f":"'Step 5-Env Benefits'!H19","v":{"v":0,"d":"0.00"}}]
[null,null,{"$f":"'Step 5-Env Benefits'!C20","v":"R-500 Stockpiling with Intent to Reclaim"},{"$f":"'Step 5-Env Benefits'!H20","v":{"v":0,"d":"0.00"}}]
[null,null,{"$f":"'Step 5-Env Benefits'!C21","v":"R-407C Stockpiling with Intent to Reclaim"},{"$f":"'Step 5-Env Benefits'!H21","v":{"v":0,"d":"0.00"}}]
[null,null,{"$f":"'Step 5-Env Benefits'!C22","v":"R-410A Stockpiling with Intent to Reclaim"},{"$f":"'Step 5-Env Benefits'!H22","v":{"v":0,"d":"0.00"}}]
[null,null,{"$f":"'Step 5-Env Benefits'!C23","v":"Stockpiling with Intent to Reclaim"},{"$f":"'Step 5-Env Benefits'!H23","v":{"v":0,"d":"0.00"}}]
[null,null,{"$f":"'Step 5-Env Benefits'!C24","v":"CFC-12 Destroyed"},{"$f":"'Step 5-Env Benefits'!H24","v":{"v":0,"d":"0.00"}}]
[null,null,{"$f":"'Step 5-Env Benefits'!C25","v":"HCFC-22 Destroyed"},{"$f":"'Step 5-Env Benefits'!H25","v":{"v":0,"d":"0.00"}}]
[null,null,{"$f":"'Step 5-Env Benefits'!C26","v":"HFC-134a Destroyed"},{"$f":"'Step 5-Env Benefits'!H26","v":{"v":0,"d":"0.00"}}]
[null,null,{"$f":"'Step 5-Env Benefits'!C27","v":"R-500 Destroyed"},{"$f":"'Step 5-Env Benefits'!H27","v":{"v":0,"d":"0.00"}}]
[null,null,{"$f":"'Step 5-Env Benefits'!C28","v":"R-407C Destroyed"},{"$f":"'Step 5-Env Benefits'!H28","v":{"v":0,"d":"0.00"}}]
[null,null,{"$f":"'Step 5-Env Benefits'!C29","v":"R-410A Destroyed"},{"$f":"'Step 5-Env Benefits'!H29","v":{"v":0,"d":"0.00"}}]
[null,null,{"$f":"'Step 5-Env Benefits'!C30","v":"Destroyed"},{"$f":"'Step 5-Env Benefits'!H30","v":{"v":0,"d":"0.00"}}]
[null,null,{"$f":"'Step 5-Env Benefits'!C31","v":"CFC-12 Stockpiling with Intent to Destroy"},{"$f":"'Step 5-Env Benefits'!H31","v":{"v":0,"d":"0.00"}}]
[null,null,{"$f":"'Step 5-Env Benefits'!C32","v":"HCFC-22 Stockpiling with Intent to Destroy"},{"$f":"'Step 5-Env Benefits'!H32","v":{"v":0,"d":"0.00"}}]
[null,null,{"$f":"'Step 5-Env Benefits'!C33","v":"HFC-134a Stockpiling with Intent to Destroy"},{"$f":"'Step 5-Env Benefits'!H33","v":{"v":0,"d":"0.00"}}]
[null,null,{"$f":"'Step 5-Env Benefits'!C34","v":"R-500 Stockpiling with Intent to Destroy"},{"$f":"'Step 5-Env Benefits'!H34","v":{"v":0,"d":"0.00"}}]
[null,null,{"$f":"'Step 5-Env Benefits'!C35","v":"R-407C Stockpiling with Intent to Destroy"},{"$f":"'Step 5-Env Benefits'!H35","v":{"v":0,"d":"0.00"}}]
[null,null,{"$f":"'Step 5-Env Benefits'!C36","v":"R-410A Stockpiling with Intent to Destroy"},{"$f":"'Step 5-Env Benefits'!H36","v":{"v":0,"d":"0.00"}}]
[null,null,{"$f":"'Step 5-Env Benefits'!C37","v":"Stockpiling with Intent to Destroy"},{"$f":"'Step 5-Env Benefits'!H37","v":{"v":0,"d":"0.00"}}]
[null,null,{"$f":"'Step 5-Env Benefits'!C38","v":"Subtotal"},{"$f":"'Step 5-Env Benefits'!H38","v":{"v":0,"d":"0.00"}}]
[null,null,{"$f":"'Step 5-Env Benefits'!C39","v":"Foam-Blowing Agentd"}]
[null,null,{"$f":"'Step 5-Env Benefits'!C40","v":"CFC-11 Reclaimed"},{"$f":"'Step 5-Env Benefits'!H40","v":{"v":0,"d":"0.00"}}]
[null,null,{"$f":"'Step 5-Env Benefits'!C41","v":"HCFC-141b Reclaimed"},{"$f":"'Step 5-Env Benefits'!H41","v":{"v":0,"d":"0.00"}}]
[null,null,{"$f":"'Step 5-Env Benefits'!C42","v":"HFC-134a Reclaimed"},{"$f":"'Step 5-Env Benefits'!H42","v":{"v":0,"d":"0.00"}}]
[null,null,{"$f":"'Step 5-Env Benefits'!C43","v":"HFC-245fa Reclaimed"},{"$f":"'Step 5-Env Benefits'!H43","v":{"v":0,"d":"0.00"}}]
[null,null,{"$f":"'Step 5-Env Benefits'!C44","v":"Reclaimed"},{"$f":"'Step 5-Env Benefits'!H44","v":{"v":0,"d":"0.00"}}]
[null,null,{"$f":"'Step 5-Env Benefits'!C45","v":"CFC-11 Stockpiling with Intent to Reclaim"},{"$f":"'Step 5-Env Benefits'!H45","v":{"v":0,"d":"0.00"}}]
[null,null,{"$f":"'Step 5-Env Benefits'!C46","v":"HCFC-141b Stockpiling with Intent to Reclaim"},{"$f":"'Step 5-Env Benefits'!H46","v":{"v":0,"d":"0.00"}}]
[null,null,{"$f":"'Step 5-Env Benefits'!C47","v":"HFC-134a Stockpiling with Intent to Reclaim"},{"$f":"'Step 5-Env Benefits'!H47","v":{"v":0,"d":"0.00"}}]
[null,null,{"$f":"'Step 5-Env Benefits'!C48","v":"HFC-245fa Stockpiling with Intent to Reclaim"},{"$f":"'Step 5-Env Benefits'!H48","v":{"v":0,"d":"0.00"}}]
[null,null,{"$f":"'Step 5-Env Benefits'!C49","v":"Stockpiling with Intent to Reclaim"},{"$f":"'Step 5-Env Benefits'!H49","v":{"v":0,"d":"0.00"}}]
[null,null,{"$f":"'Step 5-Env Benefits'!C50","v":"CFC-11 Destroyed"},{"$f":"'Step 5-Env Benefits'!H50","v":{"v":0,"d":"0.00"}}]
[null,null,{"$f":"'Step 5-Env Benefits'!C51","v":"HCFC-141b Destroyed"},{"$f":"'Step 5-Env Benefits'!H51","v":{"v":0,"d":"0.00"}}]
[null,null,{"$f":"'Step 5-Env Benefits'!C52","v":"HFC-134a Destroyed"},{"$f":"'Step 5-Env Benefits'!H52","v":{"v":0,"d":"0.00"}}]
[null,null,{"$f":"'Step 5-Env Benefits'!C53","v":"HFC-245fa Destroyed"},{"$f":"'Step 5-Env Benefits'!H53","v":{"v":0,"d":"0.00"}}]
[null,null,{"$f":"'Step 5-Env Benefits'!C54","v":"Destroyed"},{"$f":"'Step 5-Env Benefits'!H54","v":{"v":0,"d":"0.00"}}]
[null,null,{"$f":"'Step 5-Env Benefits'!C55","v":"CFC-11 Stockpiling with Intent to Destroy"},{"$f":"'Step 5-Env Benefits'!H55","v":{"v":0,"d":"0.00"}}]
[null,null,{"$f":"'Step 5-Env Benefits'!C56","v":"HCFC-141b Stockpiling with Intent to Destroy"},{"$f":"'Step 5-Env Benefits'!H56","v":{"v":0,"d":"0.00"}}]
[null,null,{"$f":"'Step 5-Env Benefits'!C57","v":"HFC-134a Stockpiling with Intent to Destroy"},{"$f":"'Step 5-Env Benefits'!H57","v":{"v":0,"d":"0.00"}}]
[null,null,{"$f":"'Step 5-Env Benefits'!C58","v":"HFC-245fa Stockpiling with Intent to Destroy"},{"$f":"'Step 5-Env Benefits'!H58","v":{"v":0,"d":"0.00"}}]
[null,null,{"$f":"'Step 5-Env Benefits'!C59","v":"Stockpiling with Intent to Destroy"},{"$f":"'Step 5-Env Benefits'!H59","v":{"v":0,"d":"0.00"}}]
[null,null,{"$f":"'Step 5-Env Benefits (B)'!C60","v":"Subtotal"},{"$f":"'Step 5-Env Benefits'!H60","v":{"v":0,"d":"0.00"}}]
[]
[null,null,{"$f":"'Step 5-Env Benefits'!D7","v":"Total Amount Prevented from Being Emitted"},{"$f":"'Step 5-Env Benefits'!D8:E8","v":"(lb)"}]
[null,null,"Durable Materials",{"$f":"'Step 5-Env Benefits'!D61","v":{"v":0,"d":"0.00"}}]
[null,null,"Ferrous Metal Recycled",{"$f":"'Step 5-Env Benefits'!D62","v":{"v":0,"d":"0.00"}}]
[null,null,"Non-ferrous Metal Recycled",{"$f":"'Step 5-Env Benefits'!D63","v":{"v":0,"d":"0.00"}}]
[null,null,"Plastic Recycled",{"$f":"'Step 5-Env Benefits'!D64","v":{"v":0,"d":"0.00"}}]
[null,null,"Glass Recycled",{"$f":"'Step 5-Env Benefits'!D65","v":{"v":0,"d":"0.00"}}]
[null,null,"Subtotal",{"$f":"'Step 5-Env Benefits'!D66","v":{"v":0,"d":"0.00"}}]
[null,null,"Removing Units from the Grid",{"$f":"'Step 5-Env Benefits'!D67","v":{"v":0,"d":"0.00"}}]
[null,null,"Subtotal Energy Savings",{"$f":"'Step 5-Env Benefits'!D68","v":"NA"}]
[]
[null,null,"Total Amount Prevented from Being Emitted",{"$f":"'Step 5-Env Benefits'!E8","v":"(kg)"}]
[null,null,"Durable Materials",{"$f":"'Step 5-Env Benefits'!E9","v":{"v":0,"d":"0.00"}}]
[null,null,"Ferrous Metal Recycled",{"$f":"'Step 5-Env Benefits'!E62","v":{"v":0,"d":"0.00"}}]
[null,null,"Non-ferrous Metal Recycled",{"$f":"'Step 5-Env Benefits'!E63","v":{"v":0,"d":"0.00"}}]
[null,null,"Plastic Recycled",{"$f":"'Step 5-Env Benefits'!E64","v":{"v":0,"d":"0.00"}}]
[null,null,"Glass Recycled",{"$f":"'Step 5-Env Benefits'!E65","v":{"v":0,"d":"0.00"}}]
[null,null,"Subtotal",{"$f":"'Step 5-Env Benefits'!E66","v":{"v":0,"d":"0.00"}}]
[null,null,"Removing Units from the Grid",{"$f":"'Step 5-Env Benefits'!E67","v":{"v":0,"d":"0.00"}}]
[null,null,"Subtotal Energy Savings",{"$f":"'Step 5-Env Benefits'!E68","v":"NA"}]
[]
[null,null,"Total Amount Prevented from Being Emitted",{"$f":"'Step 5-Env Benefits'!F7","v":"Greenhouse Gas (GHG) Emissions Avoided (MTCO2eq)a"}]
[null,null,"Durable Materials",{"$f":"'Step 5-Env Benefits'!F61","v":{"v":0,"d":"0.00"}}]
[null,null,"Ferrous Metal Recycled",{"$f":"'Step 5-Env Benefits'!F62","v":{"v":0,"d":"0.00"}}]
[null,null,"Non-ferrous Metal Recycled",{"$f":"'Step 5-Env Benefits'!F63","v":{"v":0,"d":"0.00"}}]
[null,null,"Plastic Recycled",{"$f":"'Step 5-Env Benefits'!F64","v":{"v":0,"d":"0.00"}}]
[null,null,"Glass Recycled",{"$f":"'Step 5-Env Benefits'!F65","v":{"v":0,"d":"0.00"}}]
[null,null,"Subtotal",{"$f":"'Step 5-Env Benefits'!F66","v":{"v":0,"d":"0.00"}}]
[null,null,"Removing Units from the Grid",{"$f":"'Step 5-Env Benefits'!F67","v":{"v":0,"d":"0.00"}}]
[null,null,"Subtotal Energy Savings",{"$f":"'Step 5-Env Benefits'!F68","v":{"v":0,"d":"0.00"}}]
[]
[null,null,{"$f":"'Step 5-Env Benefits'!C69","v":"TOTAL"}]
[null,null,{"$f":"'Step 5-Env Benefits'!D8","v":"(lb)"},{"$f":"'Step 5-Env Benefits'!D69","v":"NA"}]
[null,null,{"$f":"'Step 5-Env Benefits'!E8","v":"(kg)"},{"$f":"'Step 5-Env Benefits'!E69","v":"NA"}]
[null,null,{"$f":"'Step 5-Env Benefits'!F7","v":"Greenhouse Gas (GHG) Emissions Avoided (MTCO2eq)a"},{"$f":"'Step 5-Env Benefits'!F69","v":{"v":0,"d":"0.00"}}]
[null,null,{"$f":"'Step 5-Env Benefits'!H7","v":"Ozone Depleting Substances (ODS) Emissions Avoided (ODP-Weighted kg)b"},{"$f":"'Step 5-Env Benefits'!H69","v":{"v":0,"d":"0.00"}}]
[]
[]
[null,null,"Hazardous Components"]
[null,null,{"$f":"'Step 5-Env Benefits'!C80","v":"Properly Recovered Component"},{"$f":"IF(ISBLANK('Step 5-Env Benefits'!D80),\"BLANK\",'Step 5-Env Benefits'!D80)","v":"Total Amount"}]
[null,null,{"$f":"'Step 5-Env Benefits'!C81","v":"Used Oil Recycled or Properly Disposed (gal)"},{"$f":"IF(ISBLANK('Step 5-Env Benefits'!D81),\"BLANK\",'Step 5-Env Benefits'!D81)","v":{"v":0,"d":"0.00"}}]
[null,null,{"$f":"'Step 5-Env Benefits'!C82","v":"PCB-Containing Capacitors"}]
[null,null,{"$f":"'Step 5-Env Benefits'!C83","v":"Number Destroyed"},{"$f":"IF(ISBLANK('Step 5-Env Benefits'!D83),\"BLANK\",'Step 5-Env Benefits'!D83)","v":{"v":0,"d":"0.00"}}]
[null,null,{"$f":"'Step 5-Env Benefits'!C84","v":"Mercury-Containing Components"}]
[null,null,{"$f":"'Step 5-Env Benefits'!C85","v":"Number Recycled"},{"$f":"IF(ISBLANK('Step 5-Env Benefits'!D85),\"BLANK\",'Step 5-Env Benefits'!D85)","v":{"v":0,"d":"0.00"}}]
[null,null,{"$f":"'Step 5-Env Benefits'!C86","v":"Number Disposed"},{"$f":"IF(ISBLANK('Step 5-Env Benefits'!D86),\"BLANK\",'Step 5-Env Benefits'!D86)","v":{"v":0,"d":"0.00"}}]
[]
[null,"Summary of Input Data"]
[]
[null,null,"Refrigerators/ Freezers"]
[null,null,{"$f":"'Step 5-QA_Input Data Summary'!C8","v":"Number of Units"},{"$f":"'Step 5-QA_Input Data Summary'!D8","v":0}]
[null,null,{"$f":"'Step 5-QA_Input Data Summary'!C9","v":"Refrigerant (lb)*"}]
[null,null,{"$f":"'Step 5-QA_Input Data Summary'!C10","v":"CFC-12"},{"$f":"'Step 5-QA_Input Data Summary'!D10","v":""}]
[null,null,{"$f":"'Step 5-QA_Input Data Summary'!C11","v":"HCFC-22"},{"$f":"'Step 5-QA_Input Data Summary'!D11","v":"NA"}]
[null,null,{"$f":"'Step 5-QA_Input Data Summary'!C12","v":"HFC-134a"},{"$f":"'Step 5-QA_Input Data Summary'!D12","v":""}]
[null,null,{"$f":"'Step 5-QA_Input Data Summary'!C14","v":"R-407C"},{"$f":"'Step 5-QA_Input Data Summary'!D14","v":"NA"}]
[null,null,{"$f":"'Step 5-QA_Input Data Summary'!C15","v":"R-410A"},{"$f":"'Step 5-QA_Input Data Summary'!D15","v":"NA"}]
[null,null,{"$f":"'Step 5-QA_Input Data Summary'!C16","v":"Average across all units"},{"$f":"'Step 5-QA_Input Data Summary'!D16","v":""}]
[null,null,{"$f":"'Step 5-QA_Input Data Summary'!C17","v":"Foam-Blowing Agent (lb)**"}]
[null,null,{"$f":"'Step 5-QA_Input Data Summary'!C18","v":"CFC-11"},{"$f":"'Step 5-QA_Input Data Summary'!D18","v":""}]
[null,null,{"$f":"'Step 5-QA_Input Data Summary'!C19","v":"HCFC-141b"},{"$f":"'Step 5-QA_Input Data Summary'!D19","v":""}]
[null,null,{"$f":"'Step 5-QA_Input Data Summary'!C20","v":"HFC-134a"},{"$f":"'Step 5-QA_Input Data Summary'!D20","v":""}]
[null,null,{"$f":"'Step 5-QA_Input Data Summary'!C21","v":"HFC-245fa"},{"$f":"'Step 5-QA_Input Data Summary'!D21","v":""}]
[null,null,{"$f":"'Step 5-QA_Input Data Summary'!C22","v":"Average across all units"},{"$f":"'Step 5-QA_Input Data Summary'!D22","v":""}]
[null,null,{"$f":"'Step 5-QA_Input Data Summary'!C23","v":"Durable Materials"}]
[null,null,{"$f":"'Step 5-QA_Input Data Summary'!C24","v":"Used oil (gal)"},{"$f":"'Step 5-QA_Input Data Summary'!D24","v":""}]
[null,null,{"$f":"'Step 5-QA_Input Data Summary'!C25","v":"Ferrous metals (lb)"},{"$f":"'Step 5-QA_Input Data Summary'!D25","v":""}]
[null,null,{"$f":"'Step 5-QA_Input Data Summary'!C26","v":"Non-ferrous metals (lb)"},{"$f":"'Step 5-QA_Input Data Summary'!D26","v":""}]
[null,null,{"$f":"'Step 5-QA_Input Data Summary'!C27","v":"Plastic (lb)"},{"$f":"'Step 5-QA_Input Data Summary'!D27","v":""}]
[null,null,{"$f":"'Step 5-QA_Input Data Summary'!C28","v":"Glass (lb)"},{"$f":"'Step 5-QA_Input Data Summary'!D28","v":""}]
[null,null,{"$f":"'Step 5-QA_Input Data Summary'!C29","v":"Number of PCB-containing capacitors"},{"$f":"'Step 5-QA_Input Data Summary'!D29","v":""}]
[null,null,{"$f":"'Step 5-QA_Input Data Summary'!C30","v":"Number of Mercury-containing components"},{"$f":"'Step 5-QA_Input Data Summary'!D30","v":"NA"}]
[null,null,{"$f":"'Step 5-QA_Input Data Summary'!E7","v":"Stand-Alone Freezers"}]
[null,null,{"$f":"'Step 5-QA_Input Data Summary'!C8","v":"Number of Units"},{"$f":"'Step 5-QA_Input Data Summary'!E8","v":0}]
[null,null,{"$f":"'Step 5-QA_Input Data Summary'!C9","v":"Refrigerant (lb)*"}]
[null,null,{"$f":"'Step 5-QA_Input Data Summary'!C10","v":"CFC-12"},{"$f":"'Step 5-QA_Input Data Summary'!E10","v":""}]
[null,null,{"$f":"'Step 5-QA_Input Data Summary'!C11","v":"HCFC-22"},{"$f":"'Step 5-QA_Input Data Summary'!E11","v":""}]
[null,null,{"$f":"'Step 5-QA_Input Data Summary'!C12","v":"HFC-134a"},{"$f":"'Step 5-QA_Input Data Summary'!E12","v":""}]
[null,null,{"$f":"'Step 5-QA_Input Data Summary'!C14","v":"R-407C"},{"$f":"'Step 5-QA_Input Data Summary'!E14","v":"NA"}]
[null,null,{"$f":"'Step 5-QA_Input Data Summary'!C15","v":"R-410A"},{"$f":"'Step 5-QA_Input Data Summary'!E15","v":"NA"}]
[null,null,{"$f":"'Step 5-QA_Input Data Summary'!C16","v":"Average across all units"},{"$f":"'Step 5-QA_Input Data Summary'!E16","v":""}]
[null,null,{"$f":"'Step 5-QA_Input Data Summary'!C17","v":"Foam-Blowing Agent (lb)**"}]
[null,null,{"$f":"'Step 5-QA_Input Data Summary'!C18","v":"CFC-11"},{"$f":"'Step 5-QA_Input Data Summary'!E18","v":""}]
[null,null,{"$f":"'Step 5-QA_Input Data Summary'!C19","v":"HCFC-141b"},{"$f":"'Step 5-QA_Input Data Summary'!E19","v":""}]
[null,null,{"$f":"'Step 5-QA_Input Data Summary'!C20","v":"HFC-134a"},{"$f":"'Step 5-QA_Input Data Summary'!E20","v":""}]
[null,null,{"$f":"'Step 5-QA_Input Data Summary'!C21","v":"HFC-245fa"},{"$f":"'Step 5-QA_Input Data Summary'!E21","v":""}]
[null,null,{"$f":"'Step 5-QA_Input Data Summary'!C22","v":"Average across all units"},{"$f":"'Step 5-QA_Input Data Summary'!E22","v":""}]
[null,null,{"$f":"'Step 5-QA_Input Data Summary'!C23","v":"Durable Materials"}]
[null,null,{"$f":"'Step 5-QA_Input Data Summary'!C24","v":"Used oil (gal)"},{"$f":"'Step 5-QA_Input Data Summary'!E24","v":""}]
[null,null,{"$f":"'Step 5-QA_Input Data Summary'!C25","v":"Ferrous metals (lb)"},{"$f":"'Step 5-QA_Input Data Summary'!E25","v":""}]
[null,null,{"$f":"'Step 5-QA_Input Data Summary'!C26","v":"Non-ferrous metals (lb)"},{"$f":"'Step 5-QA_Input Data Summary'!E26","v":""}]
[null,null,{"$f":"'Step 5-QA_Input Data Summary'!C27","v":"Plastic (lb)"},{"$f":"'Step 5-QA_Input Data Summary'!E27","v":""}]
[null,null,{"$f":"'Step 5-QA_Input Data Summary'!C28","v":"Glass (lb)"},{"$f":"'Step 5-QA_Input Data Summary'!E28","v":"NA"}]
[null,null,{"$f":"'Step 5-QA_Input Data Summary'!C29","v":"Number of PCB-containing capacitors"},{"$f":"'Step 5-QA_Input Data Summary'!E29","v":""}]
[null,null,{"$f":"'Step 5-QA_Input Data Summary'!C30","v":"Number of Mercury-containing components"},{"$f":"'Step 5-QA_Input Data Summary'!E30","v":""}]
[null,null,"Air Conditioning Units"]
[null,null,{"$f":"'Step 5-QA_Input Data Summary'!C8","v":"Number of Units"},{"$f":"'Step 5-QA_Input Data Summary'!F8","v":0}]
[null,null,{"$f":"'Step 5-QA_Input Data Summary'!C9","v":"Refrigerant (lb)*"}]
[null,null,{"$f":"'Step 5-QA_Input Data Summary'!C10","v":"CFC-12"},{"$f":"'Step 5-QA_Input Data Summary'!F10","v":"NA"}]
[null,null,{"$f":"'Step 5-QA_Input Data Summary'!C11","v":"HCFC-22"},{"$f":"'Step 5-QA_Input Data Summary'!F11","v":""}]
[null,null,{"$f":"'Step 5-QA_Input Data Summary'!C12","v":"HFC-134a"},{"$f":"'Step 5-QA_Input Data Summary'!F12","v":"NA"}]
[null,null,{"$f":"'Step 5-QA_Input Data Summary'!C14","v":"R-407C"},{"$f":"'Step 5-QA_Input Data Summary'!F14","v":""}]
[null,null,{"$f":"'Step 5-QA_Input Data Summary'!C15","v":"R-410A"},{"$f":"'Step 5-QA_Input Data Summary'!F15","v":""}]
[null,null,{"$f":"'Step 5-QA_Input Data Summary'!C16","v":"Average across all units"},{"$f":"'Step 5-QA_Input Data Summary'!F16","v":""}]
[null,null,{"$f":"'Step 5-QA_Input Data Summary'!C17","v":"Foam-Blowing Agent (lb)**"}]
[null,null,{"$f":"'Step 5-QA_Input Data Summary'!C18","v":"CFC-11"},{"$f":"'Step 5-QA_Input Data Summary'!F18","v":"NA"}]
[null,null,{"$f":"'Step 5-QA_Input Data Summary'!C19","v":"HCFC-141b"},{"$f":"'Step 5-QA_Input Data Summary'!F19","v":"NA"}]
[null,null,{"$f":"'Step 5-QA_Input Data Summary'!C20","v":"HFC-134a"},{"$f":"'Step 5-QA_Input Data Summary'!F20","v":"NA"}]
[null,null,{"$f":"'Step 5-QA_Input Data Summary'!C21","v":"HFC-245fa"},{"$f":"'Step 5-QA_Input Data Summary'!F21","v":"NA"}]
[null,null,{"$f":"'Step 5-QA_Input Data Summary'!C22","v":"Average across all units"},{"$f":"'Step 5-QA_Input Data Summary'!F22","v":"NA"}]
[null,null,{"$f":"'Step 5-QA_Input Data Summary'!C23","v":"Durable Materials"}]
[null,null,{"$f":"'Step 5-QA_Input Data Summary'!C24","v":"Used oil (gal)"},{"$f":"'Step 5-QA_Input Data Summary'!F24","v":""}]
[null,null,{"$f":"'Step 5-QA_Input Data Summary'!C25","v":"Ferrous metals (lb)"},{"$f":"'Step 5-QA_Input Data Summary'!F25","v":""}]
[null,null,{"$f":"'Step 5-QA_Input Data Summary'!C26","v":"Non-ferrous metals (lb)"},{"$f":"'Step 5-QA_Input Data Summary'!F26","v":""}]
[null,null,{"$f":"'Step 5-QA_Input Data Summary'!C27","v":"Plastic (lb)"},{"$f":"'Step 5-QA_Input Data Summary'!F27","v":""}]
[null,null,{"$f":"'Step 5-QA_Input Data Summary'!C28","v":"Glass (lb)"},{"$f":"'Step 5-QA_Input Data Summary'!F28","v":"NA"}]
[null,null,{"$f":"'Step 5-QA_Input Data Summary'!C29","v":"Number of PCB-containing capacitors"},{"$f":"'Step 5-QA_Input Data Summary'!F29","v":""}]
[null,null,{"$f":"'Step 5-QA_Input Data Summary'!C30","v":"Number of Mercury-containing components"},{"$f":"'Step 5-QA_Input Data Summary'!F30","v":"NA"}]
[null,null,"Dehumidifiers"]
[null,null,{"$f":"'Step 5-QA_Input Data Summary'!C8","v":"Number of Units"},{"$f":"'Step 5-QA_Input Data Summary'!G8","v":0}]
[null,null,{"$f":"'Step 5-QA_Input Data Summary'!C9","v":"Refrigerant (lb)*"}]
[null,null,{"$f":"'Step 5-QA_Input Data Summary'!C10","v":"CFC-12"},{"$f":"'Step 5-QA_Input Data Summary'!G10","v":""}]
[null,null,{"$f":"'Step 5-QA_Input Data Summary'!C11","v":"HCFC-22"},{"$f":"'Step 5-QA_Input Data Summary'!G11","v":""}]
[null,null,{"$f":"'Step 5-QA_Input Data Summary'!C12","v":"HFC-134a"},{"$f":"'Step 5-QA_Input Data Summary'!G12","v":""}]
[null,null,{"$f":"'Step 5-QA_Input Data Summary'!C13","v":"R-500A"},{"$f":"'Step 5-QA_Input Data Summary'!G13","v":""}]
[null,null,{"$f":"'Step 5-QA_Input Data Summary'!C14","v":"R-407C"},{"$f":"'Step 5-QA_Input Data Summary'!G14","v":"NA"}]
[null,null,{"$f":"'Step 5-QA_Input Data Summary'!C15","v":"R-410A"},{"$f":"'Step 5-QA_Input Data Summary'!G15","v":""}]
[null,null,{"$f":"'Step 5-QA_Input Data Summary'!C16","v":"Average across all units"},{"$f":"'Step 5-QA_Input Data Summary'!G16","v":""}]
[null,null,{"$f":"'Step 5-QA_Input Data Summary'!C17","v":"Foam-Blowing Agent (lb)**"}]
[null,null,{"$f":"'Step 5-QA_Input Data Summary'!C18","v":"CFC-11"},{"$f":"'Step 5-QA_Input Data Summary'!G18","v":"NA"}]
[null,null,{"$f":"'Step 5-QA_Input Data Summary'!C19","v":"HCFC-141b"},{"$f":"'Step 5-QA_Input Data Summary'!G19","v":"NA"}]
[null,null,{"$f":"'Step 5-QA_Input Data Summary'!C20","v":"HFC-134a"},{"$f":"'Step 5-QA_Input Data Summary'!G20","v":"NA"}]
[null,null,{"$f":"'Step 5-QA_Input Data Summary'!C21","v":"HFC-245fa"},{"$f":"'Step 5-QA_Input Data Summary'!G21","v":"NA"}]
[null,null,{"$f":"'Step 5-QA_Input Data Summary'!C22","v":"Average across all units"},{"$f":"'Step 5-QA_Input Data Summary'!G22","v":"NA"}]
[null,null,{"$f":"'Step 5-QA_Input Data Summary'!C23","v":"Durable Materials"}]
[null,null,{"$f":"'Step 5-QA_Input Data Summary'!C24","v":"Used oil (gal)"},{"$f":"'Step 5-QA_Input Data Summary'!G24","v":""}]
[null,null,{"$f":"'Step 5-QA_Input Data Summary'!C25","v":"Ferrous metals (lb)"},{"$f":"'Step 5-QA_Input Data Summary'!G25","v":""}]
[null,null,{"$f":"'Step 5-QA_Input Data Summary'!C26","v":"Non-ferrous metals (lb)"},{"$f":"'Step 5-QA_Input Data Summary'!G26","v":""}]
[null,null,{"$f":"'Step 5-QA_Input Data Summary'!C27","v":"Plastic (lb)"},{"$f":"'Step 5-QA_Input Data Summary'!G27","v":""}]
[null,null,{"$f":"'Step 5-QA_Input Data Summary'!C28","v":"Glass (lb)"},{"$f":"'Step 5-QA_Input Data Summary'!G28","v":"NA"}]
[null,null,{"$f":"'Step 5-QA_Input Data Summary'!C29","v":"Number of PCB-containing capacitors"},{"$f":"'Step 5-QA_Input Data Summary'!G29","v":""}]
[null,null,{"$f":"'Step 5-QA_Input Data Summary'!C30","v":"Number of Mercury-containing components"},{"$f":"'Step 5-QA_Input Data Summary'!G30","v":"NA"}]

{"sheet":"OutputLinker (B)","index":21,"n_rows":901,"n_cols":4,"rows_kept":901,"hidden":true,"merged":[[80,1,89,1],[90,1,109,1],[110,1,111,1],[112,1,113,1],[134,1,143,1],[144,1,163,1],[164,1,165,1],[166,1,167,1],[224,1,238,1],[239,1,258,1],[259,1,260,1],[261,1,262,1],[265,1,266,1],[285,1,299,1],[300,1,319,1],[320,1,321,1],[322,1,323,1],[326,1,327,1],[354,1,368,1],[369,1,370,1],[371,1,372,1],[384,1,398,1],[399,1,400,1],[401,1,402,1],[435,1,459,1],[460,1,461,1],[462,1,463,1],[477,1,501,1],[502,1,503,1],[504,1,505,1],[543,2,544,2]]}
[]
[null,"Step 1 - Contact and Program Info"]
[]
[null,null,{"$f":"'Step 1-Contact and Program Info'!C7","v":"  Name of RAD Partner:"},{"$f":"IF(ISBLANK('Step 1-Contact and Program Info'!D7),\"BLANK\",'Step 1-Contact and Program Info'!D7)","v":"BLANK"}]
[null,null,{"$f":"'Step 1-Contact and Program Info'!I7","v":"Reporting Period:"},{"$f":"IF(ISBLANK('Step 1-Contact and Program Info'!J7),\"BLANK\",'Step 1-Contact and Program Info'!J7)","v":"MM/DD/YYYY"}]
[null,null,{"$f":"'Step 1-Contact and Program Info'!K7","v":"to"},{"$f":"IF(ISBLANK('Step 1-Contact and Program Info'!L7),\"BLANK\",'Step 1-Contact and Program Info'!L7)","v":"MM/DD/YYYY"}]
[null,null,{"$f":"'Step 1-Contact and Program Info'!C10","v":"Primary Contact: "}]
[null,null,{"$f":"'Step 1-Contact and Program Info'!C11","v":"  Contact Name "},{"$f":"IF(ISBLANK('Step 1-Contact and Program Info'!D11),\"BLANK\",'Step 1-Contact and Program Info'!D11)","v":"BLANK"}]
[null,null,{"$f":"'Step 1-Contact and Program Info'!C12","v":"  Address "},{"$f":"IF(ISBLANK('Step 1-Contact and Program Info'!D12),\"BLANK\",'Step 1-Contact and Program Info'!D12)","v":"BLANK"}]
[{"$nulls":3},{"$f":"IF(ISBLANK('Step 1-Contact and Program Info'!D13),\"BLANK\",'Step 1-Contact and Program Info'!D13)","v":"BLANK"}]
[{"$nulls":3},{"$f":"IF(ISBLANK('Step 1-Contact and Program Info'!D14),\"BLANK\",'Step 1-Contact and Program Info'!D14)","v":"BLANK"}]
[null,null,{"$f":"'Step 1-Contact and Program Info'!C15","v":"  Phone "},{"$f":"IF(ISBLANK('Step 1-Contact and Program Info'!D15),\"BLANK\",'Step 1-Contact and Program Info'!D15)","v":"BLANK"}]
[null,null,{"$f":"'Step 1-Contact and Program Info'!C16","v":"  Fax "},{"$f":"IF(ISBLANK('Step 1-Contact and Program Info'!D16),\"BLANK\",'Step 1-Contact and Program Info'!D16)","v":"BLANK"}]
[null,null,{"$f":"'Step 1-Contact and Program Info'!C17","v":"  E-mail Address "},{"$f":"IF(ISBLANK('Step 1-Contact and Program Info'!D17),\"BLANK\",'Step 1-Contact and Program Info'!D17)","v":"BLANK"}]
[null,null,{"$f":"'Step 1-Contact and Program Info'!I10","v":"Alternate Contact: "}]
[null,null,{"$f":"'Step 1-Contact and Program Info'!I11","v":"Contact Name "},{"$f":"IF(ISBLANK('Step 1-Contact and Program Info'!J11),\"BLANK\",'Step 1-Contact and Program Info'!J11)","v":"BLANK"}]
[null,null,{"$f":"'Step 1-Contact and Program Info'!I12","v":"Address "},{"$f":"IF(ISBLANK('Step 1-Contact and Program Info'!J12),\"BLANK\",'Step 1-Contact and Program Info'!J12)","v":"BLANK"}]
[{"$nulls":3},{"$f":"IF(ISBLANK('Step 1-Contact and Program Info'!J13),\"BLANK\",'Step 1-Contact and Program Info'!J13)","v":"BLANK"}]
[{"$nulls":3},{"$f":"IF(ISBLANK('Step 1-Contact and Program Info'!J14),\"BLANK\",'Step 1-Contact and Program Info'!J14)","v":"BLANK"}]
[null,null,{"$f":"'Step 1-Contact and Program Info'!I15","v":"Phone "},{"$f":"IF(ISBLANK('Step 1-Contact and Program Info'!J15),\"BLANK\",'Step 1-Contact and Program Info'!J15)","v":"BLANK"}]
[null,null,{"$f":"'Step 1-Contact and Program Info'!I16","v":"Fax "},{"$f":"IF(ISBLANK('Step 1-Contact and Program Info'!J16),\"BLANK\",'Step 1-Contact and Program Info'!J16)","v":"BLANK"}]
[null,null,{"$f":"'Step 1-Contact and Program Info'!I17","v":"E-mail Address "},{"$f":"IF(ISBLANK('Step 1-Contact and Program Info'!J17),\"BLANK\",'Step 1-Contact and Program Info'!J17)","v":"BLANK"}]
[]
[null,null,{"$f":"'Step 1-Contact and Program Info'!G26","v":"Refrigerators"},{"$f":"'Step 1-Contact and Program Info'!H26","v":0}]
[null,null,{"$f":"'Step 1-Contact and Program Info'!G27","v":"Stand-Alone Freezers"},{"$f":"'Step 1-Contact and Program Info'!H27","v":0}]
[null,null,{"$f":"'Step 1-Contact and Program Info'!G28","v":"Air-Conditioning Units"},{"$f":"'Step 1-Contact and Program Info'!H28","v":0}]
[null,null,{"$f":"'Step 1-Contact and Program Info'!G29","v":"Dehumidifiers"},{"$f":"'Step 1-Contact and Program Info'!H29","v":0}]
[null,null,"Jointly Proccessed Units?",{"$f":"'Step 1-Contact and Program Info'!H31","v":0}]
[null,null,"Incentive offered?",{"$f":"'Step 1-Contact and Program Info'!H33","v":0}]
[]
[null,null,"Partner Type",{"$f":"'Step 1-Contact and Program Info'!G22","v":0}]
[null,null,"# of Households Served",{"$f":"IF('Step 1-Contact and Program Info'!G22=\"Utility\", 'Step 1-Contact and Program Info'!G24, \"BLANK\")","v":"BLANK"}]
[null,null,"# of Stores Served",{"$f":"IF('Step 1-Contact and Program Info'!G22=\"Retailer\", 'Step 1-Contact and Program Info'!G24, \"BLANK\")","v":"BLANK"}]
[null,null,"# of States Served",{"$f":"IF('Step 1-Contact and Program Info'!G22=\"Manufacturer\", 'Step 1-Contact and Program Info'!G24, \"BLANK\")","v":"BLANK"}]
[null,null,"# of Facilities Served",{"$f":"IF('Step 1-Contact and Program Info'!G22=\"State\", 'Step 1-Contact and Program Info'!G24, \"BLANK\")","v":"BLANK"}]
[]
[]
[]
[null,"Step 3 - Refrigerators-Freezers (B)"]
[]
[null,null,"Units Processed"]
[null,null,{"$f":"'Step 3-Refrigerators'!C8","v":"Total Number of Units Processed"},{"$f":"IF(ISBLANK('Step 3-Refrigerators (B)'!D8),\"BLANK\",'Step 3-Refrigerators (B)'!D8)","v":0}]
[null,null,{"$f":"'Step 3-Refrigerators'!C9","v":"Average Age of Appliances Collected (yrs)"},{"$f":"IF(ISBLANK('Step 3-Refrigerators (B)'!D9),\"BLANK\",'Step 3-Refrigerators (B)'!D9)","v":{"v":0,"d":"0.0"}}]
[null,null,{"$f":"'Step 3-Refrigerators'!D10","v":"Total Number of Units Processed "}]
[null,null,{"$f":"'Step 3-Refrigerators'!C11","v":"CFC-12"},{"$f":"IF(ISBLANK('Step 3-Refrigerators (B)'!D11),\"BLANK\",'Step 3-Refrigerators (B)'!D11)","v":0}]
[null,null,{"$f":"'Step 3-Refrigerators'!C12","v":"HFC-134a"},{"$f":"IF(ISBLANK('Step 3-Refrigerators (B)'!D12),\"BLANK\",'Step 3-Refrigerators (B)'!D12)","v":0}]
[null,null,"Other",{"$f":"IF(ISBLANK('Step 3-Refrigerators (B)'!D13),\"BLANK\",'Step 3-Refrigerators (B)'!D13)","v":0}]
[]
[null,null,"Units Processed with Refrigerant Recovery"]
[null,null,{"$f":"C45","v":"CFC-12"},{"$f":"IF(ISBLANK('Step 3-Refrigerators (B)'!E11),\"BLANK\",'Step 3-Refrigerators (B)'!E11)","v":0}]
[null,null,{"$f":"C46","v":"HFC-134a"},{"$f":"IF(ISBLANK('Step 3-Refrigerators (B)'!E12),\"BLANK\",'Step 3-Refrigerators (B)'!E12)","v":0}]
[null,null,{"$f":"C47","v":"Other"},{"$f":"IF(ISBLANK('Step 3-Refrigerators (B)'!E13),\"BLANK\",'Step 3-Refrigerators (B)'!E13)","v":0}]
[]
[null,null,{"$f":"'Step 3-Refrigerators'!D15","v":"Total Number of Units Processed "}]
[null,null,{"$f":"'Step 3-Refrigerators'!C16","v":"CFC-11 Blowing Agent"},{"$f":"IF(ISBLANK('Step 3-Refrigerators (B)'!D15),\"BLANK\",'Step 3-Refrigerators (B)'!D15)","v":0}]
[null,null,{"$f":"'Step 3-Refrigerators'!C17","v":"HCFC-141b Blowing Agent"},{"$f":"IF(ISBLANK('Step 3-Refrigerators (B)'!D16),\"BLANK\",'Step 3-Refrigerators (B)'!D16)","v":0}]
[null,null,{"$f":"'Step 3-Refrigerators'!C18","v":"HFC-134a Blowing Agent"},{"$f":"IF(ISBLANK('Step 3-Refrigerators (B)'!D17),\"BLANK\",'Step 3-Refrigerators (B)'!D17)","v":0}]
[null,null,{"$f":"'Step 3-Refrigerators'!C19","v":"HFC-245fa Blowing Agent"},{"$f":"IF(ISBLANK('Step 3-Refrigerators (B)'!D18),\"BLANK\",'Step 3-Refrigerators (B)'!D18)","v":0}]
[null,null,{"$f":"'Step 3-Refrigerators'!C20","v":"Cyclopentane Blowing Agent"},{"$f":"IF(ISBLANK('Step 3-Refrigerators (B)'!D19),\"BLANK\",'Step 3-Refrigerators (B)'!D19)","v":0}]
[null,null,{"$f":"'Step 3-Refrigerators'!C21","v":"Fiberglass"},{"$f":"IF(ISBLANK('Step 3-Refrigerators (B)'!D20),\"BLANK\",'Step 3-Refrigerators (B)'!D20)","v":0}]
[null,null,"Other",{"$f":"IF(ISBLANK('Step 3-Refrigerators (B)'!D21),\"BLANK\",'Step 3-Refrigerators (B)'!D21)","v":0}]
[]
[null,null,{"$f":"'Step 3-Refrigerators'!E15","v":"Number of Units Processed with Foam Recovery"}]
[null,null,{"$f":"C55","v":"CFC-11 Blowing Agent"},{"$f":"IF(ISBLANK('Step 3-Refrigerators (B)'!E15),\"BLANK\",'Step 3-Refrigerators (B)'!E15)","v":0}]
[null,null,"HCFC-141b Blowing Agent",{"$f":"IF(ISBLANK('Step 3-Refrigerators (B)'!E16),\"BLANK\",'Step 3-Refrigerators (B)'!E16)","v":0}]
[null,null,"HFC-134a Blowing Agent",{"$f":"IF(ISBLANK('Step 3-Refrigerators (B)'!E17),\"BLANK\",'Step 3-Refrigerators (B)'!E17)","v":0}]
[null,null,"HFC-245fa Blowing Agent",{"$f":"IF(ISBLANK('Step 3-Refrigerators (B)'!E18),\"BLANK\",'Step 3-Refrigerators (B)'!E18)","v":0}]
[null,null,"Cyclopentane Blowing Agent",{"$f":"IF(ISBLANK('Step 3-Refrigerators (B)'!E19),\"BLANK\",'Step 3-Refrigerators (B)'!E19)","v":0}]
[null,null,"Fiberglass",{"$f":"IF(ISBLANK('Step 3-Refrigerators (B)'!E20),\"BLANK\",'Step 3-Refrigerators (B)'!E20)","v":0}]
[null,null,"Other",{"$f":"IF(ISBLANK('Step 3-Refrigerators (B)'!E21),\"BLANK\",'Step 3-Refrigerators (B)'!E21)","v":0}]
[]
[null,null,{"$f":"'Step 3-Refrigerators'!F15","v":"Was Foam Recovered From Appliance Doors?"}]
[null,null,{"$f":"C55","v":"CFC-11 Blowing Agent"},{"$f":"IF(ISBLANK('Step 3-Refrigerators (B)'!F15),\"BLANK\",'Step 3-Refrigerators (B)'!F15)","v":0}]
[null,null,"HCFC-141b Blowing Agent",{"$f":"IF(ISBLANK('Step 3-Refrigerators (B)'!F16),\"BLANK\",'Step 3-Refrigerators (B)'!F16)","v":0}]
[null,null,"HFC-134a Blowing Agent",{"$f":"IF(ISBLANK('Step 3-Refrigerators (B)'!F17),\"BLANK\",'Step 3-Refrigerators (B)'!F17)","v":0}]
[null,null,"HFC-245fa Blowing Agent",{"$f":"IF(ISBLANK('Step 3-Refrigerators (B)'!F18),\"BLANK\",'Step 3-Refrigerators (B)'!F18)","v":0}]
[null,null,"Cyclopentane Blowing Agent"]
[null,null,"Fiberglass"]
[null,null,{"$f":"C61","v":"Other"}]
[]
[null,"Refrigerant (including that recovered from compressor oil)","CFC-12 "]
[null,null,"Reclaimed",{"$f":"IF(ISBLANK('Step 3-Refrigerators (B)'!F29),\"BLANK\",'Step 3-Refrigerators (B)'!F29)","v":""}]
[null,null,"Stockpiling with Intent to Reclaim",{"$f":"IF(ISBLANK('Step 3-Refrigerators (B)'!F30),\"BLANK\",'Step 3-Refrigerators (B)'!F30)","v":""}]
[null,null,"Destroyed",{"$f":"IF(ISBLANK('Step 3-Refrigerators (B)'!F31),\"BLANK\",'Step 3-Refrigerators (B)'!F31)","v":""}]
[null,null,"Stockpiling with Intent to Destroy",{"$f":"IF(ISBLANK('Step 3-Refrigerators (B)'!F32),\"BLANK\",'Step 3-Refrigerators (B)'!F32)","v":""}]
[null,null,"HFC-134a "]
[null,null,"Reclaimed",{"$f":"IF(ISBLANK('Step 3-Refrigerators (B)'!F34),\"BLANK\",'Step 3-Refrigerators (B)'!F34)","v":""}]
[null,null,"Stockpiling with Intent to Reclaim",{"$f":"IF(ISBLANK('Step 3-Refrigerators (B)'!F35),\"BLANK\",'Step 3-Refrigerators (B)'!F35)","v":""}]
[null,null,"Destroyed",{"$f":"IF(ISBLANK('Step 3-Refrigerators (B)'!F36),\"BLANK\",'Step 3-Refrigerators (B)'!F36)","v":""}]
[null,null,"Stockpiling with Intent to Destroy",{"$f":"IF(ISBLANK('Step 3-Refrigerators (B)'!F37),\"BLANK\",'Step 3-Refrigerators (B)'!F37)","v":""}]
[null,"Foam Blowing Agent","CFC-11"]
[null,null,"Reclaimed",{"$f":"IF(ISBLANK('Step 3-Refrigerators (B)'!F39),\"BLANK\",'Step 3-Refrigerators (B)'!F39)","v":""}]
[null,null,"Stockpiling with Intent to Reclaim",{"$f":"IF(ISBLANK('Step 3-Refrigerators (B)'!F40),\"BLANK\",'Step 3-Refrigerators (B)'!F40)","v":""}]
[null,null,"Destroyed",{"$f":"IF(ISBLANK('Step 3-Refrigerators (B)'!F41),\"BLANK\",'Step 3-Refrigerators (B)'!F41)","v":""}]
[null,null,"Stockpiling with Intent to Destroy",{"$f":"IF(ISBLANK('Step 3-Refrigerators (B)'!F42),\"BLANK\",'Step 3-Refrigerators (B)'!F42)","v":""}]
[null,null,"HCFC-141b"]
[null,null,"Reclaimed",{"$f":"IF(ISBLANK('Step 3-Refrigerators (B)'!F44),\"BLANK\",'Step 3-Refrigerators (B)'!F44)","v":""}]
[null,null,"Stockpiling with Intent to Reclaim",{"$f":"IF(ISBLANK('Step 3-Refrigerators (B)'!F45),\"BLANK\",'Step 3-Refrigerators (B)'!F45)","v":""}]
[null,null,"Destroyed",{"$f":"IF(ISBLANK('Step 3-Refrigerators (B)'!F46),\"BLANK\",'Step 3-Refrigerators (B)'!F46)","v":""}]
[null,null,"Stockpiling with Intent to Destroy",{"$f":"IF(ISBLANK('Step 3-Refrigerators (B)'!F47),\"BLANK\",'Step 3-Refrigerators (B)'!F47)","v":""}]
[null,null,"HFC-134a"]
[null,null,"Reclaimed",{"$f":"IF(ISBLANK('Step 3-Refrigerators (B)'!F49),\"BLANK\",'Step 3-Refrigerators (B)'!F49)","v":""}]
[null,null,"Stockpiling with Intent to Reclaim",{"$f":"IF(ISBLANK('Step 3-Refrigerators (B)'!F50),\"BLANK\",'Step 3-Refrigerators (B)'!F50)","v":""}]
[null,null,"Destroyed",{"$f":"IF(ISBLANK('Step 3-Refrigerators (B)'!F51),\"BLANK\",'Step 3-Refrigerators (B)'!F51)","v":""}]
[null,null,"Stockpiling with Intent to Destroy",{"$f":"IF(ISBLANK('Step 3-Refrigerators (B)'!F52),\"BLANK\",'Step 3-Refrigerators (B)'!F52)","v":""}]
[null,null,"HFC-245fa"]
[null,null,"Reclaimed",{"$f":"IF(ISBLANK('Step 3-Refrigerators (B)'!F54),\"BLANK\",'Step 3-Refrigerators (B)'!F54)","v":""}]
[null,null,"Stockpiling with Intent to Reclaim",{"$f":"IF(ISBLANK('Step 3-Refrigerators (B)'!F55),\"BLANK\",'Step 3-Refrigerators (B)'!F55)","v":""}]
[null,null,"Destroyed",{"$f":"IF(ISBLANK('Step 3-Refrigerators (B)'!F56),\"BLANK\",'Step 3-Refrigerators (B)'!F56)","v":""}]
[null,null,"Stockpiling with Intent to Destroy",{"$f":"IF(ISBLANK('Step 3-Refrigerators (B)'!F57),\"BLANK\",'Step 3-Refrigerators (B)'!F57)","v":""}]
[null,"Used Oil","Recycled",{"$f":"IF(ISBLANK('Step 3-Refrigerators (B)'!F58),\"BLANK\",'Step 3-Refrigerators (B)'!F58)","v":""}]
[null,null,"Disposed",{"$f":"IF(ISBLANK('Step 3-Refrigerators (B)'!F59),\"BLANK\",'Step 3-Refrigerators (B)'!F59)","v":""}]
[null,"Metal","Ferrous Metal Recycled",{"$f":"IF(ISBLANK('Step 3-Refrigerators (B)'!F60),\"BLANK\",'Step 3-Refrigerators (B)'!F60)","v":""}]
[null,null,"Non-Ferrous Metal Recycled",{"$f":"IF(ISBLANK('Step 3-Refrigerators (B)'!F61),\"BLANK\",'Step 3-Refrigerators (B)'!F61)","v":""}]
[null,"Plastic","Recycled",{"$f":"IF(ISBLANK('Step 3-Refrigerators (B)'!F62),\"BLANK\",'Step 3-Refrigerators (B)'!F62)","v":""}]
[null,"Glass","Recycled",{"$f":"IF(ISBLANK('Step 3-Refrigerators (B)'!F63),\"BLANK\",'Step 3-Refrigerators (B)'!F63)","v":""}]
[null,"Capacitors","Destroyed",{"$f":"IF(ISBLANK('Step 3-Refrigerators (B)'!F64),\"BLANK\",'Step 3-Refrigerators (B)'!F64)","v":""}]
[]
[null,"Actual Measurement or Assumptions"]
[null,null,{"$f":"'Step 3-Refrigerators (B)'!C10","v":"Number of Units Processed Containing the Following Refrigerants"}]
[null,null,{"$f":"'Step 3-Refrigerators (B)'!C11","v":"CFC-12"},{"$f":"IF(ISBLANK('Step 3-Refrigerators (B)'!F11),\"BLANK\",'Step 3-Refrigerators (B)'!F11)","v":0}]
[null,null,{"$f":"'Step 3-Refrigerators (B)'!C12","v":"HFC-134a"},{"$f":"IF(ISBLANK('Step 3-Refrigerators (B)'!F12),\"BLANK\",'Step 3-Refrigerators (B)'!F12)","v":0}]
[null,null,{"$f":"'Step 3-Refrigerators (B)'!C13","v":"Other"},{"$f":"IF(ISBLANK('Step 3-Refrigerators (B)'!F13),\"BLANK\",'Step 3-Refrigerators (B)'!F13)","v":0}]
[null,null,"Comments:",{"$f":"IF(ISBLANK('Step 3-Refrigerators (B)'!G11),\"\",'Step 3-Refrigerators (B)'!G11)","v":0}]
[null,null,{"$f":"'Step 3-Refrigerators (B)'!C14","v":"Number of Units Processed Containing the Following Insulating Materials"}]
[null,null,{"$f":"'Step 3-Refrigerators (B)'!C15","v":"CFC-11 Blowing Agent"},{"$f":"IF(ISBLANK('Step 3-Refrigerators (B)'!G15),\"BLANK\",'Step 3-Refrigerators (B)'!G15)","v":0}]
[null,null,{"$f":"'Step 3-Refrigerators (B)'!C16","v":"HCFC-141b Blowing Agent"},{"$f":"IF(ISBLANK('Step 3-Refrigerators (B)'!G16),\"BLANK\",'Step 3-Refrigerators (B)'!G16)","v":0}]
[null,null,{"$f":"'Step 3-Refrigerators (B)'!C17","v":"HFC-134a Blowing Agent"},{"$f":"IF(ISBLANK('Step 3-Refrigerators (B)'!G17),\"BLANK\",'Step 3-Refrigerators (B)'!G17)","v":0}]
[null,null,{"$f":"'Step 3-Refrigerators (B)'!C18","v":"HFC-245fa Blowing Agent"},{"$f":"IF(ISBLANK('Step 3-Refrigerators (B)'!G18),\"BLANK\",'Step 3-Refrigerators (B)'!G18)","v":0}]
[null,null,{"$f":"'Step 3-Refrigerators (B)'!C19","v":"Cyclopentane  Blowing Agent"},{"$f":"IF(ISBLANK('Step 3-Refrigerators (B)'!G19),\"BLANK\",'Step 3-Refrigerators (B)'!G19)","v":0}]
[null,null,{"$f":"'Step 3-Refrigerators (B)'!C20","v":"Fiberglass"},{"$f":"IF(ISBLANK('Step 3-Refrigerators (B)'!G20),\"BLANK\",'Step 3-Refrigerators (B)'!G20)","v":0}]
[null,null,{"$f":"'Step 3-Refrigerators (B)'!C21","v":"Other"},{"$f":"IF(ISBLANK('Step 3-Refrigerators (B)'!G21),\"BLANK\",'Step 3-Refrigerators (B)'!G21)","v":0}]
[null,null,"Comments:",{"$f":"IF(ISBLANK('Step 3-Refrigerators (B)'!H15),\"\",'Step 3-Refrigerators (B)'!H15)","v":0}]
[]
[null,"Refrigerant (including that recovered from compressor oil)","CFC-12 "]
[null,null,"Reclaimed",{"$f":"IF(ISBLANK('Step 3-Refrigerators (B)'!H29),\"BLANK\",'Step 3-Refrigerators (B)'!H29)","v":""}]
[null,null,"Stockpiling with Intent to Reclaim",{"$f":"IF(ISBLANK('Step 3-Refrigerators (B)'!H30),\"BLANK\",'Step 3-Refrigerators (B)'!H30)","v":""}]
[null,null,"Destroyed",{"$f":"IF(ISBLANK('Step 3-Refrigerators (B)'!H31),\"BLANK\",'Step 3-Refrigerators (B)'!H31)","v":""}]
[null,null,"Stockpiling with Intent to Destroy",{"$f":"IF(ISBLANK('Step 3-Refrigerators (B)'!H32),\"BLANK\",'Step 3-Refrigerators (B)'!H32)","v":""}]
[null,null,"HFC-134a "]
[null,null,"Reclaimed",{"$f":"IF(ISBLANK('Step 3-Refrigerators (B)'!H34),\"BLANK\",'Step 3-Refrigerators (B)'!H34)","v":""}]
[null,null,"Stockpiling with Intent to Reclaim",{"$f":"IF(ISBLANK('Step 3-Refrigerators (B)'!H35),\"BLANK\",'Step 3-Refrigerators (B)'!H35)","v":""}]
[null,null,"Destroyed",{"$f":"IF(ISBLANK('Step 3-Refrigerators (B)'!H36),\"BLANK\",'Step 3-Refrigerators (B)'!H36)","v":""}]
[null,null,"Stockpiling with Intent to Destroy",{"$f":"IF(ISBLANK('Step 3-Refrigerators (B)'!H37),\"BLANK\",'Step 3-Refrigerators (B)'!H37)","v":""}]
[null,"Foam Blowing Agent","CFC-11"]
[null,null,"Reclaimed",{"$f":"IF(ISBLANK('Step 3-Refrigerators (B)'!H39),\"BLANK\",'Step 3-Refrigerators (B)'!H39)","v":""}]
[null,null,"Stockpiling with Intent to Reclaim",{"$f":"IF(ISBLANK('Step 3-Refrigerators (B)'!H40),\"BLANK\",'Step 3-Refrigerators (B)'!H40)","v":""}]
[null,null,"Destroyed",{"$f":"IF(ISBLANK('Step 3-Refrigerators (B)'!H41),\"BLANK\",'Step 3-Refrigerators (B)'!H41)","v":""}]
[null,null,"Stockpiling with Intent to Destroy",{"$f":"IF(ISBLANK('Step 3-Refrigerators (B)'!H42),\"BLANK\",'Step 3-Refrigerators (B)'!H42)","v":""}]
[null,null,"HCFC-141b"]
[null,null,"Reclaimed",{"$f":"IF(ISBLANK('Step 3-Refrigerators (B)'!H44),\"BLANK\",'Step 3-Refrigerators (B)'!H44)","v":""}]
[null,null,"Stockpiling with Intent to Reclaim",{"$f":"IF(ISBLANK('Step 3-Refrigerators (B)'!H45),\"BLANK\",'Step 3-Refrigerators (B)'!H45)","v":""}]
[null,null,"Destroyed",{"$f":"IF(ISBLANK('Step 3-Refrigerators (B)'!H46),\"BLANK\",'Step 3-Refrigerators (B)'!H46)","v":""}]
[null,null,"Stockpiling with Intent to Destroy",{"$f":"IF(ISBLANK('Step 3-Refrigerators (B)'!H47),\"BLANK\",'Step 3-Refrigerators (B)'!H47)","v":""}]
[null,null,"HFC-134a"]
[null,null,"Reclaimed",{"$f":"IF(ISBLANK('Step 3-Refrigerators (B)'!H49),\"BLANK\",'Step 3-Refrigerators (B)'!H49)","v":""}]
[null,null,"Stockpiling with Intent to Reclaim",{"$f":"IF(ISBLANK('Step 3-Refrigerators (B)'!H50),\"BLANK\",'Step 3-Refrigerators (B)'!H50)","v":""}]
[null,null,"Destroyed",{"$f":"IF(ISBLANK('Step 3-Refrigerators (B)'!H51),\"BLANK\",'Step 3-Refrigerators (B)'!H51)","v":""}]
[null,null,"Stockpiling with Intent to Destroy",{"$f":"IF(ISBLANK('Step 3-Refrigerators (B)'!H52),\"BLANK\",'Step 3-Refrigerators (B)'!H52)","v":""}]
[null,null,"HFC-245fa"]
[null,null,"Reclaimed",{"$f":"IF(ISBLANK('Step 3-Refrigerators (B)'!H54),\"BLANK\",'Step 3-Refrigerators (B)'!H54)","v":""}]
[null,null,"Stockpiling with Intent to Reclaim",{"$f":"IF(ISBLANK('Step 3-Refrigerators (B)'!H55),\"BLANK\",'Step 3-Refrigerators (B)'!H55)","v":""}]
[null,null,"Destroyed",{"$f":"IF(ISBLANK('Step 3-Refrigerators (B)'!H56),\"BLANK\",'Step 3-Refrigerators (B)'!H56)","v":""}]
[null,null,"Stockpiling with Intent to Destroy",{"$f":"IF(ISBLANK('Step 3-Refrigerators (B)'!H57),\"BLANK\",'Step 3-Refrigerators (B)'!H57)","v":""}]
[null,"Used Oil","Recycled",{"$f":"IF(ISBLANK('Step 3-Refrigerators (B)'!H58),\"BLANK\",'Step 3-Refrigerators (B)'!H58)","v":""}]
[null,null,"Disposed",{"$f":"IF(ISBLANK('Step 3-Refrigerators (B)'!H59),\"BLANK\",'Step 3-Refrigerators (B)'!H59)","v":""}]
[null,"Metal","Ferrous Metal Recycled",{"$f":"IF(ISBLANK('Step 3-Refrigerators (B)'!H60),\"BLANK\",'Step 3-Refrigerators (B)'!H60)","v":""}]
[null,null,"Non-Ferrous Metal Recycled",{"$f":"IF(ISBLANK('Step 3-Refrigerators (B)'!H61),\"BLANK\",'Step 3-Refrigerators (B)'!H61)","v":""}]
[null,"Plastic","Recycled",{"$f":"IF(ISBLANK('Step 3-Refrigerators (B)'!H62),\"BLANK\",'Step 3-Refrigerators (B)'!H62)","v":""}]
[null,"Glass","Recycled",{"$f":"IF(ISBLANK('Step 3-Refrigerators (B)'!H63),\"BLANK\",'Step 3-Refrigerators (B)'!H63)","v":""}]
[null,"Capacitors","Destroyed",{"$f":"IF(ISBLANK('Step 3-Refrigerators (B)'!H64),\"BLANK\",'Step 3-Refrigerators (B)'!H64)","v":""}]
[]
[null,null,{"$f":"'Step 3-Refrigerators'!C71","v":"Average Number of Remaining Years of Useful Life"},{"$f":"IF(ISBLANK('Step 3-Refrigerators (B)'!E69),\"BLANK\",'Step 3-Refrigerators (B)'!E69)","v":""}]
[null,null,{"$f":"'Step 3-Refrigerators'!C72","v":"Average Energy Consumed/Year/Unit (kWh)"},{"$f":"IF(ISBLANK('Step 3-Refrigerators (B)'!E70),\"BLANK\",'Step 3-Refrigerators (B)'!E70)","v":{"v":0,"d":"0.0"}}]
[null,null,{"$f":"'Step 3-Refrigerators'!C73","v":"Average Energy Cost for Residential Consumers ($/kWh)  \n[please provide the average cost during the current program period] "},{"$f":"IF(ISBLANK('Step 3-Refrigerators (B)'!E71),\"BLANK\",'Step 3-Refrigerators (B)'!E71)","v":{"v":0,"d":"$0.00"}}]
[]
[null,null,{"$f":"'Step 3-Refrigerators'!C75","v":"Additional Comments:"},{"$f":"IF(ISBLANK('Step 3-Refrigerators (B)'!D73),\"BLANK\",'Step 3-Refrigerators (B)'!D73)","v":{"v":0,"d":"$0.00"}}]
[]
[]
[]
[null,"Step 3 - Stand Alone Freezers (B)"]
[]
[null,null,"Units Processed"]
[null,null,{"$f":"'Step 3-Stand-Alone Freezers'!C8","v":"Total Number of Units Processed"},{"$f":"IF(ISBLANK('Step 3-Stand-Alone Freezers (B)'!D8),\"BLANK\",'Step 3-Stand-Alone Freezers (B)'!D8)","v":{"v":0,"d":"0.0"}}]
[null,null,{"$f":"'Step 3-Stand-Alone Freezers'!C9","v":"Average Age of Appliances Collected (yrs)"},{"$f":"IF(ISBLANK('Step 3-Stand-Alone Freezers (B)'!D9),\"BLANK\",'Step 3-Stand-Alone Freezers (B)'!D9)","v":{"v":0,"d":"0.0"}}]
[null,null,{"$f":"'Step 3-Stand-Alone Freezers'!C10","v":"Refrigerant Type"}]
[null,null,{"$f":"'Step 3-Stand-Alone Freezers'!C11","v":"CFC-12"},{"$f":"IF(ISBLANK('Step 3-Stand-Alone Freezers (B)'!D11),\"BLANK\",'Step 3-Stand-Alone Freezers (B)'!D11)","v":{"v":0,"d":"0.0"}}]
[null,null,{"$f":"'Step 3-Stand-Alone Freezers'!C12","v":"HCFC-22"},{"$f":"IF(ISBLANK('Step 3-Stand-Alone Freezers (B)'!D12),\"BLANK\",'Step 3-Stand-Alone Freezers (B)'!D12)","v":{"v":0,"d":"0.0"}}]
[null,null,{"$f":"'Step 3-Stand-Alone Freezers'!C13","v":"HFC-134a"},{"$f":"IF(ISBLANK('Step 3-Stand-Alone Freezers (B)'!D13),\"BLANK\",'Step 3-Stand-Alone Freezers (B)'!D13)","v":{"v":0,"d":"0.0"}}]
[null,null,"Other",{"$f":"IF(ISBLANK('Step 3-Stand-Alone Freezers (B)'!D14),\"BLANK\",'Step 3-Stand-Alone Freezers (B)'!D14)","v":{"v":0,"d":"0.0"}}]
[]
[null,null,"Units with Refrigerant Recovery"]
[null,null,{"$f":"C187","v":"CFC-12"},{"$f":"IF(ISBLANK('Step 3-Stand-Alone Freezers (B)'!E11),\"BLANK\",'Step 3-Stand-Alone Freezers (B)'!E11)","v":{"v":0,"d":"0.0"}}]
[null,null,{"$f":"C188","v":"HCFC-22"},{"$f":"IF(ISBLANK('Step 3-Stand-Alone Freezers (B)'!E12),\"BLANK\",'Step 3-Stand-Alone Freezers (B)'!E12)","v":{"v":0,"d":"0.0"}}]
[null,null,{"$f":"C189","v":"HFC-134a"},{"$f":"IF(ISBLANK('Step 3-Stand-Alone Freezers (B)'!E13),\"BLANK\",'Step 3-Stand-Alone Freezers (B)'!E13)","v":{"v":0,"d":"0.0"}}]
[null,null,{"$f":"C190","v":"Other"},{"$f":"IF(ISBLANK('Step 3-Stand-Alone Freezers (B)'!E14),\"BLANK\",'Step 3-Stand-Alone Freezers (B)'!E14)","v":{"v":0,"d":"0.0"}}]
[]
[null,null,{"$f":"'Step 3-Stand-Alone Freezers'!C16","v":"Insulating Material Type"}]
[null,null,{"$f":"'Step 3-Stand-Alone Freezers'!C17","v":"CFC-11 Blowing Agent"},{"$f":"IF(ISBLANK('Step 3-Stand-Alone Freezers (B)'!D16),\"BLANK\",'Step 3-Stand-Alone Freezers (B)'!D16)","v":{"v":0,"d":"0.0"}}]
[null,null,{"$f":"'Step 3-Stand-Alone Freezers'!C18","v":"HCFC-141b Blowing Agent"},{"$f":"IF(ISBLANK('Step 3-Stand-Alone Freezers (B)'!D17),\"BLANK\",'Step 3-Stand-Alone Freezers (B)'!D17)","v":{"v":0,"d":"0.0"}}]
[null,null,{"$f":"'Step 3-Stand-Alone Freezers'!C19","v":"HFC-134a Blowing Agent"},{"$f":"IF(ISBLANK('Step 3-Stand-Alone Freezers (B)'!D18),\"BLANK\",'Step 3-Stand-Alone Freezers (B)'!D18)","v":{"v":0,"d":"0.0"}}]
[null,null,{"$f":"'Step 3-Stand-Alone Freezers'!C20","v":"HFC-245fa Blowing Agent"},{"$f":"IF(ISBLANK('Step 3-Stand-Alone Freezers (B)'!D19),\"BLANK\",'Step 3-Stand-Alone Freezers (B)'!D19)","v":{"v":0,"d":"0.0"}}]
[null,null,{"$f":"'Step 3-Stand-Alone Freezers'!C21","v":"Cyclopentane  Blowing Agent"},{"$f":"IF(ISBLANK('Step 3-Stand-Alone Freezers (B)'!D20),\"BLANK\",'Step 3-Stand-Alone Freezers (B)'!D20)","v":{"v":0,"d":"0.0"}}]
[null,null,{"$f":"'Step 3-Stand-Alone Freezers'!C22","v":"Fiberglass"},{"$f":"IF(ISBLANK('Step 3-Stand-Alone Freezers (B)'!D21),\"BLANK\",'Step 3-Stand-Alone Freezers (B)'!D21)","v":{"v":0,"d":"0.0"}}]
[null,null,"Other",{"$f":"IF(ISBLANK('Step 3-Stand-Alone Freezers (B)'!D22),\"BLANK\",'Step 3-Stand-Alone Freezers (B)'!D22)","v":{"v":0,"d":"0.0"}}]
[]
[null,null,"Number of Units Processed with Foam Recovery"]
[null,null,{"$f":"C198","v":"Insulating Material Type"}]
[null,null,"CFC-11 Blowing Agent",{"$f":"IF(ISBLANK('Step 3-Stand-Alone Freezers (B)'!E16),\"BLANK\",'Step 3-Stand-Alone Freezers (B)'!E16)","v":{"v":0,"d":"0.0"}}]
[null,null,"HCFC-141b Blowing Agent",{"$f":"IF(ISBLANK('Step 3-Stand-Alone Freezers (B)'!E17),\"BLANK\",'Step 3-Stand-Alone Freezers (B)'!E17)","v":{"v":0,"d":"0.0"}}]
[null,null,"HFC-134a Blowing Agent",{"$f":"IF(ISBLANK('Step 3-Stand-Alone Freezers (B)'!E18),\"BLANK\",'Step 3-Stand-Alone Freezers (B)'!E18)","v":{"v":0,"d":"0.0"}}]
[null,null,"HFC-245fa Blowing Agent",{"$f":"IF(ISBLANK('Step 3-Stand-Alone Freezers (B)'!E19),\"BLANK\",'Step 3-Stand-Alone Freezers (B)'!E19)","v":{"v":0,"d":"0.0"}}]
[null,null,"Cyclopentane  Blowing Agent",{"$f":"IF(ISBLANK('Step 3-Stand-Alone Freezers (B)'!E20),\"BLANK\",'Step 3-Stand-Alone Freezers (B)'!E20)","v":{"v":0,"d":"0.0"}}]
[null,null,"Fiberglass",{"$f":"IF(ISBLANK('Step 3-Stand-Alone Freezers (B)'!E21),\"BLANK\",'Step 3-Stand-Alone Freezers (B)'!E21)","v":{"v":0,"d":"0.0"}}]
[null,null,"Other",{"$f":"IF(ISBLANK('Step 3-Stand-Alone Freezers (B)'!E22),\"BLANK\",'Step 3-Stand-Alone Freezers (B)'!E22)","v":{"v":0,"d":"0.0"}}]
[null,null,{"$f":"'Step 3-Stand-Alone Freezers'!F16","v":"Was Foam Recovered From Appliance Doors?"}]
[null,null,{"$f":"C208","v":"Insulating Material Type"}]
[null,null,{"$f":"C209","v":"CFC-11 Blowing Agent"},{"$f":"IF(ISBLANK('Step 3-Stand-Alone Freezers (B)'!F16),\"BLANK\",'Step 3-Stand-Alone Freezers (B)'!F16)","v":{"v":0,"d":"0.0"}}]
[null,null,"HCFC-141b Blowing Agent",{"$f":"IF(ISBLANK('Step 3-Stand-Alone Freezers (B)'!F17),\"BLANK\",'Step 3-Stand-Alone Freezers (B)'!F17)","v":{"v":0,"d":"0.0"}}]
[null,null,"HFC-134a Blowing Agent",{"$f":"IF(ISBLANK('Step 3-Stand-Alone Freezers (B)'!F18),\"BLANK\",'Step 3-Stand-Alone Freezers (B)'!F18)","v":{"v":0,"d":"0.0"}}]
[null,null,"HFC-245fa Blowing Agent",{"$f":"IF(ISBLANK('Step 3-Stand-Alone Freezers (B)'!F19),\"BLANK\",'Step 3-Stand-Alone Freezers (B)'!F19)","v":{"v":0,"d":"0.0"}}]
[null,null,"Cyclopentane  Blowing Agent"]
[null,null,"Fiberglass"]
[null,null,"Other"]
[null,"Refrigerant (including that recovered from compressor oil)","CFC-12"]
[null,null,"Reclaimed",{"$f":"IF(ISBLANK('Step 3-Stand-Alone Freezers (B)'!F30),\"BLANK\",'Step 3-Stand-Alone Freezers (B)'!F30)","v":""}]
[null,null,"Stockpiling with Intent to Reclaim",{"$f":"IF(ISBLANK('Step 3-Stand-Alone Freezers (B)'!F31),\"BLANK\",'Step 3-Stand-Alone Freezers (B)'!F31)","v":""}]
[null,null,"Destroyed",{"$f":"IF(ISBLANK('Step 3-Stand-Alone Freezers (B)'!F32),\"BLANK\",'Step 3-Stand-Alone Freezers (B)'!F32)","v":""}]
[null,null,"Stockpiling with Intent to Destroy",{"$f":"IF(ISBLANK('Step 3-Stand-Alone Freezers (B)'!F33),\"BLANK\",'Step 3-Stand-Alone Freezers (B)'!F33)","v":""}]
[null,null,"HCFC-22"]
[null,null,"Reclaimed",{"$f":"IF(ISBLANK('Step 3-Stand-Alone Freezers (B)'!F35),\"BLANK\",'Step 3-Stand-Alone Freezers (B)'!F35)","v":""}]
[null,null,"Stockpiling with Intent to Reclaim",{"$f":"IF(ISBLANK('Step 3-Stand-Alone Freezers (B)'!F36),\"BLANK\",'Step 3-Stand-Alone Freezers (B)'!F36)","v":""}]
[null,null,"Destroyed",{"$f":"IF(ISBLANK('Step 3-Stand-Alone Freezers (B)'!F37),\"BLANK\",'Step 3-Stand-Alone Freezers (B)'!F37)","v":""}]
[null,null,"Stockpiling with Intent to Destroy",{"$f":"IF(ISBLANK('Step 3-Stand-Alone Freezers (B)'!F38),\"BLANK\",'Step 3-Stand-Alone Freezers (B)'!F38)","v":""}]
[null,null,"HFC-134a"]
[null,null,"Reclaimed",{"$f":"IF(ISBLANK('Step 3-Stand-Alone Freezers (B)'!F40),\"BLANK\",'Step 3-Stand-Alone Freezers (B)'!F40)","v":""}]
[null,null,"Stockpiling with Intent to Reclaim",{"$f":"IF(ISBLANK('Step 3-Stand-Alone Freezers (B)'!F41),\"BLANK\",'Step 3-Stand-Alone Freezers (B)'!F41)","v":""}]
[null,null,"Destroyed",{"$f":"IF(ISBLANK('Step 3-Stand-Alone Freezers (B)'!F42),\"BLANK\",'Step 3-Stand-Alone Freezers (B)'!F42)","v":""}]
[null,null,"Stockpiling with Intent to Destroy",{"$f":"IF(ISBLANK('Step 3-Stand-Alone Freezers (B)'!F43),\"BLANK\",'Step 3-Stand-Alone Freezers (B)'!F43)","v":""}]
[null,"Foam Blowing Agent","CFC-11"]
[null,null,"Reclaimed",{"$f":"IF(ISBLANK('Step 3-Stand-Alone Freezers (B)'!F45),\"BLANK\",'Step 3-Stand-Alone Freezers (B)'!F45)","v":""}]
[null,null,"Stockpiling with Intent to Reclaim",{"$f":"IF(ISBLANK('Step 3-Stand-Alone Freezers (B)'!F46),\"BLANK\",'Step 3-Stand-Alone Freezers (B)'!F46)","v":""}]
[null,null,"Destroyed",{"$f":"IF(ISBLANK('Step 3-Stand-Alone Freezers (B)'!F47),\"BLANK\",'Step 3-Stand-Alone Freezers (B)'!F47)","v":""}]
[null,null,"Stockpiling with Intent to Destroy",{"$f":"IF(ISBLANK('Step 3-Stand-Alone Freezers (B)'!F48),\"BLANK\",'Step 3-Stand-Alone Freezers (B)'!F48)","v":""}]
[null,null,"HCFC-141b"]
[null,null,"Reclaimed",{"$f":"IF(ISBLANK('Step 3-Stand-Alone Freezers (B)'!F50),\"BLANK\",'Step 3-Stand-Alone Freezers (B)'!F50)","v":""}]
[null,null,"Stockpiling with Intent to Reclaim",{"$f":"IF(ISBLANK('Step 3-Stand-Alone Freezers (B)'!F51),\"BLANK\",'Step 3-Stand-Alone Freezers (B)'!F51)","v":""}]
[null,null,"Destroyed",{"$f":"IF(ISBLANK('Step 3-Stand-Alone Freezers (B)'!F52),\"BLANK\",'Step 3-Stand-Alone Freezers (B)'!F52)","v":""}]
[null,null,"Stockpiling with Intent to Destroy",{"$f":"IF(ISBLANK('Step 3-Stand-Alone Freezers (B)'!F53),\"BLANK\",'Step 3-Stand-Alone Freezers (B)'!F53)","v":""}]
[null,null,"HFC-134a"]
[null,null,"Reclaimed",{"$f":"IF(ISBLANK('Step 3-Stand-Alone Freezers (B)'!F55),\"BLANK\",'Step 3-Stand-Alone Freezers (B)'!F55)","v":""}]
[null,null,"Stockpiling with Intent to Reclaim",{"$f":"IF(ISBLANK('Step 3-Stand-Alone Freezers (B)'!F56),\"BLANK\",'Step 3-Stand-Alone Freezers (B)'!F56)","v":""}]
[null,null,"Destroyed",{"$f":"IF(ISBLANK('Step 3-Stand-Alone Freezers (B)'!F57),\"BLANK\",'Step 3-Stand-Alone Freezers (B)'!F57)","v":""}]
[null,null,"Stockpiling with Intent to Destroy",{"$f":"IF(ISBLANK('Step 3-Stand-Alone Freezers (B)'!F58),\"BLANK\",'Step 3-Stand-Alone Freezers (B)'!F58)","v":""}]
[null,null,"HFC-245fa"]
[null,null,"Reclaimed",{"$f":"IF(ISBLANK('Step 3-Stand-Alone Freezers (B)'!F60),\"BLANK\",'Step 3-Stand-Alone Freezers (B)'!F60)","v":""}]
[null,null,"Stockpiling with Intent to Reclaim",{"$f":"IF(ISBLANK('Step 3-Stand-Alone Freezers (B)'!F61),\"BLANK\",'Step 3-Stand-Alone Freezers (B)'!F61)","v":""}]
[null,null,"Destroyed",{"$f":"IF(ISBLANK('Step 3-Stand-Alone Freezers (B)'!F62),\"BLANK\",'Step 3-Stand-Alone Freezers (B)'!F62)","v":""}]
[null,null,"Stockpiling with Intent to Destroy",{"$f":"IF(ISBLANK('Step 3-Stand-Alone Freezers (B)'!F63),\"BLANK\",'Step 3-Stand-Alone Freezers (B)'!F63)","v":""}]
[null,"Used Oil","Recycled",{"$f":"IF(ISBLANK('Step 3-Stand-Alone Freezers (B)'!F64),\"BLANK\",'Step 3-Stand-Alone Freezers (B)'!F64)","v":""}]
[null,null,"Disposed",{"$f":"IF(ISBLANK('Step 3-Stand-Alone Freezers (B)'!F65),\"BLANK\",'Step 3-Stand-Alone Freezers (B)'!F65)","v":""}]
[null,"Metal","Ferrous Metal Recycled",{"$f":"IF(ISBLANK('Step 3-Stand-Alone Freezers (B)'!F66),\"BLANK\",'Step 3-Stand-Alone Freezers (B)'!F66)","v":""}]
[null,null,"Non-Ferrous Metal Recycled",{"$f":"IF(ISBLANK('Step 3-Stand-Alone Freezers (B)'!F67),\"BLANK\",'Step 3-Stand-Alone Freezers (B)'!F67)","v":""}]
[null,"Plastic","Recycled",{"$f":"IF(ISBLANK('Step 3-Stand-Alone Freezers (B)'!F68),\"BLANK\",'Step 3-Stand-Alone Freezers (B)'!F68)","v":""}]
[null,"Capacitors","Destroyed",{"$f":"IF(ISBLANK('Step 3-Stand-Alone Freezers (B)'!F69),\"BLANK\",'Step 3-Stand-Alone Freezers (B)'!F69)","v":""}]
[null,"Mercury-Containing Components","Recycled",{"$f":"IF(ISBLANK('Step 3-Stand-Alone Freezers (B)'!F70),\"BLANK\",'Step 3-Stand-Alone Freezers (B)'!F70)","v":""}]
[null,null,"Disposed",{"$f":"IF(ISBLANK('Step 3-Stand-Alone Freezers (B)'!F71),\"BLANK\",'Step 3-Stand-Alone Freezers (B)'!F71)","v":""}]
[]
[null,"Actual Measurement or Assumptions"]
[null,null,{"$f":"'Step 3-Stand-Alone Freezers (B)'!C10","v":"Refrigerant Type"}]
[null,null,{"$f":"'Step 3-Stand-Alone Freezers (B)'!C11","v":"CFC-12"},{"$f":"IF(ISBLANK('Step 3-Stand-Alone Freezers (B)'!F11),\"BLANK\",'Step 3-Stand-Alone Freezers (B)'!F11)","v":{"v":0,"d":"0.0"}}]
[null,null,{"$f":"'Step 3-Stand-Alone Freezers (B)'!C12","v":"HCFC-22"},{"$f":"IF(ISBLANK('Step 3-Stand-Alone Freezers (B)'!F12),\"BLANK\",'Step 3-Stand-Alone Freezers (B)'!F12)","v":{"v":0,"d":"0.0"}}]
[null,null,{"$f":"'Step 3-Stand-Alone Freezers (B)'!C13","v":"HFC-134a"},{"$f":"IF(ISBLANK('Step 3-Stand-Alone Freezers (B)'!F13),\"BLANK\",'Step 3-Stand-Alone Freezers (B)'!F13)","v":{"v":0,"d":"0.0"}}]
[null,null,{"$f":"'Step 3-Stand-Alone Freezers (B)'!C14","v":"Other"},{"$f":"IF(ISBLANK('Step 3-Stand-Alone Freezers (B)'!F14),\"BLANK\",'Step 3-Stand-Alone Freezers (B)'!F14)","v":{"v":0,"d":"0.0"}}]
[null,null,"Comments:",{"$f":"IF(ISBLANK('Step 3-Stand-Alone Freezers (B)'!G11),\"BLANK\",('Step 3-Stand-Alone Freezers (B)'!G11))","v":{"v":0,"d":"0.0"}}]
[null,null,{"$f":"'Step 3-Stand-Alone Freezers (B)'!C15","v":"Insulating MaterialType"}]
[null,null,{"$f":"'Step 3-Stand-Alone Freezers (B)'!C16","v":"CFC-11 Blowing Agent"},{"$f":"IF(ISBLANK('Step 3-Stand-Alone Freezers (B)'!G16),\"BLANK\",'Step 3-Stand-Alone Freezers (B)'!G16)","v":{"v":0,"d":"0.0"}}]
[null,null,{"$f":"'Step 3-Stand-Alone Freezers (B)'!C17","v":"HCFC-141b Blowing Agent"},{"$f":"IF(ISBLANK('Step 3-Stand-Alone Freezers (B)'!G17),\"BLANK\",'Step 3-Stand-Alone Freezers (B)'!G17)","v":{"v":0,"d":"0.0"}}]
[null,null,{"$f":"'Step 3-Stand-Alone Freezers (B)'!C18","v":"HFC-134a Blowing Agent"},{"$f":"IF(ISBLANK('Step 3-Stand-Alone Freezers (B)'!G18),\"BLANK\",'Step 3-Stand-Alone Freezers (B)'!G18)","v":{"v":0,"d":"0.0"}}]
[null,null,{"$f":"'Step 3-Stand-Alone Freezers (B)'!C19","v":"HFC-245fa Blowing Agent"},{"$f":"IF(ISBLANK('Step 3-Stand-Alone Freezers (B)'!G19),\"BLANK\",'Step 3-Stand-Alone Freezers (B)'!G19)","v":{"v":0,"d":"0.0"}}]
[null,null,{"$f":"'Step 3-Stand-Alone Freezers (B)'!C20","v":"Cyclopentane  Blowing Agent"},{"$f":"IF(ISBLANK('Step 3-Stand-Alone Freezers (B)'!G20),\"BLANK\",'Step 3-Stand-Alone Freezers (B)'!G20)","v":{"v":0,"d":"0.0"}}]
[null,null,{"$f":"'Step 3-Stand-Alone Freezers (B)'!C21","v":"Fiberglass"},{"$f":"IF(ISBLANK('Step 3-Stand-Alone Freezers (B)'!G21),\"BLANK\",'Step 3-Stand-Alone Freezers (B)'!G21)","v":{"v":0,"d":"0.0"}}]
[null,null,{"$f":"'Step 3-Stand-Alone Freezers (B)'!C22","v":"Other"},{"$f":"IF(ISBLANK('Step 3-Stand-Alone Freezers (B)'!G22),\"BLANK\",'Step 3-Stand-Alone Freezers (B)'!G22)","v":{"v":0,"d":"0.0"}}]
[null,null,"Comments:",{"$f":"IF(ISBLANK('Step 3-Stand-Alone Freezers (B)'!H16),\"BLANK\",('Step 3-Stand-Alone Freezers (B)'!H16))","v":{"v":0,"d":"0.0"}}]
[]
[null,"Refrigerant (including that recovered from compressor oil)",{"$f":"'Step 3-Stand-Alone Freezers (B)'!D29","v":"CFC-12"}]
[null,null,{"$f":"'Step 3-Stand-Alone Freezers (B)'!D30","v":"Reclaimed"},{"$f":"IF(ISBLANK('Step 3-Stand-Alone Freezers (B)'!H30),\"BLANK\",'Step 3-Stand-Alone Freezers (B)'!H30)","v":""}]
[null,null,"Stockpiling with Intent to Reclaim",{"$f":"IF(ISBLANK('Step 3-Stand-Alone Freezers (B)'!H31),\"BLANK\",'Step 3-Stand-Alone Freezers (B)'!H31)","v":""}]
[null,null,{"$f":"'Step 3-Stand-Alone Freezers (B)'!D32","v":"Destroyed"},{"$f":"IF(ISBLANK('Step 3-Stand-Alone Freezers (B)'!H32),\"BLANK\",'Step 3-Stand-Alone Freezers (B)'!H32)","v":""}]
[null,null,"Stockpiling with Intent to Destroy",{"$f":"IF(ISBLANK('Step 3-Stand-Alone Freezers (B)'!H33),\"BLANK\",'Step 3-Stand-Alone Freezers (B)'!H33)","v":""}]
[null,null,{"$f":"'Step 3-Stand-Alone Freezers (B)'!D34","v":"HCFC-22"}]
[null,null,{"$f":"'Step 3-Stand-Alone Freezers (B)'!D35","v":"Reclaimed"},{"$f":"IF(ISBLANK('Step 3-Stand-Alone Freezers (B)'!H35),\"BLANK\",'Step 3-Stand-Alone Freezers (B)'!H35)","v":""}]
[null,null,"Stockpiling with Intent to Reclaim",{"$f":"IF(ISBLANK('Step 3-Stand-Alone Freezers (B)'!H36),\"BLANK\",'Step 3-Stand-Alone Freezers (B)'!H36)","v":""}]
[null,null,{"$f":"'Step 3-Stand-Alone Freezers (B)'!D37","v":"Destroyed"},{"$f":"IF(ISBLANK('Step 3-Stand-Alone Freezers (B)'!H37),\"BLANK\",'Step 3-Stand-Alone Freezers (B)'!H37)","v":""}]
[null,null,"Stockpiling with Intent to Destroy",{"$f":"IF(ISBLANK('Step 3-Stand-Alone Freezers (B)'!H38),\"BLANK\",'Step 3-Stand-Alone Freezers (B)'!H38)","v":""}]
[null,null,{"$f":"'Step 3-Stand-Alone Freezers (B)'!D39","v":"HFC-134a"}]
[null,null,{"$f":"'Step 3-Stand-Alone Freezers (B)'!D40","v":"Reclaimed"},{"$f":"IF(ISBLANK('Step 3-Stand-Alone Freezers (B)'!H40),\"BLANK\",'Step 3-Stand-Alone Freezers (B)'!H40)","v":""}]
[null,null,"Stockpiling with Intent to Reclaim",{"$f":"IF(ISBLANK('Step 3-Stand-Alone Freezers (B)'!H41),\"BLANK\",'Step 3-Stand-Alone Freezers (B)'!H41)","v":""}]
[null,null,{"$f":"'Step 3-Stand-Alone Freezers (B)'!D42","v":"Destroyed"},{"$f":"IF(ISBLANK('Step 3-Stand-Alone Freezers (B)'!H42),\"BLANK\",'Step 3-Stand-Alone Freezers (B)'!H42)","v":""}]
[null,null,"Stockpiling with Intent to Destroy",{"$f":"IF(ISBLANK('Step 3-Stand-Alone Freezers (B)'!H43),\"BLANK\",'Step 3-Stand-Alone Freezers (B)'!H43)","v":""}]
[null,"Foam-Blowing Agent*",{"$f":"'Step 3-Stand-Alone Freezers (B)'!D44","v":"CFC-11"}]
[null,null,{"$f":"'Step 3-Stand-Alone Freezers (B)'!D45","v":"Reclaimed"},{"$f":"IF(ISBLANK('Step 3-Stand-Alone Freezers (B)'!H45),\"BLANK\",'Step 3-Stand-Alone Freezers (B)'!H45)","v":""}]
[null,null,"Stockpiling with Intent to Reclaim",{"$f":"IF(ISBLANK('Step 3-Stand-Alone Freezers (B)'!H46),\"BLANK\",'Step 3-Stand-Alone Freezers (B)'!H46)","v":""}]
[null,null,{"$f":"'Step 3-Stand-Alone Freezers (B)'!D47","v":"Destroyed"},{"$f":"IF(ISBLANK('Step 3-Stand-Alone Freezers (B)'!H47),\"BLANK\",'Step 3-Stand-Alone Freezers (B)'!H47)","v":""}]
[null,null,"Stockpiling with Intent to Destroy",{"$f":"IF(ISBLANK('Step 3-Stand-Alone Freezers (B)'!H48),\"BLANK\",'Step 3-Stand-Alone Freezers (B)'!H48)","v":""}]
[null,null,{"$f":"'Step 3-Stand-Alone Freezers (B)'!D49","v":"HCFC-141b"}]
[null,null,{"$f":"'Step 3-Stand-Alone Freezers (B)'!D50","v":"Reclaimed"},{"$f":"IF(ISBLANK('Step 3-Stand-Alone Freezers (B)'!H50),\"BLANK\",'Step 3-Stand-Alone Freezers (B)'!H50)","v":""}]
[null,null,"Stockpiling with Intent to Reclaim",{"$f":"IF(ISBLANK('Step 3-Stand-Alone Freezers (B)'!H51),\"BLANK\",'Step 3-Stand-Alone Freezers (B)'!H51)","v":""}]
[null,null,{"$f":"'Step 3-Stand-Alone Freezers (B)'!D52","v":"Destroyed"},{"$f":"IF(ISBLANK('Step 3-Stand-Alone Freezers (B)'!H52),\"BLANK\",'Step 3-Stand-Alone Freezers (B)'!H52)","v":""}]
[null,null,"Stockpiling with Intent to Destroy",{"$f":"IF(ISBLANK('Step 3-Stand-Alone Freezers (B)'!H53),\"BLANK\",'Step 3-Stand-Alone Freezers (B)'!H53)","v":""}]
[null,null,{"$f":"'Step 3-Stand-Alone Freezers (B)'!D54","v":"HFC-134a"}]
[null,null,{"$f":"'Step 3-Stand-Alone Freezers (B)'!D55","v":"Reclaimed"},{"$f":"IF(ISBLANK('Step 3-Stand-Alone Freezers (B)'!H55),\"BLANK\",'Step 3-Stand-Alone Freezers (B)'!H55)","v":""}]
[null,null,"Stockpiling with Intent to Reclaim",{"$f":"IF(ISBLANK('Step 3-Stand-Alone Freezers (B)'!H56),\"BLANK\",'Step 3-Stand-Alone Freezers (B)'!H56)","v":""}]
[null,null,{"$f":"'Step 3-Stand-Alone Freezers (B)'!D57","v":"Destroyed"},{"$f":"IF(ISBLANK('Step 3-Stand-Alone Freezers (B)'!H57),\"BLANK\",'Step 3-Stand-Alone Freezers (B)'!H57)","v":""}]
[null,null,"Stockpiling with Intent to Destroy",{"$f":"IF(ISBLANK('Step 3-Stand-Alone Freezers (B)'!H58),\"BLANK\",'Step 3-Stand-Alone Freezers (B)'!H58)","v":""}]
[null,null,{"$f":"'Step 3-Stand-Alone Freezers (B)'!D59","v":"HFC-245fa"}]
[null,null,{"$f":"'Step 3-Stand-Alone Freezers (B)'!D60","v":"Reclaimed"},{"$f":"IF(ISBLANK('Step 3-Stand-Alone Freezers (B)'!H60),\"BLANK\",'Step 3-Stand-Alone Freezers (B)'!H60)","v":""}]
[null,null,"Stockpiling with Intent to Reclaim",{"$f":"IF(ISBLANK('Step 3-Stand-Alone Freezers (B)'!H61),\"BLANK\",'Step 3-Stand-Alone Freezers (B)'!H61)","v":""}]
[null,null,{"$f":"'Step 3-Stand-Alone Freezers (B)'!D62","v":"Destroyed"},{"$f":"IF(ISBLANK('Step 3-Stand-Alone Freezers (B)'!H62),\"BLANK\",'Step 3-Stand-Alone Freezers (B)'!H62)","v":""}]
[null,null,"Stockpiling with Intent to Destroy",{"$f":"IF(ISBLANK('Step 3-Stand-Alone Freezers (B)'!H63),\"BLANK\",'Step 3-Stand-Alone Freezers (B)'!H63)","v":""}]
[null,"Used Oil",{"$f":"'Step 3-Stand-Alone Freezers (B)'!D64","v":"Recycled"},{"$f":"IF(ISBLANK('Step 3-Stand-Alone Freezers (B)'!H64),\"BLANK\",'Step 3-Stand-Alone Freezers (B)'!H64)","v":""}]
[null,null,{"$f":"'Step 3-Stand-Alone Freezers (B)'!D65","v":"Disposed"},{"$f":"IF(ISBLANK('Step 3-Stand-Alone Freezers (B)'!H65),\"BLANK\",'Step 3-Stand-Alone Freezers (B)'!H65)","v":""}]
[null,"Metal",{"$f":"'Step 3-Stand-Alone Freezers (B)'!D66","v":"Ferrous Metal Recycled"},{"$f":"IF(ISBLANK('Step 3-Stand-Alone Freezers (B)'!H66),\"BLANK\",'Step 3-Stand-Alone Freezers (B)'!H66)","v":""}]
[null,null,{"$f":"'Step 3-Stand-Alone Freezers (B)'!D67","v":"Non-Ferrous Metal Recycled"},{"$f":"IF(ISBLANK('Step 3-Stand-Alone Freezers (B)'!H67),\"BLANK\",'Step 3-Stand-Alone Freezers (B)'!H67)","v":""}]
[null,"Plastic",{"$f":"'Step 3-Stand-Alone Freezers (B)'!D68","v":"Recycled"},{"$f":"IF(ISBLANK('Step 3-Stand-Alone Freezers (B)'!H68),\"BLANK\",'Step 3-Stand-Alone Freezers (B)'!H68)","v":""}]
[null,"PCB-Containing Capacitors",{"$f":"'Step 3-Stand-Alone Freezers (B)'!D69","v":"Destroyed"},{"$f":"IF(ISBLANK('Step 3-Stand-Alone Freezers (B)'!H69),\"BLANK\",'Step 3-Stand-Alone Freezers (B)'!H69)","v":""}]
[null,"Mercury-Containing Components",{"$f":"'Step 3-Stand-Alone Freezers (B)'!D70","v":"Recycled"},{"$f":"IF(ISBLANK('Step 3-Stand-Alone Freezers (B)'!H70),\"BLANK\",'Step 3-Stand-Alone Freezers (B)'!H70)","v":""}]
[null,null,{"$f":"'Step 3-Stand-Alone Freezers (B)'!D71","v":"Disposed"},{"$f":"IF(ISBLANK('Step 3-Stand-Alone Freezers (B)'!H71),\"BLANK\",'Step 3-Stand-Alone Freezers (B)'!H71)","v":""}]
[]
[null,null,{"$f":"'Step 3-Stand-Alone Freezers'!C78","v":"Average Number of Remaining Years of Useful Life"},{"$f":"IF(ISBLANK('Step 3-Stand-Alone Freezers (B)'!E76),\"BLANK\",'Step 3-Stand-Alone Freezers (B)'!E76)","v":""}]
[null,null,{"$f":"'Step 3-Stand-Alone Freezers'!C79","v":"Average Energy Consumed/Year/Unit (kWh)"},{"$f":"IF(ISBLANK('Step 3-Stand-Alone Freezers (B)'!E77),\"BLANK\",'Step 3-Stand-Alone Freezers (B)'!E77)","v":{"v":0,"d":"0.0"}}]
[null,null,{"$f":"'Step 3-Stand-Alone Freezers'!C80","v":"Average Energy Cost for Residential Consumers ($/kWh)  \n[please provide the average cost during the current program period]"},{"$f":"IF(ISBLANK('Step 3-Stand-Alone Freezers (B)'!E78),\"BLANK\",'Step 3-Stand-Alone Freezers (B)'!E78)","v":{"v":0,"d":"$0.00"}}]
[]
[null,null,{"$f":"'Step 3-Stand-Alone Freezers'!C82","v":"Additional Comments:"},{"$f":"IF(ISBLANK('Step 3-Stand-Alone Freezers (B)'!D80),\"BLANK\",'Step 3-Stand-Alone Freezers (B)'!D80)","v":{"v":0,"d":"$0.00"}}]
[]
[]
[]
[null,"Step 3 - Air-Conditioning Units (B)"]
[]
[null,null,"Units Processed"]
[null,null,{"$f":"'Step 3-Air-Conditioning Units'!C8","v":"Total Number of Units Processed"},{"$f":"IF(ISBLANK('Step 3-Air-Conditioning Uni (B)'!D8),\"BLANK\",'Step 3-Air-Conditioning Uni (B)'!D8)","v":0}]
[null,null,{"$f":"'Step 3-Air-Conditioning Units'!C9","v":"Average Age of Appliances Collected (yrs)"},{"$f":"IF(ISBLANK('Step 3-Air-Conditioning Uni (B)'!D9),\"BLANK\",'Step 3-Air-Conditioning Uni (B)'!D9)","v":0}]
[null,null,{"$f":"'Step 3-Air-Conditioning Units'!C10","v":"Refrigerant Type"}]
[null,null,{"$f":"'Step 3-Air-Conditioning Units'!C11","v":"HCFC-22"},{"$f":"IF(ISBLANK('Step 3-Air-Conditioning Uni (B)'!D11),\"BLANK\",'Step 3-Air-Conditioning Uni (B)'!D11)","v":0}]
[null,null,{"$f":"'Step 3-Air-Conditioning Units'!C12","v":"R-407C"},{"$f":"IF(ISBLANK('Step 3-Air-Conditioning Uni (B)'!D12),\"BLANK\",'Step 3-Air-Conditioning Uni (B)'!D12)","v":0}]
[null,null,{"$f":"'Step 3-Air-Conditioning Units'!C13","v":"R-410A"},{"$f":"IF(ISBLANK('Step 3-Air-Conditioning Uni (B)'!D13),\"BLANK\",'Step 3-Air-Conditioning Uni (B)'!D13)","v":0}]
[null,null,"Other",{"$f":"IF(ISBLANK('Step 3-Air-Conditioning Uni (B)'!D14),\"BLANK\",'Step 3-Air-Conditioning Uni (B)'!D14)","v":0}]
[]
[null,null,"Units with Refrigerant Recovery",{"$f":"D343","v":0}]
[null,null,"HCFC-22",{"$f":"IF(ISBLANK('Step 3-Air-Conditioning Uni (B)'!E11),\"BLANK\",'Step 3-Air-Conditioning Uni (B)'!E11)","v":0}]
[null,null,"R-407C",{"$f":"IF(ISBLANK('Step 3-Air-Conditioning Uni (B)'!E12),\"BLANK\",'Step 3-Air-Conditioning Uni (B)'!E12)","v":0}]
[null,null,"R-410A",{"$f":"IF(ISBLANK('Step 3-Air-Conditioning Uni (B)'!E13),\"BLANK\",'Step 3-Air-Conditioning Uni (B)'!E13)","v":0}]
[null,null,"Other",{"$f":"IF(ISBLANK('Step 3-Air-Conditioning Uni (B)'!E14),\"BLANK\",'Step 3-Air-Conditioning Uni (B)'!E14)","v":0}]
[]
[null,"Refrigerant (including that recovered from compressor oil)","HCFC-22"]
[null,0,"Reclaimed",{"$f":"IF(ISBLANK('Step 3-Air-Conditioning Uni (B)'!F22),\"BLANK\",'Step 3-Air-Conditioning Uni (B)'!F22)","v":""}]
[null,null,"Stockpiling with Intent to Reclaim",{"$f":"IF(ISBLANK('Step 3-Air-Conditioning Uni (B)'!F23),\"BLANK\",'Step 3-Air-Conditioning Uni (B)'!F23)","v":""}]
[null,0,"Destroyed",{"$f":"IF(ISBLANK('Step 3-Air-Conditioning Uni (B)'!F24),\"BLANK\",'Step 3-Air-Conditioning Uni (B)'!F24)","v":""}]
[null,null,"Stockpiling with Intent to Destroy",{"$f":"IF(ISBLANK('Step 3-Air-Conditioning Uni (B)'!F25),\"BLANK\",'Step 3-Air-Conditioning Uni (B)'!F25)","v":""}]
[null,0,"R-407C "]
[null,0,"Reclaimed",{"$f":"IF(ISBLANK('Step 3-Air-Conditioning Uni (B)'!F27),\"BLANK\",'Step 3-Air-Conditioning Uni (B)'!F27)","v":""}]
[null,null,"Stockpiling with Intent to Reclaim",{"$f":"IF(ISBLANK('Step 3-Air-Conditioning Uni (B)'!F28),\"BLANK\",'Step 3-Air-Conditioning Uni (B)'!F28)","v":""}]
[null,0,"Destroyed",{"$f":"IF(ISBLANK('Step 3-Air-Conditioning Uni (B)'!F29),\"BLANK\",'Step 3-Air-Conditioning Uni (B)'!F29)","v":""}]
[null,null,"Stockpiling with Intent to Destroy",{"$f":"IF(ISBLANK('Step 3-Air-Conditioning Uni (B)'!F30),\"BLANK\",'Step 3-Air-Conditioning Uni (B)'!F30)","v":""}]
[null,0,"R-410A "]
[null,0,"Reclaimed",{"$f":"IF(ISBLANK('Step 3-Air-Conditioning Uni (B)'!F32),\"BLANK\",'Step 3-Air-Conditioning Uni (B)'!F32)","v":""}]
[null,null,"Stockpiling with Intent to Reclaim",{"$f":"IF(ISBLANK('Step 3-Air-Conditioning Uni (B)'!F33),\"BLANK\",'Step 3-Air-Conditioning Uni (B)'!F33)","v":""}]
[null,0,"Destroyed",{"$f":"IF(ISBLANK('Step 3-Air-Conditioning Uni (B)'!F34),\"BLANK\",'Step 3-Air-Conditioning Uni (B)'!F34)","v":""}]
[null,null,"Stockpiling with Intent to Destroy",{"$f":"IF(ISBLANK('Step 3-Air-Conditioning Uni (B)'!F35),\"BLANK\",'Step 3-Air-Conditioning Uni (B)'!F35)","v":""}]
[null,"Used Oil","Recycled",{"$f":"IF(ISBLANK('Step 3-Air-Conditioning Uni (B)'!F36),\"BLANK\",'Step 3-Air-Conditioning Uni (B)'!F36)","v":""}]
[null,0,"Disposed",{"$f":"IF(ISBLANK('Step 3-Air-Conditioning Uni (B)'!F37),\"BLANK\",'Step 3-Air-Conditioning Uni (B)'!F37)","v":""}]
[null,"Metal","Ferrous Metal Recycled",{"$f":"IF(ISBLANK('Step 3-Air-Conditioning Uni (B)'!F38),\"BLANK\",'Step 3-Air-Conditioning Uni (B)'!F38)","v":""}]
[null,0,"Non-Ferrous Metal Recycled",{"$f":"IF(ISBLANK('Step 3-Air-Conditioning Uni (B)'!F39),\"BLANK\",'Step 3-Air-Conditioning Uni (B)'!F39)","v":""}]
[null,"Plastic","Recycled",{"$f":"IF(ISBLANK('Step 3-Air-Conditioning Uni (B)'!F40),\"BLANK\",'Step 3-Air-Conditioning Uni (B)'!F40)","v":""}]
[null,"Capacitors","Destroyed",{"$f":"IF(ISBLANK('Step 3-Air-Conditioning Uni (B)'!F41),\"BLANK\",'Step 3-Air-Conditioning Uni (B)'!F41)","v":""}]
[]
[null,"Actual Measurement or Assumptions"]
[null,null,{"$f":"'Step 3-Air-Conditioning Uni (B)'!C10","v":"Refrigerant Type"}]
[null,null,{"$f":"'Step 3-Air-Conditioning Uni (B)'!C11","v":"HCFC-22"},{"$f":"IF(ISBLANK('Step 3-Air-Conditioning Uni (B)'!F11),\"BLANK\",'Step 3-Air-Conditioning Uni (B)'!F11)","v":0}]
[null,null,{"$f":"'Step 3-Air-Conditioning Uni (B)'!C12","v":"R-407C"},{"$f":"IF(ISBLANK('Step 3-Air-Conditioning Uni (B)'!F12),\"BLANK\",'Step 3-Air-Conditioning Uni (B)'!F12)","v":0}]
[null,null,{"$f":"'Step 3-Air-Conditioning Uni (B)'!C13","v":"R-410A"},{"$f":"IF(ISBLANK('Step 3-Air-Conditioning Uni (B)'!F13),\"BLANK\",'Step 3-Air-Conditioning Uni (B)'!F13)","v":0}]
[null,null,{"$f":"'Step 3-Air-Conditioning Uni (B)'!C14","v":"Other"},{"$f":"IF(ISBLANK('Step 3-Air-Conditioning Uni (B)'!F14),\"BLANK\",'Step 3-Air-Conditioning Uni (B)'!F14)","v":0}]
[null,null,"Comments",{"$f":"IF(ISBLANK('Step 3-Air-Conditioning Uni (B)'!G11),\"BLANK\",'Step 3-Air-Conditioning Uni (B)'!G11)","v":0}]
[]
[null,"Refrigerant (including that recovered from compressor oil)","HCFC-22"]
[null,0,"Reclaimed",{"$f":"IF(ISBLANK('Step 3-Air-Conditioning Uni (B)'!H22),\"BLANK\",'Step 3-Air-Conditioning Uni (B)'!H22)","v":""}]
[null,null,"Stockpiling with Intent to Reclaim",{"$f":"IF(ISBLANK('Step 3-Air-Conditioning Uni (B)'!H23),\"BLANK\",'Step 3-Air-Conditioning Uni (B)'!H23)","v":""}]
[null,0,"Destroyed",{"$f":"IF(ISBLANK('Step 3-Air-Conditioning Uni (B)'!H24),\"BLANK\",'Step 3-Air-Conditioning Uni (B)'!H24)","v":""}]
[null,null,"Stockpiling with Intent to Destroy",{"$f":"IF(ISBLANK('Step 3-Air-Conditioning Uni (B)'!H25),\"BLANK\",'Step 3-Air-Conditioning Uni (B)'!H25)","v":""}]
[null,0,"R-407C "]
[null,0,"Reclaimed",{"$f":"IF(ISBLANK('Step 3-Air-Conditioning Uni (B)'!H27),\"BLANK\",'Step 3-Air-Conditioning Uni (B)'!H27)","v":""}]
[null,null,"Stockpiling with Intent to Reclaim",{"$f":"IF(ISBLANK('Step 3-Air-Conditioning Uni (B)'!H28),\"BLANK\",'Step 3-Air-Conditioning Uni (B)'!H28)","v":""}]
[null,0,"Destroyed",{"$f":"IF(ISBLANK('Step 3-Air-Conditioning Uni (B)'!H29),\"BLANK\",'Step 3-Air-Conditioning Uni (B)'!H29)","v":""}]
[null,null,"Stockpiling with Intent to Destroy",{"$f":"IF(ISBLANK('Step 3-Air-Conditioning Uni (B)'!H30),\"BLANK\",'Step 3-Air-Conditioning Uni (B)'!H30)","v":""}]
[null,0,"R-410A "]
[null,0,"Reclaimed",{"$f":"IF(ISBLANK('Step 3-Air-Conditioning Uni (B)'!H32),\"BLANK\",'Step 3-Air-Conditioning Uni (B)'!H32)","v":""}]
[null,null,"Stockpiling with Intent to Reclaim",{"$f":"IF(ISBLANK('Step 3-Air-Conditioning Uni (B)'!H33),\"BLANK\",'Step 3-Air-Conditioning Uni (B)'!H33)","v":""}]
[null,0,"Destroyed",{"$f":"IF(ISBLANK('Step 3-Air-Conditioning Uni (B)'!H34),\"BLANK\",'Step 3-Air-Conditioning Uni (B)'!H34)","v":""}]
[null,null,"Stockpiling with Intent to Destroy",{"$f":"IF(ISBLANK('Step 3-Air-Conditioning Uni (B)'!H35),\"BLANK\",'Step 3-Air-Conditioning Uni (B)'!H35)","v":""}]
[null,"Used Oil","Recycled",{"$f":"IF(ISBLANK('Step 3-Air-Conditioning Uni (B)'!H36),\"BLANK\",'Step 3-Air-Conditioning Uni (B)'!H36)","v":""}]
[null,0,"Disposed",{"$f":"IF(ISBLANK('Step 3-Air-Conditioning Uni (B)'!H37),\"BLANK\",'Step 3-Air-Conditioning Uni (B)'!H37)","v":""}]
[null,"Metal","Ferrous Metal Recycled",{"$f":"IF(ISBLANK('Step 3-Air-Conditioning Uni (B)'!H38),\"BLANK\",'Step 3-Air-Conditioning Uni (B)'!H38)","v":""}]
[null,0,"Non-Ferrous Metal Recycled",{"$f":"IF(ISBLANK('Step 3-Air-Conditioning Uni (B)'!H39),\"BLANK\",'Step 3-Air-Conditioning Uni (B)'!H39)","v":""}]
[null,"Plastic","Recycled",{"$f":"IF(ISBLANK('Step 3-Air-Conditioning Uni (B)'!H40),\"BLANK\",'Step 3-Air-Conditioning Uni (B)'!H40)","v":""}]
[null,"Capacitors","Destroyed",{"$f":"IF(ISBLANK('Step 3-Air-Conditioning Uni (B)'!H41),\"BLANK\",'Step 3-Air-Conditioning Uni (B)'!H41)","v":""}]
[]
[null,null,{"$f":"'Step 3-Air-Conditioning Units'!C47","v":"Average Number of Remaining Years of Useful Life"},{"$f":"IF(ISBLANK('Step 3-Air-Conditioning Uni (B)'!E46),\"BLANK\",'Step 3-Air-Conditioning Uni (B)'!E46)","v":{"v":0,"d":"0.0"}}]
[null,null,{"$f":"'Step 3-Air-Conditioning Units'!C48","v":"Average Energy Consumed/Year/Unit (kWh)"},{"$f":"IF(ISBLANK('Step 3-Air-Conditioning Uni (B)'!E47),\"BLANK\",'Step 3-Air-Conditioning Uni (B)'!E47)","v":{"v":0,"d":"0.0"}}]
[null,null,{"$f":"'Step 3-Air-Conditioning Units'!C49","v":"Average Energy Cost for Residential Consumers ($/kWh) \n[please provide the average cost during the current program period]"},{"$f":"IF(ISBLANK('Step 3-Air-Conditioning Uni (B)'!E48),\"BLANK\",'Step 3-Air-Conditioning Uni (B)'!E48)","v":{"v":0,"d":"$0.00"}}]
[]
[null,null,{"$f":"'Step 3-Air-Conditioning Units'!C51","v":"Additional Comments:"},{"$f":"IF(ISBLANK('Step 3-Air-Conditioning Uni (B)'!D50),\"BLANK\",'Step 3-Air-Conditioning Uni (B)'!D50)","v":{"v":0,"d":"$0.00"}}]
[]
[]
[]
[null,"Step 3 - Dehumidifiers (B)"]
[]
[null,null,"Units Processed"]
[null,null,{"$f":"'Step 3-Dehumidifiers'!C8","v":"Total Number of Units Processed"},{"$f":"IF(ISBLANK('Step 3-Dehumidifiers (B)'!D8),\"BLANK\",'Step 3-Dehumidifiers (B)'!D8)","v":{"v":0,"d":"0.0"}}]
[null,null,{"$f":"'Step 3-Dehumidifiers'!C9","v":"Average Age of Appliances Collected (yrs)"},{"$f":"IF(ISBLANK('Step 3-Dehumidifiers (B)'!D9),\"BLANK\",'Step 3-Dehumidifiers (B)'!D9)","v":{"v":0,"d":"0.0"}}]
[null,null,{"$f":"'Step 3-Dehumidifiers'!C10","v":"Refrigerant Type"}]
[null,null,{"$f":"'Step 3-Dehumidifiers'!C11","v":"CFC-12"},{"$f":"IF(ISBLANK('Step 3-Dehumidifiers (B)'!D11),\"BLANK\",'Step 3-Dehumidifiers (B)'!D11)","v":{"v":0,"d":"0.0"}}]
[null,null,{"$f":"'Step 3-Dehumidifiers'!C12","v":"HCFC-22"},{"$f":"IF(ISBLANK('Step 3-Dehumidifiers (B)'!D12),\"BLANK\",'Step 3-Dehumidifiers (B)'!D12)","v":{"v":0,"d":"0.0"}}]
[null,null,{"$f":"'Step 3-Dehumidifiers'!C13","v":"HFC-134a"},{"$f":"IF(ISBLANK('Step 3-Dehumidifiers (B)'!D13),\"BLANK\",'Step 3-Dehumidifiers (B)'!D13)","v":{"v":0,"d":"0.0"}}]
[null,null,{"$f":"'Step 3-Dehumidifiers'!C14","v":"R-500"},{"$f":"IF(ISBLANK('Step 3-Dehumidifiers (B)'!D14),\"BLANK\",'Step 3-Dehumidifiers (B)'!D14)","v":{"v":0,"d":"0.0"}}]
[null,null,{"$f":"'Step 3-Dehumidifiers'!C15","v":"R-410A"},{"$f":"IF(ISBLANK('Step 3-Dehumidifiers (B)'!D15),\"BLANK\",'Step 3-Dehumidifiers (B)'!D15)","v":{"v":0,"d":"0.0"}}]
[null,null,{"$f":"'Step 3-Dehumidifiers'!C16","v":"Other"},{"$f":"IF(ISBLANK('Step 3-Dehumidifiers (B)'!D16),\"BLANK\",'Step 3-Dehumidifiers (B)'!D16)","v":{"v":0,"d":"0.0"}}]
[]
[null,null,"Units with Refrigerant Recovery"]
[null,null,{"$f":"C421","v":"CFC-12"},{"$f":"IF(ISBLANK('Step 3-Dehumidifiers (B)'!E11),\"BLANK\",'Step 3-Dehumidifiers (B)'!E11)","v":{"v":0,"d":"0.0"}}]
[null,null,"HCFC-22",{"$f":"IF(ISBLANK('Step 3-Dehumidifiers (B)'!E12),\"BLANK\",'Step 3-Dehumidifiers (B)'!E12)","v":{"v":0,"d":"0.0"}}]
[null,null,"HFC-134a",{"$f":"IF(ISBLANK('Step 3-Dehumidifiers (B)'!E13),\"BLANK\",'Step 3-Dehumidifiers (B)'!E13)","v":{"v":0,"d":"0.0"}}]
[null,null,"R-500",{"$f":"IF(ISBLANK('Step 3-Dehumidifiers (B)'!E14),\"BLANK\",'Step 3-Dehumidifiers (B)'!E14)","v":{"v":0,"d":"0.0"}}]
[null,null,"R-410A",{"$f":"IF(ISBLANK('Step 3-Dehumidifiers (B)'!E15),\"BLANK\",'Step 3-Dehumidifiers (B)'!E15)","v":{"v":0,"d":"0.0"}}]
[null,null,"Other",{"$f":"IF(ISBLANK('Step 3-Dehumidifiers (B)'!E16),\"BLANK\",'Step 3-Dehumidifiers (B)'!E16)","v":{"v":0,"d":"0.0"}}]
[]
[null,"Refrigerant (including that recovered from compressor oil)",{"$f":"'Step 3-Dehumidifiers (B)'!D23","v":"CFC-12"}]
[null,null,{"$f":"'Step 3-Dehumidifiers (B)'!D24","v":"Reclaimed"},{"$f":"IF(ISBLANK('Step 3-Dehumidifiers (B)'!F24),\"BLANK\",'Step 3-Dehumidifiers (B)'!F24)","v":""}]
[null,null,"Stockpiling with Intent to Reclaim",{"$f":"IF(ISBLANK('Step 3-Dehumidifiers (B)'!F25),\"BLANK\",'Step 3-Dehumidifiers (B)'!F25)","v":""}]
[null,null,{"$f":"'Step 3-Dehumidifiers (B)'!D26","v":"Destroyed"},{"$f":"IF(ISBLANK('Step 3-Dehumidifiers (B)'!F26),\"BLANK\",'Step 3-Dehumidifiers (B)'!F26)","v":""}]
[null,null,"Stockpiling with Intent to Destroy",{"$f":"IF(ISBLANK('Step 3-Dehumidifiers (B)'!F27),\"BLANK\",'Step 3-Dehumidifiers (B)'!F27)","v":""}]
[null,null,{"$f":"'Step 3-Dehumidifiers (B)'!D28","v":"HCFC-22 "}]
[null,null,{"$f":"'Step 3-Dehumidifiers (B)'!D29","v":"Reclaimed"},{"$f":"IF(ISBLANK('Step 3-Dehumidifiers (B)'!F29),\"BLANK\",'Step 3-Dehumidifiers (B)'!F29)","v":""}]
[null,null,"Stockpiling with Intent to Reclaim",{"$f":"IF(ISBLANK('Step 3-Dehumidifiers (B)'!F30),\"BLANK\",'Step 3-Dehumidifiers (B)'!F30)","v":""}]
[null,null,{"$f":"'Step 3-Dehumidifiers (B)'!D31","v":"Destroyed"},{"$f":"IF(ISBLANK('Step 3-Dehumidifiers (B)'!F31),\"BLANK\",'Step 3-Dehumidifiers (B)'!F31)","v":""}]
[null,null,"Stockpiling with Intent to Destroy",{"$f":"IF(ISBLANK('Step 3-Dehumidifiers (B)'!F32),\"BLANK\",'Step 3-Dehumidifiers (B)'!F32)","v":""}]
[null,null,{"$f":"'Step 3-Dehumidifiers (B)'!D33","v":"HFC-134a"}]
[null,null,{"$f":"'Step 3-Dehumidifiers (B)'!D34","v":"Reclaimed"},{"$f":"IF(ISBLANK('Step 3-Dehumidifiers (B)'!F34),\"BLANK\",'Step 3-Dehumidifiers (B)'!F34)","v":""}]
[null,null,"Stockpiling with Intent to Reclaim",{"$f":"IF(ISBLANK('Step 3-Dehumidifiers (B)'!F35),\"BLANK\",'Step 3-Dehumidifiers (B)'!F35)","v":""}]
[null,null,"Destroyed",{"$f":"IF(ISBLANK('Step 3-Dehumidifiers (B)'!F36),\"BLANK\",'Step 3-Dehumidifiers (B)'!F36)","v":""}]
[null,null,"Stockpiling with Intent to Destroy",{"$f":"IF(ISBLANK('Step 3-Dehumidifiers (B)'!F37),\"BLANK\",'Step 3-Dehumidifiers (B)'!F37)","v":""}]
[null,null,{"$f":"'Step 3-Dehumidifiers (B)'!D38","v":"R-500"}]
[null,null,"Reclaimed",{"$f":"IF(ISBLANK('Step 3-Dehumidifiers (B)'!F39),\"BLANK\",'Step 3-Dehumidifiers (B)'!F39)","v":""}]
[null,null,"Stockpiling with Intent to Reclaim",{"$f":"IF(ISBLANK('Step 3-Dehumidifiers (B)'!F40),\"BLANK\",'Step 3-Dehumidifiers (B)'!F40)","v":""}]
[null,null,"Destroyed",{"$f":"IF(ISBLANK('Step 3-Dehumidifiers (B)'!F41),\"BLANK\",'Step 3-Dehumidifiers (B)'!F41)","v":""}]
[null,null,"Stockpiling with Intent to Destroy",{"$f":"IF(ISBLANK('Step 3-Dehumidifiers (B)'!F42),\"BLANK\",'Step 3-Dehumidifiers (B)'!F42)","v":""}]
[null,null,{"$f":"'Step 3-Dehumidifiers (B)'!D43","v":"R-410A "}]
[null,null,"Reclaimed",{"$f":"IF(ISBLANK('Step 3-Dehumidifiers (B)'!F44),\"BLANK\",'Step 3-Dehumidifiers (B)'!F44)","v":""}]
[null,null,"Stockpiling with Intent to Reclaim",{"$f":"IF(ISBLANK('Step 3-Dehumidifiers (B)'!F45),\"BLANK\",'Step 3-Dehumidifiers (B)'!F45)","v":""}]
[null,null,"Destroyed",{"$f":"IF(ISBLANK('Step 3-Dehumidifiers (B)'!F46),\"BLANK\",'Step 3-Dehumidifiers (B)'!F46)","v":""}]
[null,null,"Stockpiling with Intent to Destroy",{"$f":"IF(ISBLANK('Step 3-Dehumidifiers (B)'!F47),\"BLANK\",'Step 3-Dehumidifiers (B)'!F47)","v":""}]
[null,"Used Oil","Recycled",{"$f":"IF(ISBLANK('Step 3-Dehumidifiers (B)'!F48),\"BLANK\",'Step 3-Dehumidifiers (B)'!F48)","v":""}]
[null,0,"Disposed",{"$f":"IF(ISBLANK('Step 3-Dehumidifiers (B)'!F49),\"BLANK\",'Step 3-Dehumidifiers (B)'!F49)","v":""}]
[null,"Metal","Ferrous Metal Recycled",{"$f":"IF(ISBLANK('Step 3-Dehumidifiers (B)'!F50),\"BLANK\",'Step 3-Dehumidifiers (B)'!F50)","v":""}]
[null,0,"Non-Ferrous Metal Recycled",{"$f":"IF(ISBLANK('Step 3-Dehumidifiers (B)'!F51),\"BLANK\",'Step 3-Dehumidifiers (B)'!F51)","v":""}]
[null,"Plastic","Recycled",{"$f":"IF(ISBLANK('Step 3-Dehumidifiers (B)'!F52),\"BLANK\",'Step 3-Dehumidifiers (B)'!F52)","v":""}]
[null,"Capacitors","Destroyed",{"$f":"IF(ISBLANK('Step 3-Dehumidifiers (B)'!F53),\"BLANK\",'Step 3-Dehumidifiers (B)'!F53)","v":""}]
[]
[null,"Actual Measurement or Assumptions"]
[null,null,{"$f":"'Step 3-Dehumidifiers (B)'!C10","v":"Refrigerant Type"}]
[null,null,{"$f":"'Step 3-Dehumidifiers (B)'!C11","v":"CFC-12"},{"$f":"IF(ISBLANK('Step 3-Dehumidifiers (B)'!F11),\"BLANK\",'Step 3-Dehumidifiers (B)'!F11)","v":{"v":0,"d":"0.0"}}]
[null,null,{"$f":"'Step 3-Dehumidifiers (B)'!C12","v":"HCFC-22"},{"$f":"IF(ISBLANK('Step 3-Dehumidifiers (B)'!F12),\"BLANK\",'Step 3-Dehumidifiers (B)'!F12)","v":{"v":0,"d":"0.0"}}]
[null,null,{"$f":"'Step 3-Dehumidifiers (B)'!C13","v":"HFC-134a"},{"$f":"IF(ISBLANK('Step 3-Dehumidifiers (B)'!F13),\"BLANK\",'Step 3-Dehumidifiers (B)'!F13)","v":{"v":0,"d":"0.0"}}]
[null,null,{"$f":"'Step 3-Dehumidifiers (B)'!C14","v":"R-500"},{"$f":"IF(ISBLANK('Step 3-Dehumidifiers (B)'!F14),\"BLANK\",'Step 3-Dehumidifiers (B)'!F14)","v":{"v":0,"d":"0.0"}}]
[null,null,{"$f":"'Step 3-Dehumidifiers (B)'!C15","v":"R-410A"},{"$f":"IF(ISBLANK('Step 3-Dehumidifiers (B)'!F15),\"BLANK\",'Step 3-Dehumidifiers (B)'!F15)","v":{"v":0,"d":"0.0"}}]
[null,null,{"$f":"'Step 3-Dehumidifiers (B)'!C16","v":"Other"},{"$f":"IF(ISBLANK('Step 3-Dehumidifiers (B)'!F16),\"BLANK\",'Step 3-Dehumidifiers (B)'!F16)","v":{"v":0,"d":"0.0"}}]
[null,null,"Comments",{"$f":"IF(ISBLANK('Step 3-Dehumidifiers (B)'!G11),\"BLANK\",'Step 3-Dehumidifiers (B)'!G11)","v":{"v":0,"d":"0.0"}}]
[]
[null,"Refrigerant (including that recovered from compressor oil)",{"$f":"'Step 3-Dehumidifiers (B)'!D23","v":"CFC-12"},{"$f":"IF(ISBLANK('Step 3-Dehumidifiers (B)'!H23),\"BLANK\",'Step 3-Dehumidifiers (B)'!H23)","v":"BLANK"}]
[null,null,"Reclaimed",{"$f":"IF(ISBLANK('Step 3-Dehumidifiers (B)'!H24),\"BLANK\",'Step 3-Dehumidifiers (B)'!H24)","v":""}]
[null,null,"Stockpiling with Intent to Reclaim",{"$f":"IF(ISBLANK('Step 3-Dehumidifiers (B)'!H25),\"BLANK\",'Step 3-Dehumidifiers (B)'!H25)","v":""}]
[null,null,"Destroyed",{"$f":"IF(ISBLANK('Step 3-Dehumidifiers (B)'!H26),\"BLANK\",'Step 3-Dehumidifiers (B)'!H26)","v":""}]
[null,null,"Stockpiling with Intent to Destroy",{"$f":"IF(ISBLANK('Step 3-Dehumidifiers (B)'!H27),\"BLANK\",'Step 3-Dehumidifiers (B)'!H27)","v":""}]
[null,null,{"$f":"'Step 3-Dehumidifiers (B)'!D28","v":"HCFC-22 "},{"$f":"IF(ISBLANK('Step 3-Dehumidifiers (B)'!H28),\"BLANK\",'Step 3-Dehumidifiers (B)'!H28)","v":"BLANK"}]
[null,null,"Reclaimed",{"$f":"IF(ISBLANK('Step 3-Dehumidifiers (B)'!H29),\"BLANK\",'Step 3-Dehumidifiers (B)'!H29)","v":""}]
[null,null,"Stockpiling with Intent to Reclaim",{"$f":"IF(ISBLANK('Step 3-Dehumidifiers (B)'!H30),\"BLANK\",'Step 3-Dehumidifiers (B)'!H30)","v":""}]
[null,null,"Destroyed",{"$f":"IF(ISBLANK('Step 3-Dehumidifiers (B)'!H31),\"BLANK\",'Step 3-Dehumidifiers (B)'!H31)","v":""}]
[null,null,"Stockpiling with Intent to Destroy",{"$f":"IF(ISBLANK('Step 3-Dehumidifiers (B)'!H32),\"BLANK\",'Step 3-Dehumidifiers (B)'!H32)","v":""}]
[null,null,{"$f":"'Step 3-Dehumidifiers (B)'!D33","v":"HFC-134a"}]
[null,null,"Reclaimed",{"$f":"IF(ISBLANK('Step 3-Dehumidifiers (B)'!H34),\"BLANK\",'Step 3-Dehumidifiers (B)'!H34)","v":""}]
[null,null,"Stockpiling with Intent to Reclaim",{"$f":"IF(ISBLANK('Step 3-Dehumidifiers (B)'!H35),\"BLANK\",'Step 3-Dehumidifiers (B)'!H35)","v":""}]
[null,null,"Destroyed",{"$f":"IF(ISBLANK('Step 3-Dehumidifiers (B)'!H36),\"BLANK\",'Step 3-Dehumidifiers (B)'!H36)","v":""}]
[null,null,"Stockpiling with Intent to Destroy",{"$f":"IF(ISBLANK('Step 3-Dehumidifiers (B)'!H37),\"BLANK\",'Step 3-Dehumidifiers (B)'!H37)","v":""}]
[null,null,{"$f":"'Step 3-Dehumidifiers (B)'!D38","v":"R-500"},{"$f":"IF(ISBLANK('Step 3-Dehumidifiers (B)'!H38),\"BLANK\",'Step 3-Dehumidifiers (B)'!H38)","v":"BLANK"}]
[null,null,"Reclaimed",{"$f":"IF(ISBLANK('Step 3-Dehumidifiers (B)'!H39),\"BLANK\",'Step 3-Dehumidifiers (B)'!H39)","v":""}]
[null,null,"Stockpiling with Intent to Reclaim",{"$f":"IF(ISBLANK('Step 3-Dehumidifiers (B)'!H40),\"BLANK\",'Step 3-Dehumidifiers (B)'!H40)","v":""}]
[null,null,"Destroyed",{"$f":"IF(ISBLANK('Step 3-Dehumidifiers (B)'!H41),\"BLANK\",'Step 3-Dehumidifiers (B)'!H41)","v":""}]
[null,null,"Stockpiling with Intent to Destroy",{"$f":"IF(ISBLANK('Step 3-Dehumidifiers (B)'!H42),\"BLANK\",'Step 3-Dehumidifiers (B)'!H42)","v":""}]
[null,null,{"$f":"'Step 3-Dehumidifiers (B)'!D43","v":"R-410A "}]
[null,null,"Reclaimed",{"$f":"IF(ISBLANK('Step 3-Dehumidifiers (B)'!H44),\"BLANK\",'Step 3-Dehumidifiers (B)'!H44)","v":""}]
[null,null,"Stockpiling with Intent to Reclaim",{"$f":"IF(ISBLANK('Step 3-Dehumidifiers (B)'!H45),\"BLANK\",'Step 3-Dehumidifiers (B)'!H45)","v":""}]
[null,null,"Destroyed",{"$f":"IF(ISBLANK('Step 3-Dehumidifiers (B)'!H46),\"BLANK\",'Step 3-Dehumidifiers (B)'!H46)","v":""}]
[null,null,"Stockpiling with Intent to Destroy",{"$f":"IF(ISBLANK('Step 3-Dehumidifiers (B)'!H47),\"BLANK\",'Step 3-Dehumidifiers (B)'!H47)","v":""}]
[null,"Used Oil","Recycled",{"$f":"IF(ISBLANK('Step 3-Dehumidifiers (B)'!H48),\"BLANK\",'Step 3-Dehumidifiers (B)'!H48)","v":""}]
[null,0,"Disposed",{"$f":"IF(ISBLANK('Step 3-Dehumidifiers (B)'!H49),\"BLANK\",'Step 3-Dehumidifiers (B)'!H49)","v":""}]
[null,"Metal","Ferrous Metal Recycled",{"$f":"IF(ISBLANK('Step 3-Dehumidifiers (B)'!H50),\"BLANK\",'Step 3-Dehumidifiers (B)'!H50)","v":""}]
[null,0,"Non-Ferrous Metal Recycled",{"$f":"IF(ISBLANK('Step 3-Dehumidifiers (B)'!H51),\"BLANK\",'Step 3-Dehumidifiers (B)'!H51)","v":""}]
[null,"Plastic","Recycled",{"$f":"IF(ISBLANK('Step 3-Dehumidifiers (B)'!H52),\"BLANK\",'Step 3-Dehumidifiers (B)'!H52)","v":""}]
[null,"Capacitors","Destroyed",{"$f":"IF(ISBLANK('Step 3-Dehumidifiers (B)'!H53),\"BLANK\",'Step 3-Dehumidifiers (B)'!H53)","v":""}]
[]
[null,null,{"$f":"'Step 3-Dehumidifiers'!C59","v":"Average Number of Remaining Years of Useful Life"},{"$f":"IF(ISBLANK('Step 3-Dehumidifiers (B)'!E58),\"BLANK\",'Step 3-Dehumidifiers (B)'!E58)","v":{"v":0,"d":"0.0"}}]
[null,null,{"$f":"'Step 3-Dehumidifiers'!C60","v":"Average Energy Consumed/Year/Unit (kWh)"},{"$f":"IF(ISBLANK('Step 3-Dehumidifiers (B)'!E59),\"BLANK\",'Step 3-Dehumidifiers (B)'!E59)","v":{"v":0,"d":"0.0"}}]
[null,null,{"$f":"'Step 3-Dehumidifiers'!C61","v":"Average Energy Cost for Residential Consumers ($/kWh) \n[please provide the average cost during the current program period]"},{"$f":"IF(ISBLANK('Step 3-Dehumidifiers (B)'!E60),\"BLANK\",'Step 3-Dehumidifiers (B)'!E60)","v":{"v":0,"d":"$0.00"}}]
[]
[null,null,{"$f":"'Step 3-Dehumidifiers'!C63","v":"Additional Comments:"},{"$f":"IF(ISBLANK('Step 3-Dehumidifiers (B)'!D63),\"BLANK\",'Step 3-Dehumidifiers (B)'!D63)","v":{"v":0,"d":"$0.00"}}]
[]
[]
[]
[null,"Summary of Gross Energy Impacts (B) "]
[]
[null,null,{"$f":"'Step 5-Energy Impacts '!C9","v":"Appliance Type"},{"$f":"'Step 5 Energy Impacts (B)'!D9","v":"Total # of Units Processed"}]
[null,null,{"$f":"'Step 5-Energy Impacts '!C10","v":"Refrigerators "},{"$f":"IF(ISBLANK('Step 5 Energy Impacts (B)'!D10),\"BLANK\",'Step 5 Energy Impacts (B)'!D10)","v":0}]
[null,null,{"$f":"'Step 5-Energy Impacts '!C11","v":"Stand Alone Freezers"},{"$f":"IF(ISBLANK('Step 5 Energy Impacts (B)'!D11),\"BLANK\",'Step 5 Energy Impacts (B)'!D11)","v":0}]
[null,null,{"$f":"'Step 5-Energy Impacts '!C12","v":"Air-Conditioning Units"},{"$f":"IF(ISBLANK('Step 5 Energy Impacts (B)'!D12),\"BLANK\",'Step 5 Energy Impacts (B)'!D12)","v":0}]
[null,null,{"$f":"'Step 5-Energy Impacts '!C13","v":"Dehumidifiers"},{"$f":"IF(ISBLANK('Step 5 Energy Impacts (B)'!D13),\"BLANK\",'Step 5 Energy Impacts (B)'!D13)","v":0}]
[null,null,{"$f":"'Step 5-Energy Impacts '!C14","v":"Total"},{"$f":"IF(ISBLANK('Step 5 Energy Impacts (B)'!D14),\"BLANK\",'Step 5 Energy Impacts (B)'!D14)","v":0}]
[{"$nulls":3},{"$f":"'Step 5 Energy Impacts (B)'!F9","v":"Total Saved Energy (kWh)"}]
[null,null,"Refrigerator-Freezers",{"$f":"IF(ISBLANK('Step 5 Energy Impacts (B)'!F10),\"BLANK\",'Step 5 Energy Impacts (B)'!F10)","v":{"$error":"#VALUE!"}}]
[null,null,"Stand Alone Freezers",{"$f":"IF(ISBLANK('Step 5 Energy Impacts (B)'!F11),\"BLANK\",'Step 5 Energy Impacts (B)'!F11)","v":{"$error":"#VALUE!"}}]
[null,null,"Air Conditioning Units",{"$f":"IF(ISBLANK('Step 5 Energy Impacts (B)'!F12),\"BLANK\",'Step 5 Energy Impacts (B)'!F12)","v":{"v":0,"d":"0.0"}}]
[null,null,"Dehumidifiers",{"$f":"IF(ISBLANK('Step 5 Energy Impacts (B)'!F13),\"BLANK\",'Step 5 Energy Impacts (B)'!F13)","v":{"v":0,"d":"0.0"}}]
[null,null,"Total",{"$f":"IF(ISBLANK('Step 5 Energy Impacts (B)'!F14),\"BLANK\",'Step 5 Energy Impacts (B)'!F14)","v":{"$error":"#VALUE!"}}]
[{"$nulls":3},{"$f":"'Step 5 Energy Impacts (B)'!G9","v":"Total Savings to Residential Consumers ($)"}]
[null,null,"Refrigerator-Freezers",{"$f":"IF(ISBLANK('Step 5 Energy Impacts (B)'!G10),\"BLANK\",'Step 5 Energy Impacts (B)'!G10)","v":{"$error":"#VALUE!"}}]
[null,null,"Stand Alone Freezers",{"$f":"IF(ISBLANK('Step 5 Energy Impacts (B)'!G11),\"BLANK\",'Step 5 Energy Impacts (B)'!G11)","v":{"$error":"#VALUE!"}}]
[null,null,"Air Conditioning Units",{"$f":"IF(ISBLANK('Step 5 Energy Impacts (B)'!G12),\"BLANK\",'Step 5 Energy Impacts (B)'!G12)","v":{"v":0,"d":"$0.00"}}]
[null,null,"Dehumidifiers",{"$f":"IF(ISBLANK('Step 5 Energy Impacts (B)'!G13),\"BLANK\",'Step 5 Energy Impacts (B)'!G13)","v":{"v":0,"d":"$0.00"}}]
[null,null,"Total",{"$f":"IF(ISBLANK('Step 5 Energy Impacts (B)'!G14),\"BLANK\",'Step 5 Energy Impacts (B)'!G14)","v":{"$error":"#VALUE!"}}]
[]
[]
[]
[null,"Summary of Environmental Benefits (B)"]
[]
[null,null,"Refrigerant and Foam Reclamation and Destruction"]
[null,null,{"$f":"'Step 5-Env Benefits'!C7","v":"Appliance Component"},{"$f":"'Step 5-Env Benefits (B)'!D7:E7","v":"Total Amount Prevented from Being Emitted"}]
[{"$nulls":3},{"$f":"'Step 5-Env Benefits (B)'!D8","v":"(lb)"}]
[null,null,{"$f":"'Step 5-Env Benefits (B)'!C9","v":"Refrigerantc"},{"$f":"'Step 5-Env Benefits (B)'!D61","v":{"v":0,"d":"0.00"}}]
[null,null,{"$f":"'Step 5-Env Benefits (B)'!C10","v":"CFC-12 Reclaimed"},{"$f":"IF(ISBLANK('Step 5-Env Benefits (B)'!D10),\"BLANK\",'Step 5-Env Benefits (B)'!D10)","v":{"v":0,"d":"0.00"}}]
[null,null,{"$f":"'Step 5-Env Benefits (B)'!C11","v":"HCFC-22 Reclaimed"},{"$f":"IF(ISBLANK('Step 5-Env Benefits (B)'!D11),\"BLANK\",'Step 5-Env Benefits (B)'!D11)","v":{"v":0,"d":"0.00"}}]
[null,null,{"$f":"'Step 5-Env Benefits (B)'!C12","v":"HFC-134a Reclaimed"},{"$f":"IF(ISBLANK('Step 5-Env Benefits (B)'!D12),\"BLANK\",'Step 5-Env Benefits (B)'!D12)","v":{"v":0,"d":"0.00"}}]
[null,null,{"$f":"'Step 5-Env Benefits (B)'!C13","v":"R-500 Reclaimed"},{"$f":"IF(ISBLANK('Step 5-Env Benefits (B)'!D13),\"BLANK\",'Step 5-Env Benefits (B)'!D13)","v":{"v":0,"d":"0.00"}}]
[null,null,{"$f":"'Step 5-Env Benefits (B)'!C14","v":"R-407C Reclaimed"},{"$f":"IF(ISBLANK('Step 5-Env Benefits (B)'!D14),\"BLANK\",'Step 5-Env Benefits (B)'!D14)","v":{"v":0,"d":"0.00"}}]
[null,null,{"$f":"'Step 5-Env Benefits (B)'!C15","v":"R-410A Reclaimed"},{"$f":"IF(ISBLANK('Step 5-Env Benefits (B)'!D15),\"BLANK\",'Step 5-Env Benefits (B)'!D15)","v":{"v":0,"d":"0.00"}}]
[null,null,{"$f":"'Step 5-Env Benefits (B)'!C16","v":"Reclaimed"},{"$f":"IF(ISBLANK('Step 5-Env Benefits (B)'!D16),\"BLANK\",'Step 5-Env Benefits (B)'!D16)","v":{"v":0,"d":"0.00"}}]
[null,null,{"$f":"'Step 5-Env Benefits'!C17","v":"CFC-12 Stockpiling with Intent to Reclaim"},{"$f":"IF(ISBLANK('Step 5-Env Benefits (B)'!D17),\"BLANK\",'Step 5-Env Benefits (B)'!D17)","v":{"v":0,"d":"0.00"}}]
[null,null,{"$f":"'Step 5-Env Benefits'!C18","v":"HCFC-22 Stockpiling with Intent to Reclaim"},{"$f":"IF(ISBLANK('Step 5-Env Benefits (B)'!D18),\"BLANK\",'Step 5-Env Benefits (B)'!D18)","v":{"v":0,"d":"0.00"}}]
[null,null,{"$f":"'Step 5-Env Benefits'!C19","v":"HFC-134a Stockpiling with Intent to Reclaim"},{"$f":"IF(ISBLANK('Step 5-Env Benefits (B)'!D19),\"BLANK\",'Step 5-Env Benefits (B)'!D19)","v":{"v":0,"d":"0.00"}}]
[null,null,{"$f":"'Step 5-Env Benefits'!C20","v":"R-500 Stockpiling with Intent to Reclaim"},{"$f":"IF(ISBLANK('Step 5-Env Benefits (B)'!D20),\"BLANK\",'Step 5-Env Benefits (B)'!D20)","v":{"v":0,"d":"0.00"}}]
[null,null,{"$f":"'Step 5-Env Benefits'!C21","v":"R-407C Stockpiling with Intent to Reclaim"},{"$f":"IF(ISBLANK('Step 5-Env Benefits (B)'!D21),\"BLANK\",'Step 5-Env Benefits (B)'!D21)","v":{"v":0,"d":"0.00"}}]
[null,null,{"$f":"'Step 5-Env Benefits'!C22","v":"R-410A Stockpiling with Intent to Reclaim"},{"$f":"IF(ISBLANK('Step 5-Env Benefits (B)'!D22),\"BLANK\",'Step 5-Env Benefits (B)'!D22)","v":{"v":0,"d":"0.00"}}]
[null,null,{"$f":"'Step 5-Env Benefits'!C23","v":"Stockpiling with Intent to Reclaim"},{"$f":"IF(ISBLANK('Step 5-Env Benefits (B)'!D23),\"BLANK\",'Step 5-Env Benefits (B)'!D23)","v":{"v":0,"d":"0.00"}}]
[null,null,{"$f":"'Step 5-Env Benefits (B)'!C24","v":"CFC-12 Destroyed"},{"$f":"IF(ISBLANK('Step 5-Env Benefits (B)'!D24),\"BLANK\",'Step 5-Env Benefits (B)'!D24)","v":{"v":0,"d":"0.00"}}]
[null,null,{"$f":"'Step 5-Env Benefits (B)'!C25","v":"HCFC-22 Destroyed"},{"$f":"IF(ISBLANK('Step 5-Env Benefits (B)'!D25),\"BLANK\",'Step 5-Env Benefits (B)'!D25)","v":{"v":0,"d":"0.00"}}]
[null,null,{"$f":"'Step 5-Env Benefits (B)'!C26","v":"HFC-134a Destroyed"},{"$f":"IF(ISBLANK('Step 5-Env Benefits (B)'!D26),\"BLANK\",'Step 5-Env Benefits (B)'!D26)","v":{"v":0,"d":"0.00"}}]
[null,null,{"$f":"'Step 5-Env Benefits (B)'!C27","v":"R-500 Destroyed"},{"$f":"IF(ISBLANK('Step 5-Env Benefits (B)'!D27),\"BLANK\",'Step 5-Env Benefits (B)'!D27)","v":{"v":0,"d":"0.00"}}]
[null,null,{"$f":"'Step 5-Env Benefits (B)'!C29","v":"R-410A Destroyed"},{"$f":"IF(ISBLANK('Step 5-Env Benefits (B)'!D28),\"BLANK\",'Step 5-Env Benefits (B)'!D28)","v":{"v":0,"d":"0.00"}}]
[null,null,{"$f":"'Step 5-Env Benefits (B)'!C28","v":"R-407C Destroyed"},{"$f":"IF(ISBLANK('Step 5-Env Benefits (B)'!D29),\"BLANK\",'Step 5-Env Benefits (B)'!D29)","v":{"v":0,"d":"0.00"}}]
[null,null,{"$f":"'Step 5-Env Benefits (B)'!C30","v":"Destroyed"},{"$f":"IF(ISBLANK('Step 5-Env Benefits (B)'!D30),\"BLANK\",'Step 5-Env Benefits (B)'!D30)","v":{"v":0,"d":"0.00"}}]
[null,null,{"$f":"'Step 5-Env Benefits'!C31","v":"CFC-12 Stockpiling with Intent to Destroy"},{"$f":"IF(ISBLANK('Step 5-Env Benefits (B)'!D31),\"BLANK\",'Step 5-Env Benefits (B)'!D31)","v":{"v":0,"d":"0.00"}}]
[null,null,{"$f":"'Step 5-Env Benefits'!C32","v":"HCFC-22 Stockpiling with Intent to Destroy"},{"$f":"IF(ISBLANK('Step 5-Env Benefits (B)'!D32),\"BLANK\",'Step 5-Env Benefits (B)'!D32)","v":{"v":0,"d":"0.00"}}]
[null,null,{"$f":"'Step 5-Env Benefits'!C33","v":"HFC-134a Stockpiling with Intent to Destroy"},{"$f":"IF(ISBLANK('Step 5-Env Benefits (B)'!D33),\"BLANK\",'Step 5-Env Benefits (B)'!D33)","v":{"v":0,"d":"0.00"}}]
[null,null,{"$f":"'Step 5-Env Benefits'!C34","v":"R-500 Stockpiling with Intent to Destroy"},{"$f":"IF(ISBLANK('Step 5-Env Benefits (B)'!D34),\"BLANK\",'Step 5-Env Benefits (B)'!D34)","v":{"v":0,"d":"0.00"}}]
[null,null,{"$f":"'Step 5-Env Benefits'!C35","v":"R-407C Stockpiling with Intent to Destroy"},{"$f":"IF(ISBLANK('Step 5-Env Benefits (B)'!D35),\"BLANK\",'Step 5-Env Benefits (B)'!D35)","v":{"v":0,"d":"0.00"}}]
[null,null,{"$f":"'Step 5-Env Benefits'!C36","v":"R-410A Stockpiling with Intent to Destroy"},{"$f":"IF(ISBLANK('Step 5-Env Benefits (B)'!D36),\"BLANK\",'Step 5-Env Benefits (B)'!D36)","v":{"v":0,"d":"0.00"}}]
[null,null,{"$f":"'Step 5-Env Benefits'!C37","v":"Stockpiling with Intent to Destroy"},{"$f":"IF(ISBLANK('Step 5-Env Benefits (B)'!D37),\"BLANK\",'Step 5-Env Benefits (B)'!D37)","v":{"v":0,"d":"0.00"}}]
[null,null,{"$f":"'Step 5-Env Benefits (B)'!C38","v":"Subtotal"},{"$f":"IF(ISBLANK('Step 5-Env Benefits (B)'!D38),\"BLANK\",'Step 5-Env Benefits (B)'!D38)","v":{"v":0,"d":"0.00"}}]
[null,null,{"$f":"'Step 5-Env Benefits (B)'!C39","v":"Foam-Blowing Agentd"}]
[null,null,{"$f":"'Step 5-Env Benefits (B)'!C40","v":"CFC-11 Reclaimed"},{"$f":"IF(ISBLANK('Step 5-Env Benefits (B)'!D40),\"BLANK\",'Step 5-Env Benefits (B)'!D40)","v":{"v":0,"d":"0.00"}}]
[null,null,{"$f":"'Step 5-Env Benefits (B)'!C41","v":"HCFC-141b Reclaimed"},{"$f":"IF(ISBLANK('Step 5-Env Benefits (B)'!D41),\"BLANK\",'Step 5-Env Benefits (B)'!D41)","v":{"v":0,"d":"0.00"}}]
[null,null,{"$f":"'Step 5-Env Benefits (B)'!C42","v":"HFC-134a Reclaimed"},{"$f":"IF(ISBLANK('Step 5-Env Benefits (B)'!D42),\"BLANK\",'Step 5-Env Benefits (B)'!D42)","v":{"v":0,"d":"0.00"}}]
[null,null,{"$f":"'Step 5-Env Benefits (B)'!C43","v":"HFC-245fa Reclaimed"},{"$f":"IF(ISBLANK('Step 5-Env Benefits (B)'!D43),\"BLANK\",'Step 5-Env Benefits (B)'!D43)","v":{"v":0,"d":"0.00"}}]
[null,null,{"$f":"'Step 5-Env Benefits (B)'!C44","v":"Reclaimed"},{"$f":"IF(ISBLANK('Step 5-Env Benefits (B)'!D44),\"BLANK\",'Step 5-Env Benefits (B)'!D44)","v":{"v":0,"d":"0.00"}}]
[null,null,{"$f":"'Step 5-Env Benefits (B)'!C45","v":"CFC-11 Stockpiling with Intent to Reclaim"},{"$f":"IF(ISBLANK('Step 5-Env Benefits (B)'!D45),\"BLANK\",'Step 5-Env Benefits (B)'!D45)","v":{"v":0,"d":"0.00"}}]
[null,null,{"$f":"'Step 5-Env Benefits (B)'!C46","v":"HCFC-141b Stockpiling with Intent to Reclaim"},{"$f":"IF(ISBLANK('Step 5-Env Benefits (B)'!D46),\"BLANK\",'Step 5-Env Benefits (B)'!D46)","v":{"v":0,"d":"0.00"}}]
[null,null,{"$f":"'Step 5-Env Benefits (B)'!C47","v":"HFC-134a Stockpiling with Intent to Reclaim"},{"$f":"IF(ISBLANK('Step 5-Env Benefits (B)'!D47),\"BLANK\",'Step 5-Env Benefits (B)'!D47)","v":{"v":0,"d":"0.00"}}]
[null,null,{"$f":"'Step 5-Env Benefits (B)'!C48","v":"HFC-245fa Stockpiling with Intent to Reclaim"},{"$f":"IF(ISBLANK('Step 5-Env Benefits (B)'!D48),\"BLANK\",'Step 5-Env Benefits (B)'!D48)","v":{"v":0,"d":"0.00"}}]
[null,null,{"$f":"'Step 5-Env Benefits (B)'!C49","v":"Stockpiling with Intent to Reclaim"},{"$f":"IF(ISBLANK('Step 5-Env Benefits (B)'!D49),\"BLANK\",'Step 5-Env Benefits (B)'!D49)","v":{"v":0,"d":"0.00"}}]
[null,null,{"$f":"'Step 5-Env Benefits (B)'!C50","v":"CFC-11 Destroyed"},{"$f":"IF(ISBLANK('Step 5-Env Benefits (B)'!D50),\"BLANK\",'Step 5-Env Benefits (B)'!D50)","v":{"v":0,"d":"0.00"}}]
[null,null,{"$f":"'Step 5-Env Benefits (B)'!C51","v":"HCFC-141b Destroyed"},{"$f":"IF(ISBLANK('Step 5-Env Benefits (B)'!D51),\"BLANK\",'Step 5-Env Benefits (B)'!D51)","v":{"v":0,"d":"0.00"}}]
[null,null,{"$f":"'Step 5-Env Benefits (B)'!C52","v":"HFC-134a Destroyed"},{"$f":"IF(ISBLANK('Step 5-Env Benefits (B)'!D52),\"BLANK\",'Step 5-Env Benefits (B)'!D52)","v":{"v":0,"d":"0.00"}}]
[null,null,{"$f":"'Step 5-Env Benefits (B)'!C53","v":"HFC-245fa Destroyed"},{"$f":"IF(ISBLANK('Step 5-Env Benefits (B)'!D53),\"BLANK\",'Step 5-Env Benefits (B)'!D53)","v":{"v":0,"d":"0.00"}}]
[null,null,{"$f":"'Step 5-Env Benefits (B)'!C54","v":"Destroyed"},{"$f":"IF(ISBLANK('Step 5-Env Benefits (B)'!D54),\"BLANK\",'Step 5-Env Benefits (B)'!D54)","v":{"v":0,"d":"0.00"}}]
[null,null,{"$f":"'Step 5-Env Benefits (B)'!C55","v":"CFC-11 Stockpiling with Intent to Destroy"},{"$f":"IF(ISBLANK('Step 5-Env Benefits (B)'!D55),\"BLANK\",'Step 5-Env Benefits (B)'!D55)","v":{"v":0,"d":"0.00"}}]
[null,null,{"$f":"'Step 5-Env Benefits (B)'!C56","v":"HCFC-141b Stockpiling with Intent to Destroy"},{"$f":"IF(ISBLANK('Step 5-Env Benefits (B)'!D56),\"BLANK\",'Step 5-Env Benefits (B)'!D56)","v":{"v":0,"d":"0.00"}}]
[null,null,{"$f":"'Step 5-Env Benefits (B)'!C57","v":"HFC-134a Stockpiling with Intent to Destroy"},{"$f":"IF(ISBLANK('Step 5-Env Benefits (B)'!D57),\"BLANK\",'Step 5-Env Benefits (B)'!D57)","v":{"v":0,"d":"0.00"}}]
[null,null,{"$f":"'Step 5-Env Benefits (B)'!C58","v":"HFC-245fa Stockpiling with Intent to Destroy"},{"$f":"IF(ISBLANK('Step 5-Env Benefits (B)'!D58),\"BLANK\",'Step 5-Env Benefits (B)'!D58)","v":{"v":0,"d":"0.00"}}]
[null,null,{"$f":"'Step 5-Env Benefits (B)'!C59","v":"Stockpiling with Intent to Destroy"},{"$f":"IF(ISBLANK('Step 5-Env Benefits (B)'!D59),\"BLANK\",'Step 5-Env Benefits (B)'!D59)","v":{"v":0,"d":"0.00"}}]
[null,null,{"$f":"'Step 5-Env Benefits (B)'!C60","v":"Subtotal"},{"$f":"IF(ISBLANK('Step 5-Env Benefits (B)'!D60),\"BLANK\",'Step 5-Env Benefits (B)'!D60)","v":{"v":0,"d":"0.00"}}]
[]
[null,null,{"$f":"'Step 5-Env Benefits (B)'!C9","v":"Refrigerantc"}]
[null,null,{"$f":"'Step 5-Env Benefits (B)'!C10","v":"CFC-12 Reclaimed"},{"$f":"IF(ISBLANK('Step 5-Env Benefits (B)'!E10),\"BLANK\",'Step 5-Env Benefits (B)'!E10)","v":{"v":0,"d":"0.00"}}]
[null,null,{"$f":"'Step 5-Env Benefits (B)'!C11","v":"HCFC-22 Reclaimed"},{"$f":"IF(ISBLANK('Step 5-Env Benefits (B)'!E11),\"BLANK\",'Step 5-Env Benefits (B)'!E11)","v":{"v":0,"d":"0.00"}}]
[null,null,{"$f":"'Step 5-Env Benefits (B)'!C12","v":"HFC-134a Reclaimed"},{"$f":"IF(ISBLANK('Step 5-Env Benefits (B)'!E12),\"BLANK\",'Step 5-Env Benefits (B)'!E12)","v":{"v":0,"d":"0.00"}}]
[null,null,{"$f":"'Step 5-Env Benefits (B)'!C13","v":"R-500 Reclaimed"},{"$f":"IF(ISBLANK('Step 5-Env Benefits (B)'!E13),\"BLANK\",'Step 5-Env Benefits (B)'!E13)","v":{"v":0,"d":"0.00"}}]
[null,null,{"$f":"'Step 5-Env Benefits (B)'!C14","v":"R-407C Reclaimed"},{"$f":"IF(ISBLANK('Step 5-Env Benefits (B)'!E14),\"BLANK\",'Step 5-Env Benefits (B)'!E14)","v":{"v":0,"d":"0.00"}}]
[null,null,{"$f":"'Step 5-Env Benefits (B)'!C15","v":"R-410A Reclaimed"},{"$f":"IF(ISBLANK('Step 5-Env Benefits (B)'!E15),\"BLANK\",'Step 5-Env Benefits (B)'!E15)","v":{"v":0,"d":"0.00"}}]
[null,null,{"$f":"'Step 5-Env Benefits (B)'!C16","v":"Reclaimed"},{"$f":"IF(ISBLANK('Step 5-Env Benefits (B)'!E16),\"BLANK\",'Step 5-Env Benefits (B)'!E16)","v":{"v":0,"d":"0.00"}}]
[null,null,{"$f":"'Step 5-Env Benefits (B)'!C17","v":"CFC-12 Stockpiling with Intent to Reclaim"},{"$f":"IF(ISBLANK('Step 5-Env Benefits (B)'!E17),\"BLANK\",'Step 5-Env Benefits (B)'!E17)","v":{"v":0,"d":"0.00"}}]
[null,null,{"$f":"'Step 5-Env Benefits (B)'!C18","v":"HCFC-22 Stockpiling with Intent to Reclaim"},{"$f":"IF(ISBLANK('Step 5-Env Benefits (B)'!E18),\"BLANK\",'Step 5-Env Benefits (B)'!E18)","v":{"v":0,"d":"0.00"}}]
[null,null,{"$f":"'Step 5-Env Benefits (B)'!C19","v":"HFC-134a Stockpiling with Intent to Reclaim"},{"$f":"IF(ISBLANK('Step 5-Env Benefits (B)'!E19),\"BLANK\",'Step 5-Env Benefits (B)'!E19)","v":{"v":0,"d":"0.00"}}]
[null,null,{"$f":"'Step 5-Env Benefits (B)'!C20","v":"R-500 Stockpiling with Intent to Reclaim"},{"$f":"IF(ISBLANK('Step 5-Env Benefits (B)'!E20),\"BLANK\",'Step 5-Env Benefits (B)'!E20)","v":{"v":0,"d":"0.00"}}]
[null,null,{"$f":"'Step 5-Env Benefits (B)'!C21","v":"R-407C Stockpiling with Intent to Reclaim"},{"$f":"IF(ISBLANK('Step 5-Env Benefits (B)'!E21),\"BLANK\",'Step 5-Env Benefits (B)'!E21)","v":{"v":0,"d":"0.00"}}]
[null,null,{"$f":"'Step 5-Env Benefits (B)'!C22","v":"R-410A Stockpiling with Intent to Reclaim"},{"$f":"IF(ISBLANK('Step 5-Env Benefits (B)'!E22),\"BLANK\",'Step 5-Env Benefits (B)'!E22)","v":{"v":0,"d":"0.00"}}]
[null,null,{"$f":"'Step 5-Env Benefits (B)'!C23","v":"Stockpiling with Intent to Reclaim"},{"$f":"IF(ISBLANK('Step 5-Env Benefits (B)'!E23),\"BLANK\",'Step 5-Env Benefits (B)'!E23)","v":{"v":0,"d":"0.00"}}]
[null,null,{"$f":"'Step 5-Env Benefits (B)'!C24","v":"CFC-12 Destroyed"},{"$f":"IF(ISBLANK('Step 5-Env Benefits (B)'!E24),\"BLANK\",'Step 5-Env Benefits (B)'!E24)","v":{"v":0,"d":"0.00"}}]
[null,null,{"$f":"'Step 5-Env Benefits (B)'!C25","v":"HCFC-22 Destroyed"},{"$f":"IF(ISBLANK('Step 5-Env Benefits (B)'!E25),\"BLANK\",'Step 5-Env Benefits (B)'!E25)","v":{"v":0,"d":"0.00"}}]
[null,null,{"$f":"'Step 5-Env Benefits (B)'!C26","v":"HFC-134a Destroyed"},{"$f":"IF(ISBLANK('Step 5-Env Benefits (B)'!E26),\"BLANK\",'Step 5-Env Benefits (B)'!E26)","v":{"v":0,"d":"0.00"}}]
[null,null,{"$f":"'Step 5-Env Benefits (B)'!C27","v":"R-500 Destroyed"},{"$f":"IF(ISBLANK('Step 5-Env Benefits (B)'!E27),\"BLANK\",'Step 5-Env Benefits (B)'!E27)","v":{"v":0,"d":"0.00"}}]
[null,null,{"$f":"'Step 5-Env Benefits (B)'!C28","v":"R-407C Destroyed"},{"$f":"IF(ISBLANK('Step 5-Env Benefits (B)'!E28),\"BLANK\",'Step 5-Env Benefits (B)'!E28)","v":{"v":0,"d":"0.00"}}]
[null,null,{"$f":"'Step 5-Env Benefits (B)'!C29","v":"R-410A Destroyed"},{"$f":"IF(ISBLANK('Step 5-Env Benefits (B)'!E29),\"BLANK\",'Step 5-Env Benefits (B)'!E29)","v":{"v":0,"d":"0.00"}}]
[null,null,{"$f":"'Step 5-Env Benefits (B)'!C30","v":"Destroyed"},{"$f":"IF(ISBLANK('Step 5-Env Benefits (B)'!E30),\"BLANK\",'Step 5-Env Benefits (B)'!E30)","v":{"v":0,"d":"0.00"}}]
[null,null,{"$f":"'Step 5-Env Benefits (B)'!C31","v":"CFC-12 Stockpiling with Intent to Destroy"},{"$f":"IF(ISBLANK('Step 5-Env Benefits (B)'!E31),\"BLANK\",'Step 5-Env Benefits (B)'!E31)","v":{"v":0,"d":"0.00"}}]
[null,null,{"$f":"'Step 5-Env Benefits (B)'!C32","v":"HCFC-22 Stockpiling with Intent to Destroy"},{"$f":"IF(ISBLANK('Step 5-Env Benefits (B)'!E32),\"BLANK\",'Step 5-Env Benefits (B)'!E32)","v":{"v":0,"d":"0.00"}}]
[null,null,{"$f":"'Step 5-Env Benefits (B)'!C33","v":"HFC-134a Stockpiling with Intent to Destroy"},{"$f":"IF(ISBLANK('Step 5-Env Benefits (B)'!E33),\"BLANK\",'Step 5-Env Benefits (B)'!E33)","v":{"v":0,"d":"0.00"}}]
[null,null,{"$f":"'Step 5-Env Benefits (B)'!C34","v":"R-500 Stockpiling with Intent to Destroy"},{"$f":"IF(ISBLANK('Step 5-Env Benefits (B)'!E34),\"BLANK\",'Step 5-Env Benefits (B)'!E34)","v":{"v":0,"d":"0.00"}}]
[null,null,{"$f":"'Step 5-Env Benefits (B)'!C35","v":"R-407C Stockpiling with Intent to Destroy"},{"$f":"IF(ISBLANK('Step 5-Env Benefits (B)'!E35),\"BLANK\",'Step 5-Env Benefits (B)'!E35)","v":{"v":0,"d":"0.00"}}]
[null,null,{"$f":"'Step 5-Env Benefits (B)'!C36","v":"R-410A Stockpiling with Intent to Destroy"},{"$f":"IF(ISBLANK('Step 5-Env Benefits (B)'!E36),\"BLANK\",'Step 5-Env Benefits (B)'!E36)","v":{"v":0,"d":"0.00"}}]
[null,null,{"$f":"'Step 5-Env Benefits (B)'!C37","v":"Stockpiling with Intent to Destroy"},{"$f":"IF(ISBLANK('Step 5-Env Benefits (B)'!E37),\"BLANK\",'Step 5-Env Benefits (B)'!E37)","v":{"v":0,"d":"0.00"}}]
[null,null,{"$f":"'Step 5-Env Benefits (B)'!C38","v":"Subtotal"},{"$f":"IF(ISBLANK('Step 5-Env Benefits (B)'!E38),\"BLANK\",'Step 5-Env Benefits (B)'!E38)","v":{"v":0,"d":"0.00"}}]
[null,null,{"$f":"'Step 5-Env Benefits (B)'!C39","v":"Foam-Blowing Agentd"}]
[null,null,{"$f":"'Step 5-Env Benefits (B)'!C40","v":"CFC-11 Reclaimed"},{"$f":"IF(ISBLANK('Step 5-Env Benefits (B)'!E40),\"BLANK\",'Step 5-Env Benefits (B)'!E40)","v":{"v":0,"d":"0.00"}}]
[null,null,{"$f":"'Step 5-Env Benefits (B)'!C41","v":"HCFC-141b Reclaimed"},{"$f":"IF(ISBLANK('Step 5-Env Benefits (B)'!E41),\"BLANK\",'Step 5-Env Benefits (B)'!E41)","v":{"v":0,"d":"0.00"}}]
[null,null,{"$f":"'Step 5-Env Benefits (B)'!C42","v":"HFC-134a Reclaimed"},{"$f":"IF(ISBLANK('Step 5-Env Benefits (B)'!E42),\"BLANK\",'Step 5-Env Benefits (B)'!E42)","v":{"v":0,"d":"0.00"}}]
[null,null,{"$f":"'Step 5-Env Benefits (B)'!C43","v":"HFC-245fa Reclaimed"},{"$f":"IF(ISBLANK('Step 5-Env Benefits (B)'!E43),\"BLANK\",'Step 5-Env Benefits (B)'!E43)","v":{"v":0,"d":"0.00"}}]
[null,null,{"$f":"'Step 5-Env Benefits (B)'!C44","v":"Reclaimed"},{"$f":"IF(ISBLANK('Step 5-Env Benefits (B)'!E44),\"BLANK\",'Step 5-Env Benefits (B)'!E44)","v":{"v":0,"d":"0.00"}}]
[null,null,{"$f":"'Step 5-Env Benefits (B)'!C45","v":"CFC-11 Stockpiling with Intent to Reclaim"},{"$f":"IF(ISBLANK('Step 5-Env Benefits (B)'!E45),\"BLANK\",'Step 5-Env Benefits (B)'!E45)","v":{"v":0,"d":"0.00"}}]
[null,null,{"$f":"'Step 5-Env Benefits (B)'!C46","v":"HCFC-141b Stockpiling with Intent to Reclaim"},{"$f":"IF(ISBLANK('Step 5-Env Benefits (B)'!E46),\"BLANK\",'Step 5-Env Benefits (B)'!E46)","v":{"v":0,"d":"0.00"}}]
[null,null,{"$f":"'Step 5-Env Benefits (B)'!C47","v":"HFC-134a Stockpiling with Intent to Reclaim"},{"$f":"IF(ISBLANK('Step 5-Env Benefits (B)'!E47),\"BLANK\",'Step 5-Env Benefits (B)'!E47)","v":{"v":0,"d":"0.00"}}]
[null,null,{"$f":"'Step 5-Env Benefits (B)'!C48","v":"HFC-245fa Stockpiling with Intent to Reclaim"},{"$f":"IF(ISBLANK('Step 5-Env Benefits (B)'!E48),\"BLANK\",'Step 5-Env Benefits (B)'!E48)","v":{"v":0,"d":"0.00"}}]
[null,null,{"$f":"'Step 5-Env Benefits (B)'!C49","v":"Stockpiling with Intent to Reclaim"},{"$f":"IF(ISBLANK('Step 5-Env Benefits (B)'!E49),\"BLANK\",'Step 5-Env Benefits (B)'!E49)","v":{"v":0,"d":"0.00"}}]
[null,null,{"$f":"'Step 5-Env Benefits (B)'!C50","v":"CFC-11 Destroyed"},{"$f":"IF(ISBLANK('Step 5-Env Benefits (B)'!E50),\"BLANK\",'Step 5-Env Benefits (B)'!E50)","v":{"v":0,"d":"0.00"}}]
[null,null,{"$f":"'Step 5-Env Benefits (B)'!C51","v":"HCFC-141b Destroyed"},{"$f":"IF(ISBLANK('Step 5-Env Benefits (B)'!E51),\"BLANK\",'Step 5-Env Benefits (B)'!E51)","v":{"v":0,"d":"0.00"}}]
[null,null,{"$f":"'Step 5-Env Benefits (B)'!C52","v":"HFC-134a Destroyed"},{"$f":"IF(ISBLANK('Step 5-Env Benefits (B)'!E52),\"BLANK\",'Step 5-Env Benefits (B)'!E52)","v":{"v":0,"d":"0.00"}}]
[null,null,{"$f":"'Step 5-Env Benefits (B)'!C53","v":"HFC-245fa Destroyed"},{"$f":"IF(ISBLANK('Step 5-Env Benefits (B)'!E53),\"BLANK\",'Step 5-Env Benefits (B)'!E53)","v":{"v":0,"d":"0.00"}}]
[null,null,{"$f":"'Step 5-Env Benefits (B)'!C54","v":"Destroyed"},{"$f":"IF(ISBLANK('Step 5-Env Benefits (B)'!E54),\"BLANK\",'Step 5-Env Benefits (B)'!E54)","v":{"v":0,"d":"0.00"}}]
[null,null,{"$f":"'Step 5-Env Benefits (B)'!C55","v":"CFC-11 Stockpiling with Intent to Destroy"},{"$f":"IF(ISBLANK('Step 5-Env Benefits (B)'!E55),\"BLANK\",'Step 5-Env Benefits (B)'!E55)","v":{"v":0,"d":"0.00"}}]
[null,null,{"$f":"'Step 5-Env Benefits (B)'!C56","v":"HCFC-141b Stockpiling with Intent to Destroy"},{"$f":"IF(ISBLANK('Step 5-Env Benefits (B)'!E56),\"BLANK\",'Step 5-Env Benefits (B)'!E56)","v":{"v":0,"d":"0.00"}}]
[null,null,{"$f":"'Step 5-Env Benefits (B)'!C57","v":"HFC-134a Stockpiling with Intent to Destroy"},{"$f":"IF(ISBLANK('Step 5-Env Benefits (B)'!E57),\"BLANK\",'Step 5-Env Benefits (B)'!E57)","v":{"v":0,"d":"0.00"}}]
[null,null,{"$f":"'Step 5-Env Benefits (B)'!C58","v":"HFC-245fa Stockpiling with Intent to Destroy"},{"$f":"IF(ISBLANK('Step 5-Env Benefits (B)'!E58),\"BLANK\",'Step 5-Env Benefits (B)'!E58)","v":{"v":0,"d":"0.00"}}]
[null,null,{"$f":"'Step 5-Env Benefits (B)'!C59","v":"Stockpiling with Intent to Destroy"},{"$f":"IF(ISBLANK('Step 5-Env Benefits (B)'!E59),\"BLANK\",'Step 5-Env Benefits (B)'!E59)","v":{"v":0,"d":"0.00"}}]
[null,null,{"$f":"'Step 5-Env Benefits (B)'!C60","v":"Subtotal"},{"$f":"IF(ISBLANK('Step 5-Env Benefits (B)'!E60),\"BLANK\",'Step 5-Env Benefits (B)'!E60)","v":{"v":0,"d":"0.00"}}]
[]
[{"$nulls":3},{"$f":"'Step 5-Env Benefits (B)'!F7","v":"Greenhouse Gas (GHG) Emissions Avoided (MtCO2eq)a"}]
[null,null,{"$f":"'Step 5-Env Benefits (B)'!C9","v":"Refrigerantc"},{"$f":"'Step 5-Env Benefits (B)'!F8","v":{"v":0,"d":"0.00"}}]
[null,null,{"$f":"'Step 5-Env Benefits (B)'!C10","v":"CFC-12 Reclaimed"},{"$f":"'Step 5-Env Benefits (B)'!F10","v":{"v":0,"d":"0.00"}}]
[null,null,{"$f":"'Step 5-Env Benefits (B)'!C11","v":"HCFC-22 Reclaimed"},{"$f":"'Step 5-Env Benefits (B)'!F11","v":{"v":0,"d":"0.00"}}]
[null,null,{"$f":"'Step 5-Env Benefits (B)'!C12","v":"HFC-134a Reclaimed"},{"$f":"'Step 5-Env Benefits (B)'!F12","v":{"v":0,"d":"0.00"}}]
[null,null,{"$f":"'Step 5-Env Benefits (B)'!C13","v":"R-500 Reclaimed"},{"$f":"'Step 5-Env Benefits (B)'!F13","v":{"v":0,"d":"0.00"}}]
[null,null,{"$f":"'Step 5-Env Benefits (B)'!C14","v":"R-407C Reclaimed"},{"$f":"'Step 5-Env Benefits (B)'!F14","v":{"v":0,"d":"0.00"}}]
[null,null,{"$f":"'Step 5-Env Benefits (B)'!C15","v":"R-410A Reclaimed"},{"$f":"'Step 5-Env Benefits (B)'!F15","v":{"v":0,"d":"0.00"}}]
[null,null,{"$f":"'Step 5-Env Benefits (B)'!C16","v":"Reclaimed"},{"$f":"'Step 5-Env Benefits (B)'!F16","v":{"v":0,"d":"0.00"}}]
[null,null,{"$f":"'Step 5-Env Benefits (B)'!C17","v":"CFC-12 Stockpiling with Intent to Reclaim"},{"$f":"'Step 5-Env Benefits (B)'!F17","v":{"v":0,"d":"0.00"}}]
[null,null,{"$f":"'Step 5-Env Benefits (B)'!C18","v":"HCFC-22 Stockpiling with Intent to Reclaim"},{"$f":"'Step 5-Env Benefits (B)'!F18","v":{"v":0,"d":"0.00"}}]
[null,null,{"$f":"'Step 5-Env Benefits (B)'!C19","v":"HFC-134a Stockpiling with Intent to Reclaim"},{"$f":"'Step 5-Env Benefits (B)'!F19","v":{"v":0,"d":"0.00"}}]
[null,null,{"$f":"'Step 5-Env Benefits (B)'!C20","v":"R-500 Stockpiling with Intent to Reclaim"},{"$f":"'Step 5-Env Benefits (B)'!F20","v":{"v":0,"d":"0.00"}}]
[null,null,{"$f":"'Step 5-Env Benefits (B)'!C21","v":"R-407C Stockpiling with Intent to Reclaim"},{"$f":"'Step 5-Env Benefits (B)'!F21","v":{"v":0,"d":"0.00"}}]
[null,null,{"$f":"'Step 5-Env Benefits (B)'!C22","v":"R-410A Stockpiling with Intent to Reclaim"},{"$f":"'Step 5-Env Benefits (B)'!F22","v":{"v":0,"d":"0.00"}}]
[null,null,{"$f":"'Step 5-Env Benefits (B)'!C23","v":"Stockpiling with Intent to Reclaim"},{"$f":"'Step 5-Env Benefits (B)'!F23","v":{"v":0,"d":"0.00"}}]
[null,null,{"$f":"'Step 5-Env Benefits (B)'!C24","v":"CFC-12 Destroyed"},{"$f":"'Step 5-Env Benefits (B)'!F24","v":{"v":0,"d":"0.00"}}]
[null,null,{"$f":"'Step 5-Env Benefits (B)'!C25","v":"HCFC-22 Destroyed"},{"$f":"'Step 5-Env Benefits (B)'!F25","v":{"v":0,"d":"0.00"}}]
[null,null,{"$f":"'Step 5-Env Benefits (B)'!C26","v":"HFC-134a Destroyed"},{"$f":"'Step 5-Env Benefits (B)'!F26","v":{"v":0,"d":"0.00"}}]
[null,null,{"$f":"'Step 5-Env Benefits (B)'!C27","v":"R-500 Destroyed"},{"$f":"'Step 5-Env Benefits (B)'!F27","v":{"v":0,"d":"0.00"}}]
[null,null,{"$f":"'Step 5-Env Benefits (B)'!C28","v":"R-407C Destroyed"},{"$f":"'Step 5-Env Benefits (B)'!F28","v":{"v":0,"d":"0.00"}}]
[null,null,{"$f":"'Step 5-Env Benefits (B)'!C29","v":"R-410A Destroyed"},{"$f":"'Step 5-Env Benefits (B)'!F29","v":{"v":0,"d":"0.00"}}]
[null,null,{"$f":"'Step 5-Env Benefits (B)'!C30","v":"Destroyed"},{"$f":"'Step 5-Env Benefits (B)'!F30","v":{"v":0,"d":"0.00"}}]
[null,null,{"$f":"'Step 5-Env Benefits (B)'!C31","v":"CFC-12 Stockpiling with Intent to Destroy"},{"$f":"'Step 5-Env Benefits (B)'!F31","v":{"v":0,"d":"0.00"}}]
[null,null,{"$f":"'Step 5-Env Benefits (B)'!C32","v":"HCFC-22 Stockpiling with Intent to Destroy"},{"$f":"'Step 5-Env Benefits (B)'!F32","v":{"v":0,"d":"0.00"}}]
[null,null,{"$f":"'Step 5-Env Benefits (B)'!C33","v":"HFC-134a Stockpiling with Intent to Destroy"},{"$f":"'Step 5-Env Benefits (B)'!F33","v":{"v":0,"d":"0.00"}}]
[null,null,{"$f":"'Step 5-Env Benefits (B)'!C34","v":"R-500 Stockpiling with Intent to Destroy"},{"$f":"'Step 5-Env Benefits (B)'!F34","v":{"v":0,"d":"0.00"}}]
[null,null,{"$f":"'Step 5-Env Benefits (B)'!C35","v":"R-407C Stockpiling with Intent to Destroy"},{"$f":"'Step 5-Env Benefits (B)'!F35","v":{"v":0,"d":"0.00"}}]
[null,null,{"$f":"'Step 5-Env Benefits (B)'!C36","v":"R-410A Stockpiling with Intent to Destroy"},{"$f":"'Step 5-Env Benefits (B)'!F36","v":{"v":0,"d":"0.00"}}]
[null,null,{"$f":"'Step 5-Env Benefits (B)'!C37","v":"Stockpiling with Intent to Destroy"},{"$f":"'Step 5-Env Benefits (B)'!F37","v":{"v":0,"d":"0.00"}}]
[null,null,{"$f":"'Step 5-Env Benefits (B)'!C38","v":"Subtotal"},{"$f":"'Step 5-Env Benefits (B)'!F38","v":{"v":0,"d":"0.00"}}]
[null,null,{"$f":"'Step 5-Env Benefits (B)'!C39","v":"Foam-Blowing Agentd"}]
[null,null,{"$f":"'Step 5-Env Benefits (B)'!C40","v":"CFC-11 Reclaimed"},{"$f":"'Step 5-Env Benefits (B)'!F40","v":{"v":0,"d":"0.00"}}]
[null,null,{"$f":"'Step 5-Env Benefits (B)'!C41","v":"HCFC-141b Reclaimed"},{"$f":"'Step 5-Env Benefits (B)'!F41","v":{"v":0,"d":"0.00"}}]
[null,null,{"$f":"'Step 5-Env Benefits (B)'!C42","v":"HFC-134a Reclaimed"},{"$f":"'Step 5-Env Benefits (B)'!F42","v":{"v":0,"d":"0.00"}}]
[null,null,{"$f":"'Step 5-Env Benefits (B)'!C43","v":"HFC-245fa Reclaimed"},{"$f":"'Step 5-Env Benefits (B)'!F43","v":{"v":0,"d":"0.00"}}]
[null,null,{"$f":"'Step 5-Env Benefits (B)'!C44","v":"Reclaimed"},{"$f":"'Step 5-Env Benefits (B)'!F44","v":{"v":0,"d":"0.00"}}]
[null,null,{"$f":"'Step 5-Env Benefits (B)'!C45","v":"CFC-11 Stockpiling with Intent to Reclaim"},{"$f":"'Step 5-Env Benefits (B)'!F45","v":{"v":0,"d":"0.00"}}]
[null,null,{"$f":"'Step 5-Env Benefits (B)'!C46","v":"HCFC-141b Stockpiling with Intent to Reclaim"},{"$f":"'Step 5-Env Benefits (B)'!F46","v":{"v":0,"d":"0.00"}}]
[null,null,{"$f":"'Step 5-Env Benefits (B)'!C47","v":"HFC-134a Stockpiling with Intent to Reclaim"},{"$f":"'Step 5-Env Benefits (B)'!F47","v":{"v":0,"d":"0.00"}}]
[null,null,{"$f":"'Step 5-Env Benefits (B)'!C48","v":"HFC-245fa Stockpiling with Intent to Reclaim"},{"$f":"'Step 5-Env Benefits (B)'!F48","v":{"v":0,"d":"0.00"}}]
[null,null,{"$f":"'Step 5-Env Benefits (B)'!C49","v":"Stockpiling with Intent to Reclaim"},{"$f":"'Step 5-Env Benefits (B)'!F49","v":{"v":0,"d":"0.00"}}]
[null,null,{"$f":"'Step 5-Env Benefits (B)'!C50","v":"CFC-11 Destroyed"},{"$f":"'Step 5-Env Benefits (B)'!F50","v":{"v":0,"d":"0.00"}}]
[null,null,{"$f":"'Step 5-Env Benefits (B)'!C51","v":"HCFC-141b Destroyed"},{"$f":"'Step 5-Env Benefits (B)'!F51","v":{"v":0,"d":"0.00"}}]
[null,null,{"$f":"'Step 5-Env Benefits (B)'!C52","v":"HFC-134a Destroyed"},{"$f":"'Step 5-Env Benefits (B)'!F52","v":{"v":0,"d":"0.00"}}]
[null,null,{"$f":"'Step 5-Env Benefits (B)'!C53","v":"HFC-245fa Destroyed"},{"$f":"'Step 5-Env Benefits (B)'!F53","v":{"v":0,"d":"0.00"}}]
[null,null,{"$f":"'Step 5-Env Benefits (B)'!C54","v":"Destroyed"},{"$f":"'Step 5-Env Benefits (B)'!F54","v":{"v":0,"d":"0.00"}}]
[null,null,{"$f":"'Step 5-Env Benefits (B)'!C55","v":"CFC-11 Stockpiling with Intent to Destroy"},{"$f":"'Step 5-Env Benefits (B)'!F55","v":{"v":0,"d":"0.00"}}]
[null,null,{"$f":"'Step 5-Env Benefits (B)'!C56","v":"HCFC-141b Stockpiling with Intent to Destroy"},{"$f":"'Step 5-Env Benefits (B)'!F56","v":{"v":0,"d":"0.00"}}]
[null,null,{"$f":"'Step 5-Env Benefits (B)'!C57","v":"HFC-134a Stockpiling with Intent to Destroy"},{"$f":"'Step 5-Env Benefits (B)'!F57","v":{"v":0,"d":"0.00"}}]
[null,null,{"$f":"'Step 5-Env Benefits (B)'!C58","v":"HFC-245fa Stockpiling with Intent to Destroy"},{"$f":"'Step 5-Env Benefits (B)'!F58","v":{"v":0,"d":"0.00"}}]
[null,null,{"$f":"'Step 5-Env Benefits (B)'!C59","v":"Stockpiling with Intent to Destroy"},{"$f":"'Step 5-Env Benefits (B)'!F59","v":{"v":0,"d":"0.00"}}]
[null,null,{"$f":"'Step 5-Env Benefits (B)'!C60","v":"Subtotal"},{"$f":"'Step 5-Env Benefits (B)'!F60","v":{"v":0,"d":"0.00"}}]
[]
[]
[{"$nulls":3},{"$f":"'Step 5-Env Benefits (B)'!H7","v":"Ozone Depleting Substances (ODS) Emissions Avoided (ODP-Weighted kg)b"}]
[null,null,{"$f":"'Step 5-Env Benefits (B)'!C9","v":"Refrigerantc"},{"$f":"'Step 5-Env Benefits (B)'!H8","v":{"v":0,"d":"0.00"}}]
[null,null,{"$f":"'Step 5-Env Benefits (B)'!C10","v":"CFC-12 Reclaimed"},{"$f":"'Step 5-Env Benefits (B)'!H10","v":{"v":0,"d":"0.00"}}]
[null,null,{"$f":"'Step 5-Env Benefits (B)'!C11","v":"HCFC-22 Reclaimed"},{"$f":"'Step 5-Env Benefits (B)'!H11","v":{"v":0,"d":"0.00"}}]
[null,null,{"$f":"'Step 5-Env Benefits (B)'!C12","v":"HFC-134a Reclaimed"},{"$f":"'Step 5-Env Benefits (B)'!H12","v":{"v":0,"d":"0.00"}}]
[null,null,{"$f":"'Step 5-Env Benefits (B)'!C13","v":"R-500 Reclaimed"},{"$f":"'Step 5-Env Benefits (B)'!H13","v":{"v":0,"d":"0.00"}}]
[null,null,{"$f":"'Step 5-Env Benefits (B)'!C14","v":"R-407C Reclaimed"},{"$f":"'Step 5-Env Benefits (B)'!H14","v":{"v":0,"d":"0.00"}}]
[null,null,{"$f":"'Step 5-Env Benefits (B)'!C15","v":"R-410A Reclaimed"},{"$f":"'Step 5-Env Benefits (B)'!H15","v":{"v":0,"d":"0.00"}}]
[null,null,{"$f":"'Step 5-Env Benefits (B)'!C16","v":"Reclaimed"},{"$f":"'Step 5-Env Benefits (B)'!H16","v":{"v":0,"d":"0.00"}}]
[null,null,{"$f":"'Step 5-Env Benefits (B)'!C17","v":"CFC-12 Stockpiling with Intent to Reclaim"},{"$f":"'Step 5-Env Benefits (B)'!H17","v":{"v":0,"d":"0.00"}}]
[null,null,{"$f":"'Step 5-Env Benefits (B)'!C18","v":"HCFC-22 Stockpiling with Intent to Reclaim"},{"$f":"'Step 5-Env Benefits (B)'!H18","v":{"v":0,"d":"0.00"}}]
[null,null,{"$f":"'Step 5-Env Benefits (B)'!C19","v":"HFC-134a Stockpiling with Intent to Reclaim"},{"$f":"'Step 5-Env Benefits (B)'!H19","v":{"v":0,"d":"0.00"}}]
[null,null,{"$f":"'Step 5-Env Benefits (B)'!C20","v":"R-500 Stockpiling with Intent to Reclaim"},{"$f":"'Step 5-Env Benefits (B)'!H20","v":{"v":0,"d":"0.00"}}]
[null,null,{"$f":"'Step 5-Env Benefits (B)'!C21","v":"R-407C Stockpiling with Intent to Reclaim"},{"$f":"'Step 5-Env Benefits (B)'!H21","v":{"v":0,"d":"0.00"}}]
[null,null,{"$f":"'Step 5-Env Benefits (B)'!C22","v":"R-410A Stockpiling with Intent to Reclaim"},{"$f":"'Step 5-Env Benefits (B)'!H22","v":{"v":0,"d":"0.00"}}]
[null,null,{"$f":"'Step 5-Env Benefits (B)'!C23","v":"Stockpiling with Intent to Reclaim"},{"$f":"'Step 5-Env Benefits (B)'!H23","v":{"v":0,"d":"0.00"}}]
[null,null,{"$f":"'Step 5-Env Benefits (B)'!C24","v":"CFC-12 Destroyed"},{"$f":"'Step 5-Env Benefits (B)'!H24","v":{"v":0,"d":"0.00"}}]
[null,null,{"$f":"'Step 5-Env Benefits (B)'!C25","v":"HCFC-22 Destroyed"},{"$f":"'Step 5-Env Benefits (B)'!H25","v":{"v":0,"d":"0.00"}}]
[null,null,{"$f":"'Step 5-Env Benefits (B)'!C26","v":"HFC-134a Destroyed"},{"$f":"'Step 5-Env Benefits (B)'!H26","v":{"v":0,"d":"0.00"}}]
[null,null,{"$f":"'Step 5-Env Benefits (B)'!C27","v":"R-500 Destroyed"},{"$f":"'Step 5-Env Benefits (B)'!H27","v":{"v":0,"d":"0.00"}}]
[null,null,{"$f":"'Step 5-Env Benefits (B)'!C28","v":"R-407C Destroyed"},{"$f":"'Step 5-Env Benefits (B)'!H28","v":{"v":0,"d":"0.00"}}]
[null,null,{"$f":"'Step 5-Env Benefits (B)'!C29","v":"R-410A Destroyed"},{"$f":"'Step 5-Env Benefits (B)'!H29","v":{"v":0,"d":"0.00"}}]
[null,null,{"$f":"'Step 5-Env Benefits (B)'!C30","v":"Destroyed"},{"$f":"'Step 5-Env Benefits (B)'!H30","v":{"v":0,"d":"0.00"}}]
[null,null,{"$f":"'Step 5-Env Benefits (B)'!C31","v":"CFC-12 Stockpiling with Intent to Destroy"},{"$f":"'Step 5-Env Benefits (B)'!H31","v":{"v":0,"d":"0.00"}}]
[null,null,{"$f":"'Step 5-Env Benefits (B)'!C32","v":"HCFC-22 Stockpiling with Intent to Destroy"},{"$f":"'Step 5-Env Benefits (B)'!H32","v":{"v":0,"d":"0.00"}}]
[null,null,{"$f":"'Step 5-Env Benefits (B)'!C33","v":"HFC-134a Stockpiling with Intent to Destroy"},{"$f":"'Step 5-Env Benefits (B)'!H33","v":{"v":0,"d":"0.00"}}]
[null,null,{"$f":"'Step 5-Env Benefits (B)'!C34","v":"R-500 Stockpiling with Intent to Destroy"},{"$f":"'Step 5-Env Benefits (B)'!H34","v":{"v":0,"d":"0.00"}}]
[null,null,{"$f":"'Step 5-Env Benefits (B)'!C35","v":"R-407C Stockpiling with Intent to Destroy"},{"$f":"'Step 5-Env Benefits (B)'!H35","v":{"v":0,"d":"0.00"}}]
[null,null,{"$f":"'Step 5-Env Benefits (B)'!C36","v":"R-410A Stockpiling with Intent to Destroy"},{"$f":"'Step 5-Env Benefits (B)'!H36","v":{"v":0,"d":"0.00"}}]
[null,null,{"$f":"'Step 5-Env Benefits (B)'!C37","v":"Stockpiling with Intent to Destroy"},{"$f":"'Step 5-Env Benefits (B)'!H37","v":{"v":0,"d":"0.00"}}]
[null,null,{"$f":"'Step 5-Env Benefits (B)'!C38","v":"Subtotal"},{"$f":"'Step 5-Env Benefits (B)'!H38","v":{"v":0,"d":"0.00"}}]
[null,null,{"$f":"'Step 5-Env Benefits (B)'!C39","v":"Foam-Blowing Agentd"}]
[null,null,{"$f":"'Step 5-Env Benefits (B)'!C40","v":"CFC-11 Reclaimed"},{"$f":"'Step 5-Env Benefits (B)'!H40","v":{"v":0,"d":"0.00"}}]
[null,null,{"$f":"'Step 5-Env Benefits (B)'!C41","v":"HCFC-141b Reclaimed"},{"$f":"'Step 5-Env Benefits (B)'!H41","v":{"v":0,"d":"0.00"}}]
[null,null,{"$f":"'Step 5-Env Benefits (B)'!C42","v":"HFC-134a Reclaimed"},{"$f":"'Step 5-Env Benefits (B)'!H42","v":{"v":0,"d":"0.00"}}]
[null,null,{"$f":"'Step 5-Env Benefits (B)'!C43","v":"HFC-245fa Reclaimed"},{"$f":"'Step 5-Env Benefits (B)'!H43","v":{"v":0,"d":"0.00"}}]
[null,null,{"$f":"'Step 5-Env Benefits (B)'!C44","v":"Reclaimed"},{"$f":"'Step 5-Env Benefits (B)'!H44","v":{"v":0,"d":"0.00"}}]
[null,null,{"$f":"'Step 5-Env Benefits (B)'!C45","v":"CFC-11 Stockpiling with Intent to Reclaim"},{"$f":"'Step 5-Env Benefits (B)'!H45","v":{"v":0,"d":"0.00"}}]
[null,null,{"$f":"'Step 5-Env Benefits (B)'!C46","v":"HCFC-141b Stockpiling with Intent to Reclaim"},{"$f":"'Step 5-Env Benefits (B)'!H46","v":{"v":0,"d":"0.00"}}]
[null,null,{"$f":"'Step 5-Env Benefits (B)'!C47","v":"HFC-134a Stockpiling with Intent to Reclaim"},{"$f":"'Step 5-Env Benefits (B)'!H47","v":{"v":0,"d":"0.00"}}]
[null,null,{"$f":"'Step 5-Env Benefits (B)'!C48","v":"HFC-245fa Stockpiling with Intent to Reclaim"},{"$f":"'Step 5-Env Benefits (B)'!H48","v":{"v":0,"d":"0.00"}}]
[null,null,{"$f":"'Step 5-Env Benefits (B)'!C49","v":"Stockpiling with Intent to Reclaim"},{"$f":"'Step 5-Env Benefits (B)'!H49","v":{"v":0,"d":"0.00"}}]
[null,null,{"$f":"'Step 5-Env Benefits (B)'!C50","v":"CFC-11 Destroyed"},{"$f":"'Step 5-Env Benefits (B)'!H50","v":{"v":0,"d":"0.00"}}]
[null,null,{"$f":"'Step 5-Env Benefits (B)'!C51","v":"HCFC-141b Destroyed"},{"$f":"'Step 5-Env Benefits (B)'!H51","v":{"v":0,"d":"0.00"}}]
[null,null,{"$f":"'Step 5-Env Benefits (B)'!C52","v":"HFC-134a Destroyed"},{"$f":"'Step 5-Env Benefits (B)'!H52","v":{"v":0,"d":"0.00"}}]
[null,null,{"$f":"'Step 5-Env Benefits (B)'!C53","v":"HFC-245fa Destroyed"},{"$f":"'Step 5-Env Benefits (B)'!H53","v":{"v":0,"d":"0.00"}}]
[null,null,{"$f":"'Step 5-Env Benefits (B)'!C54","v":"Destroyed"},{"$f":"'Step 5-Env Benefits (B)'!H54","v":{"v":0,"d":"0.00"}}]
[null,null,{"$f":"'Step 5-Env Benefits (B)'!C55","v":"CFC-11 Stockpiling with Intent to Destroy"},{"$f":"'Step 5-Env Benefits (B)'!H55","v":{"v":0,"d":"0.00"}}]
[null,null,{"$f":"'Step 5-Env Benefits (B)'!C56","v":"HCFC-141b Stockpiling with Intent to Destroy"},{"$f":"'Step 5-Env Benefits (B)'!H56","v":{"v":0,"d":"0.00"}}]
[null,null,{"$f":"'Step 5-Env Benefits (B)'!C57","v":"HFC-134a Stockpiling with Intent to Destroy"},{"$f":"'Step 5-Env Benefits (B)'!H57","v":{"v":0,"d":"0.00"}}]
[null,null,{"$f":"'Step 5-Env Benefits (B)'!C58","v":"HFC-245fa Stockpiling with Intent to Destroy"},{"$f":"'Step 5-Env Benefits (B)'!H58","v":{"v":0,"d":"0.00"}}]
[null,null,{"$f":"'Step 5-Env Benefits (B)'!C59","v":"Stockpiling with Intent to Destroy"},{"$f":"'Step 5-Env Benefits (B)'!H59","v":{"v":0,"d":"0.00"}}]
[null,null,{"$f":"'Step 5-Env Benefits (B)'!C60","v":"Subtotal"},{"$f":"'Step 5-Env Benefits (B)'!H60","v":{"v":0,"d":"0.00"}}]
[]
[null,null,{"$f":"'Step 5-Env Benefits'!D7","v":"Total Amount Prevented from Being Emitted"},{"$f":"'Step 5-Env Benefits (B)'!D8:E8","v":"(lb)"}]
[null,null,"Durable Materials",{"$f":"'Step 5-Env Benefits (B)'!D61","v":{"v":0,"d":"0.00"}}]
[null,null,"Ferrous Metal Recycled",{"$f":"'Step 5-Env Benefits (B)'!D62","v":{"v":0,"d":"0.00"}}]
[null,null,"Non-ferrous Metal Recycled",{"$f":"'Step 5-Env Benefits (B)'!D63","v":{"v":0,"d":"0.00"}}]
[null,null,"Plastic Recycled",{"$f":"'Step 5-Env Benefits (B)'!D64","v":{"v":0,"d":"0.00"}}]
[null,null,"Glass Recycled",{"$f":"'Step 5-Env Benefits (B)'!D65","v":{"v":0,"d":"0.00"}}]
[null,null,"Subtotal",{"$f":"'Step 5-Env Benefits (B)'!D66","v":{"v":0,"d":"0.00"}}]
[null,null,"Removing Units from the Grid",{"$f":"'Step 5-Env Benefits (B)'!D67","v":{"v":0,"d":"0.00"}}]
[null,null,"Subtotal Energy Savings",{"$f":"'Step 5-Env Benefits (B)'!D68","v":"NA"}]
[]
[null,null,"Total Amount Prevented from Being Emitted",{"$f":"'Step 5-Env Benefits (B)'!E8","v":"(kg)"}]
[null,null,"Durable Materials",{"$f":"'Step 5-Env Benefits (B)'!E9","v":{"v":0,"d":"0.00"}}]
[null,null,"Ferrous Metal Recycled",{"$f":"'Step 5-Env Benefits (B)'!E62","v":{"v":0,"d":"0.00"}}]
[null,null,"Non-ferrous Metal Recycled",{"$f":"'Step 5-Env Benefits (B)'!E63","v":{"v":0,"d":"0.00"}}]
[null,null,"Plastic Recycled",{"$f":"'Step 5-Env Benefits (B)'!E64","v":{"v":0,"d":"0.00"}}]
[null,null,"Glass Recycled",{"$f":"'Step 5-Env Benefits (B)'!E65","v":{"v":0,"d":"0.00"}}]
[null,null,"Subtotal",{"$f":"'Step 5-Env Benefits (B)'!E66","v":{"v":0,"d":"0.00"}}]
[null,null,"Removing Units from the Grid",{"$f":"'Step 5-Env Benefits (B)'!E67","v":{"v":0,"d":"0.00"}}]
[null,null,"Subtotal Energy Savings",{"$f":"'Step 5-Env Benefits (B)'!E68","v":"NA"}]
[]
[null,null,"Total Amount Prevented from Being Emitted",{"$f":"'Step 5-Env Benefits (B)'!F7","v":"Greenhouse Gas (GHG) Emissions Avoided (MtCO2eq)a"}]
[null,null,"Durable Materials",{"$f":"'Step 5-Env Benefits (B)'!F61","v":{"v":0,"d":"0.00"}}]
[null,null,"Ferrous Metal Recycled",{"$f":"'Step 5-Env Benefits (B)'!F62","v":{"v":0,"d":"0.00"}}]
[null,null,"Non-ferrous Metal Recycled",{"$f":"'Step 5-Env Benefits (B)'!F63","v":{"v":0,"d":"0.00"}}]
[null,null,"Plastic Recycled",{"$f":"'Step 5-Env Benefits (B)'!F64","v":{"v":0,"d":"0.00"}}]
[null,null,"Glass Recycled",{"$f":"'Step 5-Env Benefits (B)'!F65","v":{"v":0,"d":"0.00"}}]
[null,null,"Subtotal",{"$f":"'Step 5-Env Benefits (B)'!F66","v":{"v":0,"d":"0.00"}}]
[null,null,"Removing Units from the Grid",{"$f":"'Step 5-Env Benefits (B)'!F67","v":{"v":0,"d":"0.00"}}]
[null,null,"Subtotal Energy Savings",{"$f":"'Step 5-Env Benefits (B)'!F68","v":{"$error":"#VALUE!"}}]
[]
[null,null,{"$f":"'Step 5-Env Benefits'!C69","v":"TOTAL"}]
[null,null,{"$f":"'Step 5-Env Benefits'!D8","v":"(lb)"},{"$f":"'Step 5-Env Benefits (B)'!D69","v":"NA"}]
[null,null,{"$f":"'Step 5-Env Benefits'!E8","v":"(kg)"},{"$f":"'Step 5-Env Benefits (B)'!E69","v":"NA"}]
[null,null,{"$f":"'Step 5-Env Benefits'!F7","v":"Greenhouse Gas (GHG) Emissions Avoided (MTCO2eq)a"},{"$f":"'Step 5-Env Benefits (B)'!F69","v":{"$error":"#VALUE!"}}]
[null,null,{"$f":"'Step 5-Env Benefits'!H7","v":"Ozone Depleting Substances (ODS) Emissions Avoided (ODP-Weighted kg)b"},{"$f":"'Step 5-Env Benefits (B)'!H69","v":{"v":0,"d":"0.00"}}]
[]
[]
[null,null,"Hazardous Components"]
[null,null,{"$f":"'Step 5-Env Benefits'!C80","v":"Properly Recovered Component"},{"$f":"IF(ISBLANK('Step 5-Env Benefits (B)'!D80),\"BLANK\",'Step 5-Env Benefits (B)'!D80)","v":"Total Amount"}]
[null,null,{"$f":"'Step 5-Env Benefits'!C81","v":"Used Oil Recycled or Properly Disposed (gal)"},{"$f":"IF(ISBLANK('Step 5-Env Benefits (B)'!D81),\"BLANK\",'Step 5-Env Benefits (B)'!D81)","v":{"v":0,"d":"0.00"}}]
[null,null,{"$f":"'Step 5-Env Benefits'!C82","v":"PCB-Containing Capacitors"}]
[null,null,{"$f":"'Step 5-Env Benefits'!C83","v":"Number Destroyed"},{"$f":"IF(ISBLANK('Step 5-Env Benefits (B)'!D83),\"BLANK\",'Step 5-Env Benefits (B)'!D83)","v":{"v":0,"d":"0.00"}}]
[null,null,{"$f":"'Step 5-Env Benefits'!C84","v":"Mercury-Containing Components"}]
[null,null,{"$f":"'Step 5-Env Benefits'!C85","v":"Number Recycled"},{"$f":"IF(ISBLANK('Step 5-Env Benefits (B)'!D85),\"BLANK\",'Step 5-Env Benefits (B)'!D85)","v":{"v":0,"d":"0.00"}}]
[null,null,{"$f":"'Step 5-Env Benefits'!C86","v":"Number Disposed"},{"$f":"IF(ISBLANK('Step 5-Env Benefits (B)'!D86),\"BLANK\",'Step 5-Env Benefits (B)'!D86)","v":{"v":0,"d":"0.00"}}]
[]
[null,"Summary of Input Data (Original)"]
[]
[null,null,"Refrigerators/ Freezers"]
[null,null,{"$f":"'Step 5-QA_Input Data Summary'!C8","v":"Number of Units"},{"$f":"'Step 5-QA_Input Data Summary'!D8","v":0}]
[null,null,{"$f":"'Step 5-QA_Input Data Summary'!C9","v":"Refrigerant (lb)*"}]
[null,null,{"$f":"'Step 5-QA_Input Data Summary'!C10","v":"CFC-12"},{"$f":"'Step 5-QA_Input Data Summary'!D10","v":""}]
[null,null,{"$f":"'Step 5-QA_Input Data Summary'!C11","v":"HCFC-22"},{"$f":"'Step 5-QA_Input Data Summary'!D11","v":"NA"}]
[null,null,{"$f":"'Step 5-QA_Input Data Summary'!C12","v":"HFC-134a"},{"$f":"'Step 5-QA_Input Data Summary'!D12","v":""}]
[null,null,{"$f":"'Step 5-QA_Input Data Summary'!C14","v":"R-407C"},{"$f":"'Step 5-QA_Input Data Summary'!D14","v":"NA"}]
[null,null,{"$f":"'Step 5-QA_Input Data Summary'!C15","v":"R-410A"},{"$f":"'Step 5-QA_Input Data Summary'!D15","v":"NA"}]
[null,null,{"$f":"'Step 5-QA_Input Data Summary'!C16","v":"Average across all units"},{"$f":"'Step 5-QA_Input Data Summary'!D16","v":""}]
[null,null,{"$f":"'Step 5-QA_Input Data Summary'!C17","v":"Foam-Blowing Agent (lb)**"}]
[null,null,{"$f":"'Step 5-QA_Input Data Summary'!C18","v":"CFC-11"},{"$f":"'Step 5-QA_Input Data Summary'!D18","v":""}]
[null,null,{"$f":"'Step 5-QA_Input Data Summary'!C19","v":"HCFC-141b"},{"$f":"'Step 5-QA_Input Data Summary'!D19","v":""}]
[null,null,{"$f":"'Step 5-QA_Input Data Summary'!C20","v":"HFC-134a"},{"$f":"'Step 5-QA_Input Data Summary'!D20","v":""}]
[null,null,{"$f":"'Step 5-QA_Input Data Summary'!C21","v":"HFC-245fa"},{"$f":"'Step 5-QA_Input Data Summary'!D21","v":""}]
[null,null,{"$f":"'Step 5-QA_Input Data Summary'!C22","v":"Average across all units"},{"$f":"'Step 5-QA_Input Data Summary'!D22","v":""}]
[null,null,{"$f":"'Step 5-QA_Input Data Summary'!C23","v":"Durable Materials"}]
[null,null,{"$f":"'Step 5-QA_Input Data Summary'!C24","v":"Used oil (gal)"},{"$f":"'Step 5-QA_Input Data Summary'!D24","v":""}]
[null,null,{"$f":"'Step 5-QA_Input Data Summary'!C25","v":"Ferrous metals (lb)"},{"$f":"'Step 5-QA_Input Data Summary'!D25","v":""}]
[null,null,{"$f":"'Step 5-QA_Input Data Summary'!C26","v":"Non-ferrous metals (lb)"},{"$f":"'Step 5-QA_Input Data Summary'!D26","v":""}]
[null,null,{"$f":"'Step 5-QA_Input Data Summary'!C27","v":"Plastic (lb)"},{"$f":"'Step 5-QA_Input Data Summary'!D27","v":""}]
[null,null,{"$f":"'Step 5-QA_Input Data Summary'!C28","v":"Glass (lb)"},{"$f":"'Step 5-QA_Input Data Summary'!D28","v":""}]
[null,null,{"$f":"'Step 5-QA_Input Data Summary'!C29","v":"Number of PCB-containing capacitors"},{"$f":"'Step 5-QA_Input Data Summary'!D29","v":""}]
[null,null,{"$f":"'Step 5-QA_Input Data Summary'!C30","v":"Number of Mercury-containing components"},{"$f":"'Step 5-QA_Input Data Summary'!D30","v":"NA"}]
[null,null,{"$f":"'Step 5-QA_Input Data Summary'!E7","v":"Stand-Alone Freezers"}]
[null,null,{"$f":"'Step 5-QA_Input Data Summary'!C8","v":"Number of Units"},{"$f":"'Step 5-QA_Input Data Summary'!E8","v":0}]
[null,null,{"$f":"'Step 5-QA_Input Data Summary'!C9","v":"Refrigerant (lb)*"}]
[null,null,{"$f":"'Step 5-QA_Input Data Summary'!C10","v":"CFC-12"},{"$f":"'Step 5-QA_Input Data Summary'!E10","v":""}]
[null,null,{"$f":"'Step 5-QA_Input Data Summary'!C11","v":"HCFC-22"},{"$f":"'Step 5-QA_Input Data Summary'!E11","v":""}]
[null,null,{"$f":"'Step 5-QA_Input Data Summary'!C12","v":"HFC-134a"},{"$f":"'Step 5-QA_Input Data Summary'!E12","v":""}]
[null,null,{"$f":"'Step 5-QA_Input Data Summary'!C14","v":"R-407C"},{"$f":"'Step 5-QA_Input Data Summary'!E14","v":"NA"}]
[null,null,{"$f":"'Step 5-QA_Input Data Summary'!C15","v":"R-410A"},{"$f":"'Step 5-QA_Input Data Summary'!E15","v":"NA"}]
[null,null,{"$f":"'Step 5-QA_Input Data Summary'!C16","v":"Average across all units"},{"$f":"'Step 5-QA_Input Data Summary'!E16","v":""}]
[null,null,{"$f":"'Step 5-QA_Input Data Summary'!C17","v":"Foam-Blowing Agent (lb)**"}]
[null,null,{"$f":"'Step 5-QA_Input Data Summary'!C18","v":"CFC-11"},{"$f":"'Step 5-QA_Input Data Summary'!E18","v":""}]
[null,null,{"$f":"'Step 5-QA_Input Data Summary'!C19","v":"HCFC-141b"},{"$f":"'Step 5-QA_Input Data Summary'!E19","v":""}]
[null,null,{"$f":"'Step 5-QA_Input Data Summary'!C20","v":"HFC-134a"},{"$f":"'Step 5-QA_Input Data Summary'!E20","v":""}]
[null,null,{"$f":"'Step 5-QA_Input Data Summary'!C21","v":"HFC-245fa"},{"$f":"'Step 5-QA_Input Data Summary'!E21","v":""}]
[null,null,{"$f":"'Step 5-QA_Input Data Summary'!C22","v":"Average across all units"},{"$f":"'Step 5-QA_Input Data Summary'!E22","v":""}]
[null,null,{"$f":"'Step 5-QA_Input Data Summary'!C23","v":"Durable Materials"}]
[null,null,{"$f":"'Step 5-QA_Input Data Summary'!C24","v":"Used oil (gal)"},{"$f":"'Step 5-QA_Input Data Summary'!E24","v":""}]
[null,null,{"$f":"'Step 5-QA_Input Data Summary'!C25","v":"Ferrous metals (lb)"},{"$f":"'Step 5-QA_Input Data Summary'!E25","v":""}]
[null,null,{"$f":"'Step 5-QA_Input Data Summary'!C26","v":"Non-ferrous metals (lb)"},{"$f":"'Step 5-QA_Input Data Summary'!E26","v":""}]
[null,null,{"$f":"'Step 5-QA_Input Data Summary'!C27","v":"Plastic (lb)"},{"$f":"'Step 5-QA_Input Data Summary'!E27","v":""}]
[null,null,{"$f":"'Step 5-QA_Input Data Summary'!C28","v":"Glass (lb)"},{"$f":"'Step 5-QA_Input Data Summary'!E28","v":"NA"}]
[null,null,{"$f":"'Step 5-QA_Input Data Summary'!C29","v":"Number of PCB-containing capacitors"},{"$f":"'Step 5-QA_Input Data Summary'!E29","v":""}]
[null,null,{"$f":"'Step 5-QA_Input Data Summary'!C30","v":"Number of Mercury-containing components"},{"$f":"'Step 5-QA_Input Data Summary'!E30","v":""}]
[null,null,"Air Conditioning Units"]
[null,null,{"$f":"'Step 5-QA_Input Data Summary'!C8","v":"Number of Units"},{"$f":"'Step 5-QA_Input Data Summary'!F8","v":0}]
[null,null,{"$f":"'Step 5-QA_Input Data Summary'!C9","v":"Refrigerant (lb)*"}]
[null,null,{"$f":"'Step 5-QA_Input Data Summary'!C10","v":"CFC-12"},{"$f":"'Step 5-QA_Input Data Summary'!F10","v":"NA"}]
[null,null,{"$f":"'Step 5-QA_Input Data Summary'!C11","v":"HCFC-22"},{"$f":"'Step 5-QA_Input Data Summary'!F11","v":""}]
[null,null,{"$f":"'Step 5-QA_Input Data Summary'!C12","v":"HFC-134a"},{"$f":"'Step 5-QA_Input Data Summary'!F12","v":"NA"}]
[null,null,{"$f":"'Step 5-QA_Input Data Summary'!C14","v":"R-407C"},{"$f":"'Step 5-QA_Input Data Summary'!F14","v":""}]
[null,null,{"$f":"'Step 5-QA_Input Data Summary'!C15","v":"R-410A"},{"$f":"'Step 5-QA_Input Data Summary'!F15","v":""}]
[null,null,{"$f":"'Step 5-QA_Input Data Summary'!C16","v":"Average across all units"},{"$f":"'Step 5-QA_Input Data Summary'!F16","v":""}]
[null,null,{"$f":"'Step 5-QA_Input Data Summary'!C17","v":"Foam-Blowing Agent (lb)**"}]
[null,null,{"$f":"'Step 5-QA_Input Data Summary'!C18","v":"CFC-11"},{"$f":"'Step 5-QA_Input Data Summary'!F18","v":"NA"}]
[null,null,{"$f":"'Step 5-QA_Input Data Summary'!C19","v":"HCFC-141b"},{"$f":"'Step 5-QA_Input Data Summary'!F19","v":"NA"}]
[null,null,{"$f":"'Step 5-QA_Input Data Summary'!C20","v":"HFC-134a"},{"$f":"'Step 5-QA_Input Data Summary'!F20","v":"NA"}]
[null,null,{"$f":"'Step 5-QA_Input Data Summary'!C21","v":"HFC-245fa"},{"$f":"'Step 5-QA_Input Data Summary'!F21","v":"NA"}]
[null,null,{"$f":"'Step 5-QA_Input Data Summary'!C22","v":"Average across all units"},{"$f":"'Step 5-QA_Input Data Summary'!F22","v":"NA"}]
[null,null,{"$f":"'Step 5-QA_Input Data Summary'!C23","v":"Durable Materials"}]
[null,null,{"$f":"'Step 5-QA_Input Data Summary'!C24","v":"Used oil (gal)"},{"$f":"'Step 5-QA_Input Data Summary'!F24","v":""}]
[null,null,{"$f":"'Step 5-QA_Input Data Summary'!C25","v":"Ferrous metals (lb)"},{"$f":"'Step 5-QA_Input Data Summary'!F25","v":""}]
[null,null,{"$f":"'Step 5-QA_Input Data Summary'!C26","v":"Non-ferrous metals (lb)"},{"$f":"'Step 5-QA_Input Data Summary'!F26","v":""}]
[null,null,{"$f":"'Step 5-QA_Input Data Summary'!C27","v":"Plastic (lb)"},{"$f":"'Step 5-QA_Input Data Summary'!F27","v":""}]
[null,null,{"$f":"'Step 5-QA_Input Data Summary'!C28","v":"Glass (lb)"},{"$f":"'Step 5-QA_Input Data Summary'!F28","v":"NA"}]
[null,null,{"$f":"'Step 5-QA_Input Data Summary'!C29","v":"Number of PCB-containing capacitors"},{"$f":"'Step 5-QA_Input Data Summary'!F29","v":""}]
[null,null,{"$f":"'Step 5-QA_Input Data Summary'!C30","v":"Number of Mercury-containing components"},{"$f":"'Step 5-QA_Input Data Summary'!F30","v":"NA"}]
[null,null,"Dehumidifiers"]
[null,null,{"$f":"'Step 5-QA_Input Data Summary'!C8","v":"Number of Units"},{"$f":"'Step 5-QA_Input Data Summary'!G8","v":0}]
[null,null,{"$f":"'Step 5-QA_Input Data Summary'!C9","v":"Refrigerant (lb)*"}]
[null,null,{"$f":"'Step 5-QA_Input Data Summary'!C10","v":"CFC-12"},{"$f":"'Step 5-QA_Input Data Summary'!G10","v":""}]
[null,null,{"$f":"'Step 5-QA_Input Data Summary'!C11","v":"HCFC-22"},{"$f":"'Step 5-QA_Input Data Summary'!G11","v":""}]
[null,null,{"$f":"'Step 5-QA_Input Data Summary'!C12","v":"HFC-134a"},{"$f":"'Step 5-QA_Input Data Summary'!G12","v":""}]
[null,null,{"$f":"'Step 5-QA_Input Data Summary'!C13","v":"R-500A"},{"$f":"'Step 5-QA_Input Data Summary'!G13","v":""}]
[null,null,{"$f":"'Step 5-QA_Input Data Summary'!C14","v":"R-407C"},{"$f":"'Step 5-QA_Input Data Summary'!G14","v":"NA"}]
[null,null,{"$f":"'Step 5-QA_Input Data Summary'!C15","v":"R-410A"},{"$f":"'Step 5-QA_Input Data Summary'!G15","v":""}]
[null,null,{"$f":"'Step 5-QA_Input Data Summary'!C16","v":"Average across all units"},{"$f":"'Step 5-QA_Input Data Summary'!G16","v":""}]
[null,null,{"$f":"'Step 5-QA_Input Data Summary'!C17","v":"Foam-Blowing Agent (lb)**"}]
[null,null,{"$f":"'Step 5-QA_Input Data Summary'!C18","v":"CFC-11"},{"$f":"'Step 5-QA_Input Data Summary'!G18","v":"NA"}]
[null,null,{"$f":"'Step 5-QA_Input Data Summary'!C19","v":"HCFC-141b"},{"$f":"'Step 5-QA_Input Data Summary'!G19","v":"NA"}]
[null,null,{"$f":"'Step 5-QA_Input Data Summary'!C20","v":"HFC-134a"},{"$f":"'Step 5-QA_Input Data Summary'!G20","v":"NA"}]
[null,null,{"$f":"'Step 5-QA_Input Data Summary'!C21","v":"HFC-245fa"},{"$f":"'Step 5-QA_Input Data Summary'!G21","v":"NA"}]
[null,null,{"$f":"'Step 5-QA_Input Data Summary'!C22","v":"Average across all units"},{"$f":"'Step 5-QA_Input Data Summary'!G22","v":"NA"}]
[null,null,{"$f":"'Step 5-QA_Input Data Summary'!C23","v":"Durable Materials"}]
[null,null,{"$f":"'Step 5-QA_Input Data Summary'!C24","v":"Used oil (gal)"},{"$f":"'Step 5-QA_Input Data Summary'!G24","v":""}]
[null,null,{"$f":"'Step 5-QA_Input Data Summary'!C25","v":"Ferrous metals (lb)"},{"$f":"'Step 5-QA_Input Data Summary'!G25","v":""}]
[null,null,{"$f":"'Step 5-QA_Input Data Summary'!C26","v":"Non-ferrous metals (lb)"},{"$f":"'Step 5-QA_Input Data Summary'!G26","v":""}]
[null,null,{"$f":"'Step 5-QA_Input Data Summary'!C27","v":"Plastic (lb)"},{"$f":"'Step 5-QA_Input Data Summary'!G27","v":""}]
[null,null,{"$f":"'Step 5-QA_Input Data Summary'!C28","v":"Glass (lb)"},{"$f":"'Step 5-QA_Input Data Summary'!G28","v":"NA"}]
[null,null,{"$f":"'Step 5-QA_Input Data Summary'!C29","v":"Number of PCB-containing capacitors"},{"$f":"'Step 5-QA_Input Data Summary'!G29","v":""}]
[null,null,{"$f":"'Step 5-QA_Input Data Summary'!C30","v":"Number of Mercury-containing components"},{"$f":"'Step 5-QA_Input Data Summary'!G30","v":"NA"}]

{"sheet":"Assumptions","index":22,"n_rows":61,"n_cols":6,"rows_kept":61,"hidden":true,"merged":[[22,3,25,11],[48,2,48,4],[49,2,49,4],[50,2,50,4],[53,2,53,4],[54,2,54,4],[55,2,55,4],[56,2,56,4],[59,2,59,4],[60,2,60,4]]}
[]
[null,"Assumptions"]
[]
[]
[null,"ODS","ODP","Direct GWP"]
[null,"CFC-11",1,{"v":4750,"d":"4,750"}]
[null,"HCFC-141b",0.11,725]
[null,"CFC-12",1,{"v":10900,"d":"10,900"}]
[null,"HFC-134a",0,{"v":1430,"d":"1,430"}]
[null,"HCFC-22",0.055,{"v":1810,"d":"1,810"}]
[null,"HFC-152a",0,124]
[null,"R-500",{"$f":"0.738*C8+0.262*C11","v":0.738},{"$f":"0.738*D8+0.262*D11","v":{"v":8076.688,"d":"8,077"}}]
[null,"R-410a",0,{"$f":"675*0.5+3500*0.5","v":{"v":2087.5,"d":"2,088"}}]
[null,"R-407C",0,{"$f":"0.23*675+0.25*3500+0.52*D9","v":{"v":1773.85,"d":"1,774"}}]
[null,"HFC-245fa",0,{"v":1030,"d":"1,030"}]
[null,"Cyclopentane",0,1]
[null,"GWP Source: IPCC AR4 (GWPs listed at http://www.epa.gov/ozone/geninfo/gwps.html), unless otherwise noted"]
[null,"ODP Source: Montreal Protocol"]
[null,"Refrigerant Emissions:"]
[null,"Destruction (R-12)",{"v":1E-4,"d":"0.01%"}]
[null,"Reclamation (R-12, R-134a, R-22, R-410a)",{"v":0.015,"d":"1.50%"}]
[]
[null,"Foam Emissions:",null,"Foam Destruction: 99.99% DRE for rotary kiln incineration (RCRA regulations). 99.9999% DRE for PCB rotary kiln incineration (TSCA regulations). 99.91% DRE for MSW incineration based on the minimum DRE achieved in studies discussed in the TEAP 2002 Report of the Rigid and Flexible Foams Technical Options Committee 2002 Assessment p. A4-9. Available at: http://ozone.unep.org/Assessment_Panels/TEAP/Reports/FTOC/FTOC-2002-Assessment-Report.pdf"]
[null,"Destruction",{"v":0.0009,"d":"0.0900%"}]
[null,"Reclamation (R-11, R-141, R-245fa, R-134a, cyclopentane)",{"v":0.015,"d":"1.50%"}]
[]
[]
[null,"Conversions"]
[null,"MTCE",{"$f":"12/44","v":0.2727272727272727}]
[null,"From GHG Equivalencies Calculator:"]
[null,100000,"kWh"]
[null,70.9,"MTCO2"]
[null,{"$f":"B32*C29","v":{"v":19.336363636363636,"d":"19.34"}},"MTCE"]
[null,{"$f":"B33/B31","v":1.9336363636363637E-4},"MTCE/kWh"]
[null,{"$f":"B31/B33","v":{"v":5171.603196991067,"d":"5171.60"}},"kWh/MTCE"]
[]
[null,0.45359,"kg/lb"]
[]
[null,"Emission Factors (from WARMv15) in MTCE/MT material"]
[null,null,"Recycle","Landfill","2020 Revised: Recycle - Landfill"]
[null,"Ferrous ",{"v":-0.550776832916734,"d":"-0.55078"},{"v":6.089116089417766E-3,"d":"0.00609"},{"v":-0.5568659490061517,"d":"-0.55687"}]
[null,"Nonferrous",{"v":-2.0467201031743527,"d":"-2.04672"},{"v":6.089116089417766E-3,"d":"0.00609"},{"v":-2.0528092192637706,"d":"-2.05281"}]
[null,"Rubber",{"v":-0.27824010177185204,"d":"-0.27824"},{"v":6.089116089417766E-3,"d":"0.00609"},{"v":-0.2843292178612698,"d":"-0.28433"}]
[null,"Plastic",{"v":-0.27824010177185204,"d":"-0.27824"},{"v":6.089116089417766E-3,"d":"0.00609"},{"v":-0.2843292178612698,"d":"-0.28433"}]
[null,"Glass",{"v":-0.08300098974894721,"d":"-0.08300"},{"v":6.089116089417766E-3,"d":"0.00609"},{"v":-0.08909010583836498,"d":"-0.08909"}]
[null,"These factors are multiplied by the weight (in tonnes) of the unit to calculate emissions in MTCE."]
[]
[null,"Greenhouse Gas Equivalencies Calculator (for Benefits Messaging)"]
[null,0.215,"Passenger vehicles driven for one year"]
[null,0.126,"Homes' energy use for one year"]
[null,37.9,"Incandescent lamps switched to LEDs"]
[]
[null,"Climate Benefits (for Benefits Messaging)"]
[null,"Reclaiming or destroying refrigerants",{"$f":"'Step 5-Env Benefits'!$F$38","v":0},null,null,{"$f":"C54/SUM($C$54:$E$57)","v":{"$error":"#DIV/0!"}}]
[null,"Reclaiming or destroying foam-blowing agents",{"$f":"'Step 5-Env Benefits'!$F$60","v":0},null,null,{"$f":"C55/SUM($C$54:$E$57)","v":{"$error":"#DIV/0!"}}]
[null,"Recycling durable materials",{"$f":"'Step 5-Env Benefits'!$F$66","v":0},null,null,{"$f":"C56/SUM($C$54:$E$57)","v":{"$error":"#DIV/0!"}}]
[null,"Removing old units from the grid",{"$f":"'Step 5-Env Benefits'!$F$68","v":0},null,null,{"$f":"IF(C57=0,NA(),C57/SUM($C$54:$E$57))","v":{"$error":"#N/A"}}]
[]
[null,"Ozone Benefits (for Benefits Messaging)"]
[null,"Reclaiming or destroying refrigerants",{"$f":"'Step 5-Env Benefits'!$H$38","v":0},null,null,{"$f":"C60/SUM($C$60:$E$61)","v":{"$error":"#DIV/0!"}}]
[null,"Reclaiming or destroying foam-blowing agents",{"$f":"'Step 5-Env Benefits'!$H$60","v":0},null,null,{"$f":"C61/SUM($C$60:$E$61)","v":{"$error":"#DIV/0!"}}]

{"sheet":"DOE RUL","index":23,"n_rows":203,"n_cols":9,"rows_kept":203,"hidden":true,"merged":[[65,0,65,3]]}
["Source: DOE Technical Support Document, REFRIGERATORS, REFRIGERATOR-FREEZERS, AND FREEZERS, November 2009\n"]
["Primary data from 5 RECS surveys: 1990, 1993,1997,2001,2005"]
[]
["Age","DOE RUL Schedule (REF) ","DOE RUL Schedule (FRZ)"]
[0,{"$f":"F75","v":{"v":17.92156661040854,"d":"17.92"}},{"$f":"F141","v":{"v":22.77752756756876,"d":"22.78"}}]
[{"$f":"A5+1","v":1},{"$f":"F76","v":{"v":16.92156661040854,"d":"16.92"}},{"$f":"F142","v":{"v":21.77752756756876,"d":"21.78"}}]
[{"$f":"A6+1","v":2},{"v":15.921566610408545,"d":"15.92"},{"v":20.77752756756876,"d":"20.78"}]
[3,{"v":14.921566610408545,"d":"14.92"},{"v":19.77752756756876,"d":"19.78"}]
[4,{"v":13.921566610408545,"d":"13.92"},{"v":18.77752756756876,"d":"18.78"}]
[5,{"v":12.921566610408544,"d":"12.92"},{"v":17.77752756756876,"d":"17.78"}]
[6,{"v":12.065496933196854,"d":"12.07"},{"v":16.790997140376792,"d":"16.79"}]
[7,{"v":11.362119982112477,"d":"11.36"},{"v":15.845303519942709,"d":"15.85"}]
[8,{"v":10.758498544317296,"d":"10.76"},{"v":14.949176927277135,"d":"14.95"}]
[9,{"v":10.23038915662383,"d":"10.23"},{"v":14.105548162716309,"d":"14.11"}]
[10,{"v":9.762442820202796,"d":"9.76"},{"v":13.314747050624407,"d":"13.31"}]
[11,{"v":9.343858014164487,"d":"9.34"},{"v":12.575657602837097,"d":"12.58"}]
[12,{"v":8.966585808568563,"d":"8.97"},{"v":11.886321394752153,"d":"11.89"}]
[13,{"v":8.62440399307184,"d":"8.62"},{"v":11.244297828792288,"d":"11.24"}]
[14,{"v":8.312375769708142,"d":"8.31"},{"v":10.646893424759439,"d":"10.65"}]
[15,{"v":8.02650653699076,"d":"8.03"},{"v":10.09131222968108,"d":"10.09"}]
[16,{"v":7.763513519492458,"d":"7.76"},{"v":9.574755441505973,"d":"9.57"}]
[17,{"v":7.520664470240336,"d":"7.52"},{"v":9.094486969491182,"d":"9.09"}]
[18,{"v":7.2956609917893,"d":"7.30"},{"v":8.64787557777061,"d":"8.65"}]
[19,{"v":7.086551910573575,"d":"7.09"},{"v":8.232420711291535,"d":"8.23"}]
[20,{"v":6.891667581467238,"d":"6.89"},{"v":7.845766890993495,"d":"7.85"}]
[21,{"v":6.709569171907078,"d":"6.71"},{"v":7.4857101155869055,"d":"7.49"}]
[{"$f":"A26+1","v":22},{"v":6.539008912523167,"d":"6.54"},{"v":7.150198722107039,"d":"7.15"}]
[23,{"v":6.378898531172593,"d":"6.38"},{"v":6.837330469509466,"d":"6.84"}]
[24,{"v":6.228283893684698,"d":"6.23"},{"v":6.545347119709593,"d":"6.55"}]
[25,{"v":6.086324418024749,"d":"6.09"},{"v":6.272627436707735,"d":"6.27"}]
[26,{"v":5.952276203376343,"d":"5.95"},{"v":6.017679266481108,"d":"6.02"}]
[27,{"v":5.825478079293784,"d":"5.83"},{"v":5.779131171037303,"d":"5.78"}]
[28,{"v":5.705339968601901,"d":"5.71"},{"v":5.555723950640196,"d":"5.56"}]
[29,{"v":5.591333094262484,"d":"5.59"},{"v":5.346302285459754,"d":"5.35"}]
[30,{"v":5.482981660154892,"d":"5.48"},{"v":5.149806652199974,"d":"5.15"}]
[{"$f":"A35+1","v":31},{"v":5.379855708719151,"d":"5.38"},{"v":4.965265615637856,"d":"4.97"}]
[32,{"v":5.281564911428023,"d":"5.28"},{"v":4.791788554293684,"d":"4.79"}]
[33,{"v":5.187753085557014,"d":"5.19"},{"v":4.628558849782358,"d":"4.63"}]
[34,{"v":5.098093255548129,"d":"5.10"},{"v":4.474827547831553,"d":"4.47"}]
[35,{"v":5.012283091014374,"d":"5.01"},{"v":4.32990748322337,"d":"4.33"}]
[36,{"v":4.930040556671506,"d":"4.93"},{"v":4.193167849199853,"d":"4.19"}]
[37,{"v":4.85109960180604,"d":"4.85"},{"v":4.064029182619009,"d":"4.06"}]
[38,{"v":4.775205696868816,"d":"4.78"},{"v":3.9419587279037684,"d":"3.94"}]
[39,{"v":4.702110989803792,"d":"4.70"},{"v":3.8264661340366066,"d":"3.83"}]
[40,{"v":4.631568800661462,"d":"4.63"},{"v":3.71709942759799,"d":"3.72"}]
[41,{"v":4.5633270937974,"d":"4.56"},{"v":3.613441188455637,"d":"3.61"}]
[42,{"v":4.497120453697661,"d":"4.50"},{"v":3.5151048291413804,"d":"3.52"}]
[43,{"v":4.432659930624595,"d":"4.43"},{"v":3.421730837773549,"d":"3.42"}]
[44,{"v":4.369619897978176,"d":"4.37"},{"v":3.332982777053442,"d":"3.33"}]
[45,{"v":4.307620749211233,"d":"4.31"},{"v":3.248542720772635,"d":"3.25"}]
[46,{"v":4.2462058224282995,"d":"4.25"},{"v":3.1681056245807557,"d":"3.17"}]
[47,{"v":4.18481032447141,"d":"4.18"},{"v":3.0913718183849674,"d":"3.09"}]
[48,{"v":4.122719160823081,"d":"4.12"},{"v":3.018036285270487,"d":"3.02"}]
[49,{"v":4.059009359589617,"d":"4.06"},{"v":2.9477725017808973,"d":"2.95"}]
[50,{"v":3.9924710592442323,"d":"3.99"},{"v":2.880207084292853,"d":"2.88"}]
[51,{"v":3.9214985986371427,"d":"3.92"},{"v":2.814878830733279,"d":"2.81"}]
[52,{"v":3.8439397991675994,"d":"3.84"},{"v":2.751171093121094,"d":"2.75"}]
[53,{"v":3.75688662355343,"d":"3.76"},{"v":2.6881981788531477,"d":"2.69"}]
[54,{"v":3.65638339825266,"d":"3.66"},{"v":2.6246117485018194,"d":"2.62"}]
[55,{"v":3.537018776905769,"d":"3.54"},{"v":2.558266564415802,"d":"2.56"}]
[56,{"v":3.3913532626599876,"d":"3.39"},{"v":2.4856363543606346,"d":"2.49"}]
[57,{"v":3.209113448866893,"d":"3.21"},{"v":2.4007808927589425,"d":"2.40"}]
[58,{"v":2.976054332458,"d":"2.98"},{"v":2.2934981620712773,"d":"2.29"}]
[59,{"v":2.672347929399832,"d":"2.67"},{"v":2.1459800970664613,"d":"2.15"}]
[60,{"v":2.270293845953818,"d":"2.27"},{"v":1.9266891534804362,"d":"1.93"}]
["Weibull Regression Results"]
["Appliance ","Shape Factor (β)","Scale parameter (α)","DOE TSD EUL*","Column1","Column12","Column2","Column3","Column4"]
["Refrigerator",1.68,13.91,16.18]
["Freezer",2.4,19.49,21.73]
["Source: DOE Technical Support Document, REFRIGERATORS, REFRIGERATOR-FREEZERS, AND FREEZERS, November 2009\n"]
["Primary data from 5 RECS surveys: 1990, 1993,1997,2001,2005"]
[]
["Refrigerator "]
[null,"Age for Weibull Calculation","Age - DOE","Survival Probability","Intermediate step","RUL Normalized"]
[null,0,{"$f":"IF(B75-5<0,0,B75-5)","v":0},{"$f":"EXP(-(($C75/$C$68)^$B$68))","v":1},{"$f":"SUM(D75:$D$137)","v":{"v":17.92156661040854,"d":"17.92"}},{"$f":"E75/D75","v":{"v":17.92156661040854,"d":"17.92"}}]
[null,{"$f":"B75+1","v":1},{"$f":"IF(B76-5<0,0,B76-5)","v":0},{"$f":"EXP(-(($C76/$C$68)^$B$68))","v":1},{"$f":"SUM(D76:$D$137)","v":{"v":16.92156661040854,"d":"16.92"}},{"$f":"E76/D76","v":{"v":16.92156661040854,"d":"16.92"}}]
[null,{"$f":"B76+1","v":2},0,1,{"$f":"SUM(D77:$D$137)","v":{"v":15.921566610408545,"d":"15.92"}},{"$f":"E77/D77","v":{"v":15.921566610408545,"d":"15.92"}}]
[null,3,0,1,{"$f":"SUM(D78:$D$137)","v":{"v":14.921566610408545,"d":"14.92"}},{"v":14.921566610408545,"d":"14.92"}]
[null,4,0,1,{"$f":"SUM(D79:$D$137)","v":{"v":13.921566610408545,"d":"13.92"}},{"v":13.921566610408545,"d":"13.92"}]
[null,{"$f":"B79+1","v":5},0,1,{"$f":"SUM(D80:$D$137)","v":{"v":12.921566610408544,"d":"12.92"}},{"v":12.921566610408544,"d":"12.92"}]
[null,6,1,0.9880709163008194,{"$f":"SUM(D81:$D$137)","v":{"v":11.921566610408544,"d":"11.92"}},{"$f":"E81/D81","v":{"v":12.065496933196854,"d":"12.07"}}]
[null,7,2,0.9622760287094715,{"$f":"SUM(D82:$D$137)","v":{"v":10.933495694107725,"d":"10.93"}},{"v":11.362119982112477,"d":"11.36"}]
[null,8,3,0.9268226067349437,{"$f":"SUM(D83:$D$137)","v":{"v":9.971219665398253,"d":"9.97"}},{"v":10.758498544317296,"d":"10.76"}]
[null,9,4,0.8840716535995476,{"$f":"SUM(D84:$D$137)","v":{"v":9.04439705866331,"d":"9.04"}},{"v":10.23038915662383,"d":"10.23"}]
[null,10,5,0.8358897004934519,{"$f":"SUM(D85:$D$137)","v":{"v":8.160325405063766,"d":"8.16"}},{"v":9.762442820202796,"d":"9.76"}]
[null,11,6,0.783877033819124,{"$f":"SUM(D86:$D$137)","v":{"v":7.324435704570308,"d":"7.32"}},{"v":9.343858014164487,"d":"9.34"}]
[null,12,7,0.729436912821484,{"$f":"SUM(D87:$D$137)","v":{"v":6.540558670751183,"d":"6.54"}},{"v":8.966585808568563,"d":"8.97"}]
[null,13,8,0.6737998083807173,{"$f":"SUM(D88:$D$137)","v":{"v":5.811121757929699,"d":"5.81"}},{"v":8.62440399307184,"d":"8.62"}]
[null,14,9,0.6180329296794242,{"$f":"SUM(D89:$D$137)","v":{"v":5.137321949548982,"d":"5.14"}},{"v":8.312375769708142,"d":"8.31"}]
[null,15,10,0.5630455789255354,{"$f":"SUM(D90:$D$137)","v":{"v":4.519289019869557,"d":"4.52"}},{"v":8.02650653699076,"d":"8.03"}]
[null,16,11,0.5095944550119962,{"$f":"SUM(D91:$D$137)","v":{"v":3.9562434409440232,"d":"3.96"}},{"v":7.763513519492458,"d":"7.76"}]
[null,17,12,0.45829048743905515,{"$f":"SUM(D92:$D$137)","v":{"v":3.446648985932027,"d":"3.45"}},{"v":7.520664470240336,"d":"7.52"}]
[null,18,13,0.409607642385815,{"$f":"SUM(D93:$D$137)","v":{"v":2.988358498492972,"d":"2.99"}},{"v":7.2956609917893,"d":"7.30"}]
[null,19,14,0.3638935957358192,{"$f":"SUM(D94:$D$137)","v":{"v":2.5787508561071575,"d":"2.58"}},{"v":7.086551910573575,"d":"7.09"}]
[null,20,15,0.3213819056402883,{"$f":"SUM(D95:$D$137)","v":{"v":2.2148572603713377,"d":"2.21"}},{"v":6.891667581467238,"d":"6.89"}]
[null,21,16,0.2822052066560426,{"$f":"SUM(D96:$D$137)","v":{"v":1.8934753547310494,"d":"1.89"}},{"v":6.709569171907078,"d":"6.71"}]
[null,22,17,0.24640892368095516,{"$f":"SUM(D97:$D$137)","v":{"v":1.6112701480750067,"d":"1.61"}},{"v":6.539008912523167,"d":"6.54"}]
[null,23,18,0.2139650313802934,{"$f":"SUM(D98:$D$137)","v":{"v":1.3648612243940514,"d":"1.36"}},{"v":6.378898531172593,"d":"6.38"}]
[null,24,19,0.18478544213129627,{"$f":"SUM(D99:$D$137)","v":{"v":1.1508961930137585,"d":"1.15"}},{"v":6.228283893684698,"d":"6.23"}]
[null,25,20,0.15873467868740435,{"$f":"SUM(D100:$D$137)","v":{"v":0.9661107508824618,"d":"0.97"}},{"v":6.086324418024749,"d":"6.09"}]
[null,26,21,0.13564156712638523,{"$f":"SUM(D101:$D$137)","v":{"v":0.8073760721950576,"d":"0.81"}},{"v":5.952276203376343,"d":"5.95"}]
[null,27,22,0.11530976443912837,{"$f":"SUM(D102:$D$137)","v":{"v":0.6717345050686723,"d":"0.67"}},{"v":5.825478079293784,"d":"5.83"}]
[null,28,23,0.09752700867813427,{"$f":"SUM(D103:$D$137)","v":{"v":0.556424740629544,"d":"0.56"}},{"v":5.705339968601901,"d":"5.71"}]
[null,29,24,0.08207304487409366,{"$f":"SUM(D104:$D$137)","v":{"v":0.45889773195140976,"d":"0.46"}},{"v":5.591333094262484,"d":"5.59"}]
[null,30,25,0.06872623518253224,{"$f":"SUM(D105:$D$137)","v":{"v":0.37682468707731614,"d":"0.38"}},{"v":5.482981660154892,"d":"5.48"}]
[null,31,26,0.05726890618933286,{"$f":"SUM(D106:$D$137)","v":{"v":0.3080984518947839,"d":"0.31"}},{"v":5.379855708719151,"d":"5.38"}]
[null,32,27,0.04749152001572809,{"$f":"SUM(D107:$D$137)","v":{"v":0.25082954570545113,"d":"0.25"}},{"v":5.281564911428023,"d":"5.28"}]
[null,33,28,0.039195779432106566,{"$f":"SUM(D108:$D$137)","v":{"v":0.20333802568972298,"d":"0.20"}},{"v":5.187753085557014,"d":"5.19"}]
[null,34,29,0.03219679162969105,{"$f":"SUM(D109:$D$137)","v":{"v":0.1641422462576164,"d":"0.16"}},{"v":5.098093255548129,"d":"5.10"}]
[null,35,30,0.02632442187163505,{"$f":"SUM(D110:$D$137)","v":{"v":0.1319454546279253,"d":"0.13"}},{"v":5.012283091014374,"d":"5.01"}]
[null,36,31,0.02142396833092176,{"$f":"SUM(D111:$D$137)","v":{"v":0.10562103275629024,"d":"0.11"}},{"v":4.930040556671506,"d":"4.93"}]
[null,37,32,0.017356284417253013,{"$f":"SUM(D112:$D$137)","v":{"v":0.08419706442536846,"d":"0.08"}},{"v":4.85109960180604,"d":"4.85"}]
[null,38,33,0.013997466130504933,{"$f":"SUM(D113:$D$137)","v":{"v":0.06684078000811546,"d":"0.07"}},{"v":4.775205696868816,"d":"4.78"}]
[null,39,34,0.01123821066584725,{"$f":"SUM(D114:$D$137)","v":{"v":0.05284331387761055,"d":"0.05"}},{"v":4.702110989803792,"d":"4.70"}]
[null,40,35,0.00898293969115204,{"$f":"SUM(D115:$D$137)","v":{"v":0.0416051032117633,"d":"0.04"}},{"v":4.631568800661462,"d":"4.63"}]
[null,41,36,7.148767302907609E-3,{"$f":"SUM(D116:$D$137)","v":{"v":0.03262216352061126,"d":"0.03"}},{"v":4.5633270937974,"d":"4.56"}]
[null,42,37,5.664379346734796E-3,{"$f":"SUM(D117:$D$137)","v":{"v":0.025473396217703642,"d":"0.03"}},{"v":4.497120453697661,"d":"4.50"}]
[null,43,38,0.004468878095996326,{"$f":"SUM(D118:$D$137)","v":{"v":0.019809016870968848,"d":"0.02"}},{"v":4.432659930624595,"d":"4.43"}]
[null,44,39,3.5106345936566255E-3,{"$f":"SUM(D119:$D$137)","v":{"v":0.01534013877497252,"d":"0.02"}},{"v":4.369619897978176,"d":"4.37"}]
[null,45,40,2.7461805182088027E-3,{"$f":"SUM(D120:$D$137)","v":{"v":0.011829504181315894,"d":"0.01"}},{"v":4.307620749211233,"d":"4.31"}]
[null,46,41,0.002139162358812029,{"$f":"SUM(D121:$D$137)","v":{"v":0.009083323663107093,"d":"0.01"}},{"v":4.2462058224282995,"d":"4.25"}]
[null,47,42,1.6593730099755933E-3,{"$f":"SUM(D122:$D$137)","v":{"v":0.006944161304295064,"d":"0.01"}},{"v":4.18481032447141,"d":"4.18"}]
[null,48,43,1.2818695836813651E-3,{"$f":"SUM(D123:$D$137)","v":{"v":0.00528478829431947,"d":"0.01"}},{"v":4.122719160823081,"d":"4.12"}]
[null,49,44,9.8618119743454271E-4,{"$f":"SUM(D124:$D$137)","v":{"v":0.004002918710638105,"d":"0.00"}},{"v":4.059009359589617,"d":"4.06"}]
[null,50,45,7.5560660764680042E-4,{"$f":"SUM(D125:$D$137)","v":{"v":3.0167375132035624E-3,"d":"0.00"}},{"v":3.9924710592442323,"d":"3.99"}]
[null,51,46,5.7659867743994171E-4,{"$f":"SUM(D126:$D$137)","v":{"v":0.002261130905556761,"d":"0.00"}},{"v":3.9214985986371427,"d":"3.92"}]
[null,52,47,4.3823064775405776E-4,{"$f":"SUM(D127:$D$137)","v":{"v":1.6845322281168198E-3,"d":"0.00"}},{"v":3.8439397991675994,"d":"3.84"}]
[null,53,48,3.3173787373544817E-4,{"$f":"SUM(D128:$D$137)","v":{"v":1.246301580362762E-3,"d":"0.00"}},{"v":3.75688662355343,"d":"3.76"}]
[null,54,49,2.5012795623795161E-4,{"$f":"SUM(D129:$D$137)","v":{"v":9.1456370662731414E-4,"d":"0.00"}},{"v":3.65638339825266,"d":"3.66"}]
[null,55,50,1.8785191493120084E-4,{"$f":"SUM(D130:$D$137)","v":{"v":6.6443575038936252E-4,"d":"0.00"}},{"v":3.537018776905769,"d":"3.54"}]
[null,56,51,1.4052910403216325E-4,{"$f":"SUM(D131:$D$137)","v":{"v":4.7658383545816168E-4,"d":"0.00"}},{"v":3.3913532626599876,"d":"3.39"}]
[null,57,52,1.0471886917698597E-4,{"$f":"SUM(D132:$D$137)","v":{"v":3.360547314259984E-4,"d":"0.00"}},{"v":3.209113448866893,"d":"3.21"}]
[null,58,53,7.7732405529688748E-5,{"$f":"SUM(D133:$D$137)","v":{"v":2.3133586224901242E-4,"d":"0.00"}},{"v":2.976054332458,"d":"2.98"}]
[null,59,54,5.7478839124746977E-5,{"$f":"SUM(D134:$D$137)","v":{"v":1.5360345671932364E-4,"d":"0.00"}},{"v":2.672347929399832,"d":"2.67"}]
[null,60,55,4.2340165686434256E-5,{"$f":"SUM(D135:$D$137)","v":{"v":9.6124617594576693E-5,"d":"0.00"}},{"v":2.270293845953818,"d":"2.27"}]
[null,{"$f":"B135+1","v":61},56,3.107030591491742E-5,{"$f":"SUM(D136:$D$137)","v":{"v":5.378445190814243E-5,"d":"0.00"}},{"v":1.731056400134108,"d":"1.73"}]
[null,62,57,2.2714145993225013E-5,{"$f":"SUM(D137:$D$137)","v":{"v":2.2714145993225013E-5,"d":"0.00"}},{"v":1,"d":"1.00"}]
[]
["Freezer "]
["AGE","Age for Weibull Calculation","Age - DOE","Survival Probability","Intermediate step","RUL Normalized"]
[null,0,{"$f":"IF(B141-5<0,0,B141-5)","v":0},{"$f":"EXP(-(($C141/$C$69)^$B$69))","v":1},{"$f":"SUM(D141:$D$203)","v":22.77752756756876},{"$f":"E141/D141","v":22.77752756756876}]
[null,{"$f":"B141+1","v":1},{"$f":"IF(B142-5<0,0,B142-5)","v":0},{"$f":"EXP(-(($C142/$C$69)^$B$69))","v":1},{"$f":"SUM(D142:$D$203)","v":21.77752756756876},{"$f":"E142/D142","v":21.77752756756876}]
[null,{"$f":"B142+1","v":2},0,1,{"$f":"SUM(D143:$D$203)","v":20.77752756756876},20.77752756756876]
[null,3,0,1,{"$f":"SUM(D144:$D$203)","v":19.77752756756876},19.77752756756876]
[null,4,0,1,{"$f":"SUM(D145:$D$203)","v":18.77752756756876},18.77752756756876]
[null,{"$f":"B145+1","v":5},0,1,{"$f":"SUM(D146:$D$203)","v":17.77752756756876},17.77752756756876]
[null,6,1,0.99919780983253,{"$f":"SUM(D147:$D$203)","v":16.777527567568765},16.790997140376792]
[null,7,2,0.9957732736313836,{"$f":"SUM(D148:$D$203)","v":15.778329757736236},15.845303519942709]
[null,8,3,0.9888542062226678,{"$f":"SUM(D149:$D$203)","v":14.782556484104852},14.949176927277135]
[null,9,4,0.9778919697953751,{"$f":"SUM(D150:$D$203)","v":13.793702277882185},14.105548162716309]
[null,10,5,0.9625275087359471,{"$f":"SUM(D151:$D$203)","v":12.815810308086808},13.314747050624407]
[null,11,6,0.9425576915100436,{"$f":"SUM(D152:$D$203)","v":11.853282799350863},12.575657602837097]
[null,12,7,0.9179227740432744,{"$f":"SUM(D153:$D$203)","v":10.910725107840818},11.886321394752153]
[null,13,8,0.8886995422879899,{"$f":"SUM(D154:$D$203)","v":9.992802333797544},11.244297828792288]
[null,14,9,0.8550947612885734,{"$f":"SUM(D155:$D$203)","v":9.104102791509554},10.646893424759439]
[null,15,10,0.8174366071003708,{"$f":"SUM(D156:$D$203)","v":8.24900803022098},10.09131222968108]
[null,16,11,0.7761630538264408,{"$f":"SUM(D157:$D$203)","v":7.431571423120608},9.574755441505973]
[null,17,12,0.7318069058343512,{"$f":"SUM(D158:$D$203)","v":6.655408369294167},9.094486969491182]
[null,18,13,0.6849776468438622,{"$f":"SUM(D159:$D$203)","v":5.923601463459817},8.64787557777061]
[null,19,14,0.6363406342232597,{"$f":"SUM(D160:$D$203)","v":5.238623816615955},8.232420711291535]
[null,20,15,0.5865944331937597,{"$f":"SUM(D161:$D$203)","v":4.6022831823926955},7.845766890993495]
[null,21,16,0.5364472691558525,{"$f":"SUM(D162:$D$203)","v":4.015688749198937},7.4857101155869055]
[null,22,17,0.48659367596119235,{"$f":"SUM(D163:$D$203)","v":3.479241480043084},7.150198722107039]
[null,23,18,0.4376924323648487,{"$f":"SUM(D164:$D$203)","v":2.992647804081891},6.837330469509466]
[null,24,19,0.3903468104882422,{"$f":"SUM(D165:$D$203)","v":2.5549553717170426},6.545347119709593]
[null,25,20,0.34508801663580413,{"$f":"SUM(D166:$D$203)","v":2.1646085612288},6.272627436707735]
[null,26,21,0.30236249956488265,{"$f":"SUM(D167:$D$203)","v":1.8195205445929972},6.017679266481108]
[null,27,22,0.2625235524383846,{"$f":"SUM(D168:$D$203)","v":1.5171580450281144},5.779131171037303]
[null,28,23,0.22582736358691038,{"$f":"SUM(D169:$D$203)","v":1.2546344925897297},5.555723950640196]
[null,29,24,0.19243340052073904,{"$f":"SUM(D170:$D$203)","v":1.0288071290028193},5.346302285459754]
[null,30,25,0.16240876307944196,{"$f":"SUM(D171:$D$203)","v":0.8363737284820797},5.149806652199974]
[null,31,26,0.13573593390049846,{"$f":"SUM(D172:$D$203)","v":0.6739649654026377},4.965265615637856]
[null,32,27,0.11232320153606504,{"$f":"SUM(D173:$D$203)","v":0.5382290315021392},4.791788554293684]
[null,33,28,0.09201694172822296,{"$f":"SUM(D174:$D$203)","v":0.42590582996607396},4.628558849782358]
[null,34,29,0.07461491748428373,{"$f":"SUM(D175:$D$203)","v":0.333888888237851},4.474827547831553]
[null,35,30,0.05987979460488441,{"$f":"SUM(D176:$D$203)","v":0.2592739707535674},4.32990748322337]
[null,36,31,0.047552157061094454,{"$f":"SUM(D177:$D$203)","v":0.19939417614868304},4.193167849199853]
[null,37,32,0.037362433256381306,{"$f":"SUM(D178:$D$203)","v":0.1518420190875886},4.064029182619009]
[null,38,33,0.029041294882375543,{"$f":"SUM(D179:$D$203)","v":0.11447958583120732},3.9419587279037684]
[null,39,34,0.022328249605779584,{"$f":"SUM(D180:$D$203)","v":0.08543829094883179},3.8264661340366066]
[null,40,35,0.016978303263691347,{"$f":"SUM(D181:$D$203)","v":0.06311004134305219},3.71709942759799]
[null,41,36,0.012766705108345006,{"$f":"SUM(D182:$D$203)","v":0.046131738079360836},3.613441188455637]
[null,42,37,0.009491902686488519,{"$f":"SUM(D183:$D$203)","v":0.03336503297101583},3.5151048291413804]
[null,43,38,0.006976916483606609,{"$f":"SUM(D184:$D$203)","v":0.023873130284527325},3.421730837773549]
[null,44,39,0.005069397272991007,{"$f":"SUM(D185:$D$203)","v":0.016896213800920712},3.332982777053442]
[null,45,40,3.640652915630059E-3,{"$f":"SUM(D186:$D$203)","v":0.011826816527929699},3.248542720772635]
[null,46,41,0.002583930140707647,{"$f":"SUM(D187:$D$203)","v":0.00818616361229964},3.1681056245807557]
[null,47,42,0.001812216000118285,{"$f":"SUM(D188:$D$203)","v":5.6022334715919945E-3},3.0913718183849674]
[null,48,43,1.2557892328766463E-3,{"$f":"SUM(D189:$D$203)","v":3.7900174714737087E-3},3.018036285270487]
[null,49,44,8.5970957292871419E-4,{"$f":"SUM(D190:$D$203)","v":2.5342282385970626E-3},2.9477725017808973]
[null,50,45,5.8138828794648129E-4,{"$f":"SUM(D191:$D$203)","v":1.6745186656683486E-3},2.880207084292853]
[null,51,46,3.8834011815602933E-4,{"$f":"SUM(D192:$D$203)","v":1.0931303777218671E-3},2.814878830733279]
[null,52,47,2.5617827307362467E-4,{"$f":"SUM(D193:$D$203)","v":7.0479025956583818E-4},2.751171093121094]
[null,53,48,1.6688203645893489E-4,{"$f":"SUM(D194:$D$203)","v":4.486119864922134E-4},2.6881981788531477]
[null,54,49,1.0734157164163256E-4,{"$f":"SUM(D195:$D$203)","v":2.8172995003327854E-4},2.6246117485018194]
[null,55,50,6.8166617512537738E-5,{"$f":"SUM(D196:$D$203)","v":1.7438837839164594E-4},2.558266564415802]
[null,56,51,4.2734232098255181E-5,{"$f":"SUM(D197:$D$203)","v":1.0622176087910821E-4},2.4856363543606346]
[null,57,52,2.6444532681986692E-5,{"$f":"SUM(D198:$D$203)","v":6.3487528780853045E-5},2.4007808927589425]
[null,58,53,1.6151308386230626E-5,{"$f":"SUM(D199:$D$203)","v":3.704299609886635E-5},2.2934981620712773]
[null,59,54,9.7352662968284274E-6,{"$f":"SUM(D200:$D$203)","v":2.089168771263572E-5},2.1459800970664613]
[null,60,55,5.7904625640591576E-6,{"$f":"SUM(D201:$D$203)","v":1.1156421415807294E-5},1.9266891534804362]
[null,{"$f":"B201+1","v":61},56,3.3982978085961679E-6,{"$f":"SUM(D202:$D$203)","v":5.3659588517481366E-6},1.5790137162713256]
[null,62,57,1.9676610431519684E-6,{"$f":"SUM(D203:$D$203)","v":1.9676610431519684E-6},1]