{"text_format":"3","workbook":"xlsx","n_sheets":15,"sheets":["Instructions","Section I","Section II","Section III","Section IV THRU V","Section VI","Section VII","Section VIII thru X","Funds Held Section","Summary Page","Section II Overflow Page","Section IV Overflow Page","Section VII Overflow Page","Section VIII Overflow Page","Funds Held Overflow Page"],"not_rendered":{"macros":1,"defined_names":27},"read":"whole","date_system":"1900"}

{"sheet":"Instructions","index":0,"n_rows":48,"n_cols":3,"rows_kept":48}
[null,"U.S. Treasury Schedule F Instructions"]
[null,"For the Year-Ended December 31, 2009","For the year ended December 31, 2021"]
[null,"Spreadsheet Version 1.0"]
[]
["Please Enter Your Company Name in the Box","→→→"]
[]
{"$rows_left_out":43}
{"sheet":"Section I","index":1,"n_rows":342,"n_cols":16,"rows_kept":342}
[{"$nulls":7},"ANNUAL STATEMENT FOR THE YEAR 2021 OF  ",{"$f":"IF(Instructions!C5<>0,+Instructions!C5,\"\")","v":""},{"$nulls":6},"OMB No. 1530-0008"]
[{"$nulls":9},"Write or Stamp Name",{"$nulls":5}," OMB Expiration Date:  6-30-2023"]
["Schedule F - Part 1"]
["Ceded Reinsurance as of December 31, Current Year (000's Omitted)"]
[]
["Federal ID","NAIC Company ","Name of Reinsurer","Domiciliary","+","(1)                      Reinsurance Premiums","(2)                                                                                                                                                                        Recoverable on Paid Losses and                                                                              Paid Loss Adjustment Expense, Days Overdue",{"$nulls":3},"(3)                            Total           Overdue","(4)          Percentage Overdue     ","(5)                       (Known Case) Reinsurance Recoverable on Unpaid Losses","(6)                   Incurred But Not Reported Losses and","(7)                 Unearned","(8)                                      Total Recoverable      "]
{"$rows_left_out":337}
{"sheet":"Section II","index":2,"n_rows":39,"n_cols":16,"rows_kept":39}
[{"$nulls":7},{"$f":"'Section I'!H1","v":"ANNUAL STATEMENT FOR THE YEAR 2021 OF  "},{"$f":"IF('Section I'!$I$1<>0,+'Section I'!$I$1,\"\")","v":""},{"$nulls":6},{"$f":"+'Section I'!P1","v":"OMB No. 1530-0008"}]
[{"$nulls":9},"Write or Stamp Name",{"$nulls":5},{"$f":"+'Section I'!P2","v":" OMB Expiration Date:  6-30-2023"}]
["Schedule F - Part 1"]
[{"$f":"+'Section I'!A4","v":"Ceded Reinsurance as of December 31, Current Year (000's Omitted)"}]
[]
[{"$f":"+'Section I'!A6","v":"Federal ID"},{"$f":"+'Section I'!B6","v":"NAIC Company "},{"$f":"+'Section I'!C6","v":"Name of Reinsurer"},{"$f":"+'Section I'!D6","v":"Domiciliary"},{"$f":"+'Section I'!E6","v":"+"},{"$f":"+'Section I'!F6","v":"(1)                      Reinsurance Premiums"},{"$f":"+'Section I'!G6","v":"(2)                                                                                                                                                                        Recoverable on Paid Losses and                                                                              Paid Loss Adjustment Expense, Days Overdue"},{"$nulls":3},{"$f":"+'Section I'!K6","v":"(3)                            Total           Overdue"},{"$f":"+'Section I'!L6","v":"(4)          Percentage Overdue     "},{"$f":"+'Section I'!M6","v":"(5)                       (Known Case) Reinsurance Recoverable on Unpaid Losses"},{"$f":"+'Section I'!N6","v":"(6)                   Incurred But Not Reported Losses and"},{"$f":"+'Section I'!O6","v":"(7)                 Unearned"},{"$f":"+'Section I'!P6","v":"(8)                                      Total Recoverable      "}]
{"$rows_left_out":34}
{"sheet":"Section III","index":3,"n_rows":397,"n_cols":16,"rows_kept":397}
[{"$nulls":7},{"$f":"+'Section II'!H1","v":"ANNUAL STATEMENT FOR THE YEAR 2021 OF  "},{"$f":"IF('Section I'!$I$1<>0,+'Section I'!$I$1,\"\")","v":""},{"$nulls":6},{"$f":"+'Section I'!P1","v":"OMB No. 1530-0008"}]
[{"$nulls":9},"Write or Stamp Name",{"$nulls":5},{"$f":"+'Section II'!P2","v":" OMB Expiration Date:  6-30-2023"}]
["Schedule F - Part 1"]
[{"$f":"+'Section I'!A4","v":"Ceded Reinsurance as of December 31, Current Year (000's Omitted)"}]
[]
[null,"Authorized",{"$f":"+'Section I'!C6","v":"Name of Reinsurer"},null,{"$f":"+'Section I'!E6","v":"+"},{"$f":"+'Section I'!F6","v":"(1)                      Reinsurance Premiums"},{"$f":"+'Section I'!G6","v":"(2)                                                                                                                                                                        Recoverable on Paid Losses and                                                                              Paid Loss Adjustment Expense, Days Overdue"},{"$nulls":3},{"$f":"+'Section I'!K6","v":"(3)                            Total           Overdue"},{"$f":"+'Section I'!L6","v":"(4)          Percentage Overdue     "},{"$f":"+'Section I'!M6","v":"(5)                       (Known Case) Reinsurance Recoverable on Unpaid Losses"},{"$f":"+'Section I'!N6","v":"(6)                   Incurred But Not Reported Losses and"},{"$f":"+'Section I'!O6","v":"(7)                 Unearned"},{"$f":"+'Section I'!P6","v":"(8)                                      Total Recoverable      "}]
{"$rows_left_out":392}
{"sheet":"Section IV THRU V","index":4,"n_rows":43,"n_cols":16,"rows_kept":43}
[{"$nulls":7},"ANNUAL STATEMENT FOR THE YEAR 2021 OF  ",{"$f":"IF('Section I'!$I$1<>0,+'Section I'!$I$1,\"\")","v":""},{"$nulls":6},{"$f":"+'Section I'!P1","v":"OMB No. 1530-0008"}]
[{"$nulls":9},"Write or Stamp Name",{"$nulls":5},{"$f":"+'Section III'!P2","v":" OMB Expiration Date:  6-30-2023"}]
["Schedule F - Part 1"]
[{"$f":"+'Section I'!A4","v":"Ceded Reinsurance as of December 31, Current Year (000's Omitted)"}]
[]
[null,{"$f":"+'Section III'!B6","v":"Authorized"},{"$f":"+'Section I'!C6","v":"Name of Reinsurer"},null,{"$f":"+'Section I'!E6","v":"+"},{"$f":"+'Section I'!F6","v":"(1)                      Reinsurance Premiums"},{"$f":"+'Section I'!G6","v":"(2)                                                                                                                                                                        Recoverable on Paid Losses and                                                                              Paid Loss Adjustment Expense, Days Overdue"},{"$nulls":3},{"$f":"+'Section I'!K6","v":"(3)                            Total           Overdue"},{"$f":"+'Section I'!L6","v":"(4)          Percentage Overdue     "},{"$f":"+'Section I'!M6","v":"(5)                       (Known Case) Reinsurance Recoverable on Unpaid Losses"},{"$f":"+'Section I'!N6","v":"(6)                   Incurred But Not Reported Losses and"},{"$f":"+'Section I'!O6","v":"(7)                 Unearned"},{"$f":"+'Section I'!P6","v":"(8)                                      Total Recoverable      "}]
{"$rows_left_out":38}
{"sheet":"Section VI","index":5,"n_rows":90,"n_cols":16,"rows_kept":90}
[{"$nulls":7},"ANNUAL STATEMENT FOR THE YEAR 2021 OF  ",{"$f":"IF('Section I'!$I$1<>0,+'Section I'!$I$1,\"\")","v":""},{"$nulls":6},{"$f":"+'Section I'!P1","v":"OMB No. 1530-0008"}]
[{"$nulls":9},"Write or Stamp Name",{"$nulls":5},{"$f":"+'Section IV THRU V'!P2","v":" OMB Expiration Date:  6-30-2023"}]
["Schedule F - Part 1"]
[{"$f":"+'Section I'!A4","v":"Ceded Reinsurance as of December 31, Current Year (000's Omitted)"}]
[]
[null,"Unauthorized",{"$f":"+'Section I'!C6","v":"Name of Reinsurer"},null,{"$f":"+'Section I'!E6","v":"+"},{"$f":"+'Section I'!F6","v":"(1)                      Reinsurance Premiums"},{"$f":"+'Section I'!G6","v":"(2)                                                                                                                                                                        Recoverable on Paid Losses and                                                                              Paid Loss Adjustment Expense, Days Overdue"},{"$nulls":3},{"$f":"+'Section I'!K6","v":"(3)                            Total           Overdue"},{"$f":"+'Section I'!L6","v":"(4)          Percentage Overdue     "},{"$f":"+'Section I'!M6","v":"(5)                       (Known Case) Reinsurance Recoverable on Unpaid Losses"},{"$f":"+'Section I'!N6","v":"(6)                   Incurred But Not Reported Losses and"},{"$f":"+'Section I'!O6","v":"(7)                 Unearned"},{"$f":"+'Section I'!P6","v":"(8)                                      Total Recoverable      "}]
{"$rows_left_out":85}
{"sheet":"Section VII","index":6,"n_rows":40,"n_cols":16,"rows_kept":40}
[{"$nulls":7},"ANNUAL STATEMENT FOR THE YEAR 2021 OF  ",{"$f":"IF('Section I'!$I$1<>0,+'Section I'!$I$1,\"\")","v":""},{"$nulls":6},{"$f":"+'Section I'!P1","v":"OMB No. 1530-0008"}]
[{"$nulls":9},"Write or Stamp Name",{"$nulls":5},{"$f":"+'Section VI'!P2","v":" OMB Expiration Date:  6-30-2023"}]
["Schedule F - Part 1"]
[{"$f":"+'Section I'!A4","v":"Ceded Reinsurance as of December 31, Current Year (000's Omitted)"}]
[]
[null,{"$f":"+'Section VI'!B6:B6","v":"Unauthorized"},{"$f":"+'Section VI'!C6","v":"Name of Reinsurer"},null,{"$f":"+'Section VI'!E6","v":"+"},{"$f":"+'Section VI'!F6","v":"(1)                      Reinsurance Premiums"},{"$f":"+'Section VI'!G6","v":"(2)                                                                                                                                                                        Recoverable on Paid Losses and                                                                              Paid Loss Adjustment Expense, Days Overdue"},{"$nulls":3},{"$f":"+'Section VI'!K6","v":"(3)                            Total           Overdue"},{"$f":"+'Section VI'!L6","v":"(4)          Percentage Overdue     "},{"$f":"+'Section VI'!M6","v":"(5)                       (Known Case) Reinsurance Recoverable on Unpaid Losses"},{"$f":"+'Section VI'!N6","v":"(6)                   Incurred But Not Reported Losses and"},{"$f":"+'Section VI'!O6","v":"(7)                 Unearned"},{"$f":"+'Section VI'!P6","v":"(8)                                      Total Recoverable      "}]
{"$rows_left_out":35}
{"sheet":"Section VIII thru X","index":7,"n_rows":112,"n_cols":17,"rows_kept":112}
[{"$nulls":7},"ANNUAL STATEMENT FOR THE YEAR 2021 OF  ",{"$f":"IF('Section I'!$I$1<>0,+'Section I'!$I$1,\"\")","v":""},{"$nulls":6},{"$f":"+'Section I'!P1","v":"OMB No. 1530-0008"}]
[{"$nulls":9},"Write or Stamp Name",{"$nulls":5},{"$f":"+'Section VII'!P2","v":" OMB Expiration Date:  6-30-2023"}]
["Schedule F - Part 1"]
[{"$f":"+'Section I'!A4","v":"Ceded Reinsurance as of December 31, Current Year (000's Omitted)"}]
[]
[{"$f":"+'Section I'!A6","v":"Federal ID"},{"$f":"+'Section I'!B6","v":"NAIC Company "},{"$f":"+'Section I'!C6","v":"Name of Reinsurer"},{"$f":"+'Section I'!D6","v":"Domiciliary"},{"$f":"+'Section I'!E6","v":"+"},{"$f":"+'Section I'!F6","v":"(1)                      Reinsurance Premiums"},{"$f":"+'Section I'!G6","v":"(2)                                                                                                                                                                        Recoverable on Paid Losses and                                                                              Paid Loss Adjustment Expense, Days Overdue"},{"$nulls":3},{"$f":"+'Section I'!K6","v":"(3)                            Total           Overdue"},{"$f":"+'Section I'!L6","v":"(4)          Percentage Overdue     "},{"$f":"+'Section I'!M6","v":"(5)                       (Known Case) Reinsurance Recoverable on Unpaid Losses"},{"$f":"+'Section I'!N6","v":"(6)                   Incurred But Not Reported Losses and"},{"$f":"+'Section I'!O6","v":"(7)                 Unearned"},{"$f":"+'Section I'!P6","v":"(8)                                      Total Recoverable      "}]
{"$rows_left_out":107}
{"sheet":"Funds Held Section","index":8,"n_rows":71,"n_cols":12,"rows_kept":71}
[{"$nulls":6},"ANNUAL STATEMENT FOR THE YEAR 2021 OF  ",{"$f":"IF('Section I'!$I$1<>0,+'Section I'!$I$1,\"\")","v":""},{"$nulls":3},{"$f":"+'Section I'!P1","v":"OMB No. 1530-0008"}]
[{"$nulls":8},"Write or Stamp Name",null,null,{"$f":"+'Section VIII thru X'!P2","v":" OMB Expiration Date:  6-30-2023"}]
["SCHEDULE F - Part 2"]
["Funds Withheld on Account of Reinsurance in Unauthorized Companies as of December 31, Current Year (000's Omitted)"]
[]
[{"$nulls":5},"(2)"]
{"$rows_left_out":66}
{"sheet":"Summary Page","index":9,"n_rows":46,"n_cols":22,"rows_kept":46,"merged":[[31,6,31,9],[31,11,31,12]]}
[{"$nulls":12},"ANNUAL STATEMENT FOR THE YEAR 2021 OF  ",{"$f":"IF('Section I'!$I$1<>0,+'Section I'!$I$1,\"\")","v":""},{"$nulls":7},{"$f":"+'Section I'!P1","v":"OMB No. 1530-0008"}]
[{"$nulls":14},"Write or Stamp Name",{"$nulls":6},{"$f":"+'Section I'!P2","v":" OMB Expiration Date:  6-30-2023"}]
[]
[{"$nulls":14},"       Page 34 of 34 "]
[{"$nulls":14},"      (000's OMITTED)"]
[]
{"$rows_left_out":41}
{"sheet":"Section II Overflow Page","index":10,"n_rows":83,"n_cols":16,"rows_kept":83}
[{"$nulls":7},"ANNUAL STATEMENT FOR THE YEAR 2021 OF  ",{"$f":"+'Section I'!I1","v":""},{"$nulls":6},{"$f":"+'Section I'!P1","v":"OMB No. 1530-0008"}]
[{"$nulls":9},"Write or Stamp Name",{"$nulls":5},{"$f":"+'Section I'!P2","v":" OMB Expiration Date:  6-30-2023"}]
["Schedule F - Part 1"]
[{"$f":"+'Section I'!A4","v":"Ceded Reinsurance as of December 31, Current Year (000's Omitted)"}]
["Section II Overflow Page"]
["Federal ID","NAIC Company ","Name of Reinsurer","Domiciliary","+","(1)                      Reinsurance Premiums","(2)                                                                                                                                                                        Recoverable on Paid Losses and                                                                              Paid Loss Adjustment Expense, Days Overdue",{"$nulls":3},"(3)                            Total           Overdue","(4)          Percentage Overdue     ","(5)                       (Known Case) Reinsurance Recoverable on Unpaid Losses","(6)                   Incurred But Not Reported Losses and","(7)                 Unearned","(8)                                      Total Recoverable      "]
{"$rows_left_out":78}
{"sheet":"Section IV Overflow Page","index":11,"n_rows":83,"n_cols":16,"rows_kept":83}
[{"$nulls":7},{"$f":"+'Section III'!H1","v":"ANNUAL STATEMENT FOR THE YEAR 2021 OF  "},{"$f":"+'Section I'!I1","v":""},{"$nulls":6},{"$f":"+'Section I'!P1","v":"OMB No. 1530-0008"}]
[{"$nulls":9},"Write or Stamp Name",{"$nulls":5},{"$f":"+'Section III'!P2","v":" OMB Expiration Date:  6-30-2023"}]
["Schedule F - Part 1"]
[{"$f":"+'Section I'!A4","v":"Ceded Reinsurance as of December 31, Current Year (000's Omitted)"}]
["Section IV Overflow Page"]
[null,{"$f":"+'Section III'!B6","v":"Authorized"},{"$f":"+'Section I'!C6","v":"Name of Reinsurer"},null,{"$f":"+'Section I'!E6","v":"+"},{"$f":"+'Section I'!F6","v":"(1)                      Reinsurance Premiums"},{"$f":"+'Section I'!G6","v":"(2)                                                                                                                                                                        Recoverable on Paid Losses and                                                                              Paid Loss Adjustment Expense, Days Overdue"},{"$nulls":3},{"$f":"+'Section I'!K6","v":"(3)                            Total           Overdue"},{"$f":"+'Section I'!L6","v":"(4)          Percentage Overdue     "},{"$f":"+'Section I'!M6","v":"(5)                       (Known Case) Reinsurance Recoverable on Unpaid Losses"},{"$f":"+'Section I'!N6","v":"(6)                   Incurred But Not Reported Losses and"},{"$f":"+'Section I'!O6","v":"(7)                 Unearned"},{"$f":"+'Section I'!P6","v":"(8)                                      Total Recoverable      "}]
{"$rows_left_out":78}
{"sheet":"Section VII Overflow Page","index":12,"n_rows":82,"n_cols":16,"rows_kept":82}
[{"$nulls":7},{"$f":"+'Section VI'!H1","v":"ANNUAL STATEMENT FOR THE YEAR 2021 OF  "},{"$f":"+'Section I'!I1","v":""},{"$nulls":6},{"$f":"+'Section I'!P1","v":"OMB No. 1530-0008"}]
[{"$nulls":9},"Write or Stamp Name",{"$nulls":5},{"$f":"+'Section VI'!P2","v":" OMB Expiration Date:  6-30-2023"}]
["Schedule F - Part 1"]
[{"$f":"+'Section I'!A4","v":"Ceded Reinsurance as of December 31, Current Year (000's Omitted)"}]
["Section VII Overflow Page"]
[null,{"$f":"+'Section VI'!B6:B6","v":"Unauthorized"},{"$f":"+'Section VI'!C6","v":"Name of Reinsurer"},null,{"$f":"+'Section VI'!E6","v":"+"},{"$f":"+'Section VI'!F6","v":"(1)                      Reinsurance Premiums"},{"$f":"+'Section VI'!G6","v":"(2)                                                                                                                                                                        Recoverable on Paid Losses and                                                                              Paid Loss Adjustment Expense, Days Overdue"},{"$nulls":3},{"$f":"+'Section VI'!K6","v":"(3)                            Total           Overdue"},{"$f":"+'Section VI'!L6","v":"(4)          Percentage Overdue     "},{"$f":"+'Section VI'!M6","v":"(5)                       (Known Case) Reinsurance Recoverable on Unpaid Losses"},{"$f":"+'Section VI'!N6","v":"(6)                   Incurred But Not Reported Losses and"},{"$f":"+'Section VI'!O6","v":"(7)                 Unearned"},{"$f":"+'Section VI'!P6","v":"(8)                                      Total Recoverable      "}]
{"$rows_left_out":77}
{"sheet":"Section VIII Overflow Page","index":13,"n_rows":166,"n_cols":16,"rows_kept":166}
[{"$nulls":7},{"$f":"+'Section VI'!H1","v":"ANNUAL STATEMENT FOR THE YEAR 2021 OF  "},{"$f":"+'Section I'!I1","v":""},{"$nulls":6},{"$f":"+'Section I'!P1","v":"OMB No. 1530-0008"}]
[{"$nulls":9},"Write or Stamp Name",{"$nulls":5},{"$f":"+'Section VII'!P2","v":" OMB Expiration Date:  6-30-2023"}]
["Schedule F - Part 1"]
[{"$f":"+'Section I'!A4","v":"Ceded Reinsurance as of December 31, Current Year (000's Omitted)"}]
["Section VIII Overflow Page"]
[{"$f":"+'Section I'!A6","v":"Federal ID"},{"$f":"+'Section I'!B6","v":"NAIC Company "},{"$f":"+'Section I'!C6","v":"Name of Reinsurer"},{"$f":"+'Section I'!D6","v":"Domiciliary"},{"$f":"+'Section I'!E6","v":"+"},{"$f":"+'Section I'!F6","v":"(1)                      Reinsurance Premiums"},{"$f":"+'Section I'!G6","v":"(2)                                                                                                                                                                        Recoverable on Paid Losses and                                                                              Paid Loss Adjustment Expense, Days Overdue"},{"$nulls":3},{"$f":"+'Section I'!K6","v":"(3)                            Total           Overdue"},{"$f":"+'Section I'!L6","v":"(4)          Percentage Overdue     "},{"$f":"+'Section I'!M6","v":"(5)                       (Known Case) Reinsurance Recoverable on Unpaid Losses"},{"$f":"+'Section I'!N6","v":"(6)                   Incurred But Not Reported Losses and"},{"$f":"+'Section I'!O6","v":"(7)                 Unearned"},{"$f":"+'Section I'!P6","v":"(8)                                      Total Recoverable      "}]
{"$rows_left_out":161}
{"sheet":"Funds Held Overflow Page","index":14,"n_rows":173,"n_cols":12,"rows_kept":173}
[{"$nulls":6},{"$f":"+'Section VI'!H1","v":"ANNUAL STATEMENT FOR THE YEAR 2021 OF  "},{"$f":"+'Section I'!I1","v":""},{"$nulls":3},{"$f":"+'Section I'!P1","v":"OMB No. 1530-0008"}]
[{"$nulls":8},"Write or Stamp Name",null,null,{"$f":"+'Section I'!P2","v":" OMB Expiration Date:  6-30-2023"}]
["SCHEDULE F - Part 2"]
[{"$f":"+'Funds Held Section'!A4","v":"Funds Withheld on Account of Reinsurance in Unauthorized Companies as of December 31, Current Year (000's Omitted)"}]
["Overflow Page"]
[{"$nulls":5},"(2)"]
{"$rows_left_out":167}