{"text_format":"3","workbook":"xlsx","n_sheets":8,"sheets":["Instructions","ProgramStartDateValid","I_State, program, and plan info","StateValidation","II_Reconciliation","Revenue+Exp Storage","III_Plan Rev Exp Detailed (Mo)","III_Plan Rev Exp Detailed (Qt)"],"not_rendered":{"images":1,"macros":1,"defined_names":35},"read":"whole","date_system":"1900"}

{"sheet":"Instructions","index":0,"n_rows":31,"n_cols":5,"rows_kept":31,"merged":[[3,1,3,3],[6,1,6,3],[8,1,8,3],[9,1,9,3],[10,1,10,3],[12,1,12,3],[14,1,14,3],[15,1,15,3],[16,1,16,3],[17,1,17,3],[18,1,18,3],[19,1,19,3],[20,1,20,3],[23,1,23,3],[26,1,26,3],[29,1,29,3]]}
["Column A is blank. All information begins in column B, row 1.","Reporting Template for COVID-19 Risk Corridor Reconciliation"]
[null,"Instructions"]
[null,"Overview"]
[null,"Regulations at 42 C.F.R. § 438.6 outline provisions related to payments to Medicaid Managed Care Organizations (MCOs), Prepaid Inpatient Health Plans (PIHPs), and Prepaid Ambulatory Health Plans (PAHPs)—collectively referred to as “managed care plans.” The purpose of this template is to collect and analyze reconciliations for one and two-sided risk corridors that states implemented to reduce uncertainty associated with the COVID-19 Public Health Emergency. \n\nTo submit this information to the Centers for Medicare & Medicaid Services (CMS), states should complete one (1) template with information for all applicable plans within a program during a particular rating period. States are not expected to report risk corridor reconciliation results in this document for rating periods that end after December 31, 2021. If states have multiple programs that used different COVID-19-related risk corridors or have completed multiple reconciliations, they should submit one (1) template per reconciliation. Consistent with the Managed Care Program Annual Report (MCPAR) required by 42 C.F.R. § 438.66(e), this template defines a program as a group of plans that have a specified set of benefits, eligibility criteria, and capitation rate cells that are articulated in a contract between the state and managed care plans.\n\nInformation that states submit in this template will assist CMS in helping oversee the performance of state Medicaid managed care plans. Questions regarding the completion of this template should be sent to: ManagedCareTA@cms.hhs.gov."]
[]
[null,"Organization"]
[null,"This template is dynamic and contains formulas to help states submit the information to CMS efficiently and accurately. It includes three tabs (Tabs I, II, and III), which states should fill out in succession. When opening a new file, states will only see this current \"Instructions\" tab and Tab I. States will use macro-enabled buttons to unhide tabs II and III as they proceed through the reporting process (see “Inputting Information”). \n\nIn Tab I (\"State, program, and plan information\"), states should provide general information about the program, the managed care plans (up to 40 plans) and the COVID-19 related risk corridors that have been implemented. Information entered here will determine the layout of the subsequent Tabs II and III. In Tab II (\"Risk corridor reconciliation information\"), states should provide details on the risk corridor structure and report on plan-level revenue and expenses that are eligible for reconciliations according to the risk corridor. Information entered here will feed into the imbedded formulas that will calculate the final reconciliation amounts. In Tab III (\"Detailed plan revenue and expenses\"), states should provide detailed breakdowns on plan-level revenue and expenses by month or quarter; states also have the option of reporting specific revenue/expense sources eligible for reconciliations.",null,null," "]
[]
[null,"Inputting information"]
[null,"A description of how to input information is provided below. Subsequent sections/tabs provide further instructions on how each item should be reported in the “Item Instructions” column. The types of data to be entered (for example, free text, numerical or drop-down list of set values) are specified in the “Data Format” columns. Cells are color coded based on their contents, as follows: "]
[null,"BEIGE: Cell is a required data entry item. States must follow instructions and input the type of data as specified."]
[]
[null,"BLUE: Cell is an optional data entry item. States may follow instructions and input the type of data as specified. These items will also have \"(Optional)\" in the description."]
[]
[null,"GREY: Cell contains a formula and is automatically filled once input data is entered. Grey cells are locked for data entry; states should not attempt to change anything. "]
[null,"\n\n\n"]
[null,"GREEN: Cell contains example data, for reference only. States can refer to the example before they complete the relevant items."]
[null,"\n\n\n"]
[null,"WHITE: Cell contains instructions, for reference only. States should not attempt to change anything."]
[null,"\n\n\n"]
{"$rows_left_out":12}
{"sheet":"ProgramStartDateValid","index":1,"n_rows":2,"n_cols":2,"rows_kept":2,"hidden":true}
["N/A","2000-01-01"]
[null,"2022-01-01"]

{"sheet":"I_State, program, and plan info","index":2,"n_rows":47,"n_cols":45,"rows_kept":47,"merged":[[3,1,3,3],[19,1,19,3],[26,1,26,3],[33,1,33,3]]}
["Column A is blank. All information begins in column B, row 2."]
[null,"I. State, program, and plan information"]
[null,"A. State and program information"]
[null,"States should use this section to report their contact information, date of report submission, program information, and other related information. (All items in this section require input.)",{"$nulls":3},"Input state/program-level data in this column "]
[null,"#","Item","Item Instructions","Data Format",{"$f":"IF(F8=\"\",\"[State]\",F8)","v":"[State]"}]
[null,"I.A.1","Contact name","Enter the name of the individual(s) filling out this document.","Free text"]
[null,"I.A.2","Contact email address","Enter the email address(es) of the individual(s) filling out this document.","Free text"]
[null,"I.A.3","State or territory","Enter the state or territory represented in this document.","Drop down list of set values (select one)"]
[null,"I.A.4","State-based or program-based risk corridor","Indicate if the COVID-19 risk corridor that the state is reporting on applies to all programs and plans in the state or is limited to one program and the plans under that program. If the state is reporting on a single risk corridor state-wide across all programs, choose \"State\". If the state is reporting on a risk corridor that applies to one program, choose “Program”.\n\nWe do not expect risk corridors structures (i.e., the number of risk corridor bands or risk sharing percentages for plans and states) to vary for a particular risk corridor, although the state may set different risk corridor targets (for example, different Medical Loss Ratio (MLR) targets) for each plan. The state can enter specific targets for plans in the “II_Reconciliation” tab. ","Drop down list of set values (select one)"]
[null,"I.A.5","Risk corridor title","If the risk corridor that the state is reporting on has a title, indicate the name of the risk corridor.","Free text"]
[null,"I.A.6","Program name(s) for a state-based risk corridor","If the state selected “State” in item I.A.4, indicate the program name(s) that the risk corridor applies to.","Free text"]
[null,"I.A.7","Program name for a program-based risk corridor","If the state selected “Program” in item I.A.4, indicate the program name that the risk corridor applies to.","Free text"]
[null,"I.A.8","Program start date","If the state selected “Program” in item I.A.4, indicate what year the state implemented the program. ","Free text"]
[null,"I.A.9","Plan type","Indicate the managed care plan type (MCO, PIHP, or PAHP) that contracts with the state for the risk corridor that the state is reporting on. ","Drop down list of set values or free text (select one)"]
[null,"I.A.10","Rating period start date","Enter the rating period start date for the risk corridor reconciliation results that the state is reporting on in this document. ","Date (MM/DD/YYYY)"]
[null,"I.A.11","Rating period end date","Enter the rating period end date for the risk corridor reconciliation results that the state is reporting on in this document. States are not expected to report risk corridor reconciliation results in this document for rating periods that end after December 31, 2021.","Date (MM/DD/YYYY)"]
[null,"I.A.12","Date of report submission","Enter the date on which the state is submitting this document to CMS.","Date (MM/DD/YYYY)"]
[]
[null,"B. Plan information"]
[null,"States should use this section to report plan names for the program specified above in I.A.4. (All items in this section require input.)",{"$nulls":3},"Input plan-level data in beige cells in these columns >>"]
{"$rows_left_out":28}
{"sheet":"StateValidation","index":3,"n_rows":56,"n_cols":1,"rows_kept":56,"hidden":true}
["Alabama"]
["Alaska"]
["American Samoa"]
["Arizona"]
["Arkansas"]
["California"]
["Colorado"]
["Connecticut"]
["Delaware"]
["District of Columbia"]
["Florida"]
["Georgia"]
["Guam"]
["Hawaii"]
["Idaho"]
["Illinois"]
["Indiana"]
["Iowa"]
["Kansas"]
["Kentucky"]
{"$rows_left_out":37}
{"sheet":"II_Reconciliation","index":4,"n_rows":231,"n_cols":94,"rows_kept":231,"hidden":true,"merged":[[4,2,4,4],[5,5,5,7],[6,5,6,7],[7,1,8,1],[7,2,8,2],[7,3,8,3],[7,4,8,4],[9,5,9,7],[10,5,10,7],[11,5,11,7],[12,5,12,7],[14,1,14,7],[30,5,30,7],[47,1,47,2],[48,1,48,3],[53,1,53,4],[54,1,54,3],[69,1,69,3],[70,54,70,63],[70,64,70,73],[70,74,70,83],[70,84,70,93],[84,1,84,3],[116,1,116,4],[132,5,132,7],[149,1,149,2],[150,1,150,3],[162,1,162,3],[177,1,177,3],[178,54,178,63],[178,64,178,73],[178,74,178,83],[178,84,178,93],[192,1,192,3],[228,5,228,8]]}
["Column A is blank. All information begins in column B, row 2.","II. Reconciliation"]
[null,"A. Risk Corridor Features"]
[null,"Use this section to report on the risk corridor’s features, including the risk corridor's structure, bands, and target methodology. "]
[]
[null,"Program  Names",{"$f":"IF('I_State, program, and plan info'!F9=\"State\",'I_State, program, and plan info'!F11,'I_State, program, and plan info'!F12)","v":0}]
[null,"#","Risk corridor features","Item instructions","Data format",{"$f":"'I_State, program, and plan info'!F10","v":0},{"$nulls":47},"Revenue sources Go Here:"]
[null,"II.A.1","Risk corridor structure","Indicate whether the risk corridor is one-sided, two-sided symmetric, or two-sided asymmetric. \n\nA one-sided risk corridor is defined as a risk corridor that addresses plan profits and losses, but not both. \n\nA two-sided symmetric risk corridor is defined as a risk corridor that addresses plan profits and losses, with an equal number of bands and symmetrical risk sharing percentages on either side of the risk corridor's target. \n\nA two-sided asymmetric risk corridor is defined as a risk corridor that addresses plan profits and losses, but does not have an equal number of bands and/or symmetrical risk sharing percentages on either side of the risk corridor's target.\n\nThis response will affect the layout of this tab. ","Drop down list of set values (select one)"]
[null,"II.A.2","Number of bands in risk corridor","In cell F9, indicate the number bands in the risk corridor, exclusive of the neutral zone. For example, if a state has a risk corridor with a neutral zone and two bands on each side, enter “4” in cell F9. \n\nIf the risk corridor is One-Sided or Two-Sided asymmetric per item II.A.1, also indicate how many bands are above or below the neutral zone in cells G9 and H9, respectively. For example, if a risk corridor has a neutral zone with two bands above the neutral zone and one band below the neutral zone, enter “2” in cell G9 and “1” in cell H9. If a risk corridor is One-Sided with 3 bands above the neutral zone, enter \"3\" in cell G9 and leave cell H9 blank.\n\nThis response will affect the layout of this tab.","Drop down list of set values (select one)","Number of Bands - Cell F9","(If Asymmetric or One-Sided) Bands Above Neutral Zone, Cell G9","(If Asymmetric or One-Sided) Bands Below Neutral Zone, Cell H9"]
[]
[null,"II.A.3","Risk corridor target methodology","Indicate whether the risk corridor's target methodology uses Medical Loss Ratio (MLR) or a target ratio. An MLR target methodology compares a plan’s actual MLR against a target MLR. A target ratio methodology compares a plan's actual medical expenses to the plan’s expected medical expenses set in the program’s rate certification. Please contact ManagedCareTA@mathematica-mpr.com if the risk corridor's target methodology uses neither MLR nor a target ratio. \n\nThis response will affect the layout of this tab.","Drop down list of set values (select one)"]
[null,"II.A.4","Risk corridor target","Describe the target of the risk corridor. For example, this might be “85% MLR” or “a match between a plan’s actual medical expenses and the plan’s expected medical expenses set in the program’s rate certification.”","Free text"]
[null,"II.A.5","State's revenue sources (Optional)","Describe the sources of revenue eligible for inclusion in the risk corridor in cell F12. These might include premium revenue for medical costs, care management, etc. Please list up to 10 revenue sources per program, separate them by commas and omit leading spaces. \n\nThis response will affect the layout of Tab III.","Free text"]
[null,"II.A.6","State's expense sources (Optional)","Describe the sources of expenses eligible for inclusion in the risk corridor in cell F13. These might include claims, quality improvement activities, etc. Please list up to 10 expense sources per program, separate them by commas, and omit leading spaces. \n\nThis response will affect the layout of Tab III.","Free text"]
[]
[null,"B. Risk Corridor Band Boundaries\nA target ratio based risk corridor assumes that a plan's risk corridor actuals (i.e., the plan's expenses that are eligible for the risk corridor) should match the risk corridor's target (i.e., the plan's revenue that is eligible for the risk corridor), and that deviations in the plan's risk corridor actuals from that target can trigger a reconciliation. Use this section to specify the risk corridor's band boundaries as well as the state and plan risk sharing percentages as specified in the state’s design of the risk corridor (for example, one-sided, two-sided symmetric, two-sided asymmetric). For example, for a one-sided risk corridor, only populate the rows corresponding to the bands above or below the neutral zone. For a two-sided risk corridor, enter information for bands above and below the neutral zone. States may use the example provided in rows 31-44 (colored green) as reference for completing this section. This section must be completed accurately for the reconciliation amounts to be calculated properly at the end of this tab. \n\nPlease complete this section by populating columns F and G with the plan share and state share of each band under the risk corridor. For example, if the second band above the neutral zone has a plan share of 25% and a state share of 75%, enter 25% and 75% in columns F and G. In column H, enter the band limits of the risk corridor.\n\nThe target for the risk corridor should be equated to 100% with bands beginning above and below 100% for the reconciliation of actual expenditures. For example, if the second band above the neutral zone has a band limit of 4% or 104% compared to the target of the risk corridor, enter 104% in column H. For the highest and lowest bands above and below the neutral zone that the state enters for its risk corridor, enter '999%' in column H for the final band above the state's neutral zone. Enter '1%' in column H for the final band below the state's neutral zone. This will allow formulas pre-populated in Sections II.D through II.G to work properly to calculate the reconciliation amounts. For example, if the risk corridor has two bands above the neutral zone and two bands below the neutral zone, enter '999%' in column H for the second band above the neutral zone and '1%' in column H for the second band for the neutral zone."]
[null,"#","Risk corridor bands","Item instructions","Data format","Plan share","State share","Band limit"]
[{"$nulls":53},"Expense sources Go Here:"]
[null,null,"Fifth band above neutral zone","Indicate band information for the fifth band above the neutral zone.","Numeric"]
[null,null,"Fourth band above neutral zone","Indicate band information for the fourth band above the neutral zone.","Numeric"]
[null,null,"Third band above neutral zone","Indicate band information for the third band above the neutral zone.","Numeric"]
{"$rows_left_out":212}
{"sheet":"Revenue+Exp Storage","index":5,"n_rows":101,"n_cols":4,"rows_kept":101,"hidden":true}
["Programs Revenue Formulas","Programs Revenue Value Only After Macro, Removed Dup","Programs Expense Formulas","Programs Expense Value Only After Macro, Removed Dup"]
[{"$f":"TRIM((TRANSPOSE(II_Reconciliation!BB7:BK7)))","v":""},"Rev A",{"$f":"TRIM((TRANSPOSE(II_Reconciliation!BB18:BK18)))","v":""},"Exp A"]
["","B","","B"]
["","C","","C"]
["",null,""]
["",null,""]
["",null,""]
["",null,""]
["",null,""]
["",null,""]
["",null,""]
{"$rows_empty":10}
[{"$f":"TRIM((TRANSPOSE(II_Reconciliation!AA9:AJ9)))","v":""}]
[""]
[""]
[""]
[""]
[""]
[""]
[""]
{"$rows_left_out":54}
{"sheet":"III_Plan Rev Exp Detailed (Mo)","index":6,"n_rows":59,"n_cols":3,"rows_kept":59,"hidden":true,"merged":[[3,1,3,7]]}
["Column A is blank. All information begins in column B, row 2."]
[null,"III. Detailed Plan Revenue and Expenses (Mo)"]
[null,"A. Monthly Plan Revenue and Expenses"]
[null,"States should use this section to report a monthly breakdown of plan revenue and expenses for each plan included in the risk corridor. Please enter both revenue and expenses as positive numbers. This is the last required item in this workbook.\n\nThe data format for all data entry fields in this tab (including the required rows 8-19 and the required rows 26-37) is numeric. \n\nAfter completing Tab II, states must click 'Proceed to Tab III' (row 233 in Tab II) in order for Tab III to work correctly."]
[]
[null,"Revenue"]
[null,"Enter the plan's total revenue eligible under the risk corridor for each month of the rating period that the state is reporting on. ",{"$f":"'I_State, program, and plan info'!F22","v":0}]
[null,"Month 1"]
[null,"Month 2"]
[null,"Month 3"]
[null,"Month 4"]
[null,"Month 5"]
[null,"Month 6"]
[null,"Month 7"]
[null,"Month 8"]
[null,"Month 9"]
[null,"Month 10"]
[null,"Month 11"]
[null,"Month 12"," "]
[null,"Annual revenue. Do not complete this row. ",{"$f":"SUM(C8:C19)","v":0}]
{"$rows_left_out":40}
{"sheet":"III_Plan Rev Exp Detailed (Qt)","index":7,"n_rows":43,"n_cols":3,"rows_kept":43,"hidden":true,"merged":[[3,1,3,7]]}
["Column A is blank. All information begins in column B, row 2."]
[null,"III. Detailed Plan Revenue and Expenses (Qt)"]
[null,"A. Quarterly Plan Revenue and Expenses"]
[null,"States should use this section to report a quarterly breakdown of plan revenue and expenses for each plan included in the risk corridor. Please enter both revenue and expenses as positive numbers. This is the last required item in this workbook.\n\nThe data format for all data entry fields in this tab (including the required rows 8-11 and the required rows 18-21) is numeric. \n\nAfter completing Tab II, states must click 'Proceed to Tab III' (row 233 in Tab II) in order for Tab III to work correctly."]
[]
[null,"Revenue"]
[null,"Enter the plan's total revenue eligible under the risk corridor for each quarter of the rating period that the state is reporting on. ",{"$f":"'I_State, program, and plan info'!F22","v":0}]
[null,"Quarter 1"]
[null,"Quarter 2"]
[null,"Quarter 3"]
[null,"Quarter 4"]
[null,"Total annual revenue. Do not complete this row. ",{"$f":"SUM(C8:C11)","v":0}]
[null,"Annual revenue reported in Tab II. Do not complete this row. ",{"$f":"IF(II_Reconciliation!$F$10=\"Target Ratio\",II_Reconciliation!F$51,II_Reconciliation!F$153)","v":0}]
[null,"Difference from annual revenue reported in Tab II. Do not complete this row. ",{"$f":"C12-C13","v":0}]
[]
[null,"Expense"]
[null,"Enter the plan's total expenses eligible under the risk corridor for each quarter of the rating period that the state is reporting on. ",{"$f":"'I_State, program, and plan info'!F22","v":0}]
[null,"Quarter 1"]
[null,"Quarter 2"]
[null,"Quarter 3"]
{"$rows_left_out":23}