{"text_format":"3","workbook":"xlsx","n_sheets":14,"sheets":["Lookup","Lookup Alaska","TribePartI (2)","Instructions ","Profile","Form","PriorityListForm","TribePartI","Tribe Part II ","150 Per Cent","FPIG13","FPIG 125%","Sheet1","HIP Home"],"not_rendered":{"images":1,"macros":1,"external_links":7,"defined_names":85,"comments":2},"read":"whole","date_system":"1900"}

{"sheet":"Lookup","index":0,"n_rows":27,"n_cols":38,"rows_kept":27,"hidden":true,"merged":[[0,0,0,21],[1,0,1,21],[3,20,3,21],[4,20,4,21],[5,20,5,21],[6,20,6,21],[7,20,7,21],[8,20,8,21],[9,20,9,21],[10,20,10,21],[11,20,11,21],[12,20,12,21],[13,20,13,21],[14,20,14,21],[15,20,15,21],[17,1,17,2],[17,4,17,5],[17,7,17,8],[17,10,17,11],[17,13,17,14]]}
["FACTOR NO. 1 - HIP ELIGIBILITY/SELECTION CRITERIA @ 150%"]
["INCOME GUIDELINE POINT SCHEDULE FOR ALL STATES EXCEPT ALASKA"]
[null,null,25,null,null,20,null,null,15,null,null,10,null,null,5,null,null,0,null,null,"Ineligible",{"$nulls":14},"Income","Family Size","Answer"]
[1,0,"TO",{"$f":"D17","v":{"v":3015,"d":"3,015"}},{"$f":"D4+1","v":{"v":3016,"d":"3,016"}},"TO",{"$f":"G17","v":{"v":6030,"d":"6,030"}},{"$f":"G4+1","v":{"v":6031,"d":"6,031"}},"TO",{"$f":"J17","v":{"v":9045,"d":"9,045"}},{"$f":"J4+1","v":{"v":9046,"d":"9,046"}},"TO",{"$f":"M17","v":{"v":12060,"d":"12,060"}},{"$f":"M4+1","v":{"v":12061,"d":"12,061"}},"TO",{"$f":"P17","v":{"v":15075,"d":"15,075"}},{"$f":"P4+1","v":{"v":15076,"d":"15,076"}},"TO",{"$f":"S17","v":{"v":18090,"d":"18,090"}},{"$f":"S4+1","v":{"v":18091,"d":"18,091"}},"& HIGHER",null,null,1,{"$f":"B4","v":0},{"$f":"E4","v":3016},{"$f":"H4","v":6031},{"$f":"K4","v":9046},{"$f":"N4","v":12061},{"$f":"Q4","v":15076},{"$f":"T4","v":18091},{"$f":"HLOOKUP($AJ5,Y4:AE5,2)","v":25},"hlookup if in this row"]
[2,0,"TO",{"$f":"(D4+D$16)","v":{"v":4060,"d":"4,060"}},{"v":4061,"d":"4,061"},"TO",{"$f":"G4+G$16","v":{"v":8120,"d":"8,120"}},{"v":8121,"d":"8,121"},"TO",{"$f":"J4+J$16","v":{"v":12180,"d":"12,180"}},{"v":12181,"d":"12,181"},"TO",{"$f":"M4+M$16","v":{"v":16240,"d":"16,240"}},{"v":16241,"d":"16,241"},"TO",{"$f":"P4+P$16","v":{"v":20300,"d":"20,300"}},{"v":20301,"d":"20,301"},"TO",{"$f":"S4+S$16","v":{"v":24360,"d":"24,360"}},{"v":24361,"d":"24,361"},"& HIGHER",null,1,null,25,20,15,10,5,0,"N/A","N/A",{"$nulls":3},{"$f":"Form!G12","v":0},{"$f":"Form!E12","v":0},{"$f":"VLOOKUP(AK5,Income_2,9)","v":{"$error":"#N/A"}}]
[3,0,"TO",{"$f":"D5+D$16","v":{"v":5105,"d":"5,105"}},{"v":5106,"d":"5,106"},"TO",{"v":10210,"d":"10,210"},{"v":10211,"d":"10,211"},"TO",{"v":15315,"d":"15,315"},{"v":15316,"d":"15,316"},"TO",{"v":20420,"d":"20,420"},{"v":20421,"d":"20,421"},"TO",{"v":25525,"d":"25,525"},{"v":25526,"d":"25,526"},"TO",{"v":30630,"d":"30,630"},{"v":30631,"d":"30,631"},"& HIGHER",null,null,2,{"$f":"B5","v":0},{"$f":"E5","v":4061},{"$f":"H5","v":8121},{"$f":"K5","v":12181},{"$f":"N5","v":16241},null,{"$f":"T5","v":{"v":24361,"d":"24,361"}},{"$f":"HLOOKUP($AJ5,Y6:AE7,2)","v":25},"hlookup if in this row"]
{"$rows_left_out":22}
{"sheet":"Lookup Alaska","index":1,"n_rows":27,"n_cols":38,"rows_kept":27,"hidden":true,"merged":[[0,0,0,21],[1,0,1,21],[3,20,3,21],[4,20,4,21],[5,20,5,21],[6,20,6,21],[7,20,7,21],[8,20,8,21],[9,20,9,21],[10,20,10,21],[11,20,11,21],[12,20,12,21],[13,20,13,21],[14,20,14,21],[15,20,15,21],[17,1,17,2],[17,4,17,5],[17,7,17,8],[17,10,17,11],[17,13,17,14]]}
["FACTOR NO. 1 - HIP ELIGIBILITY/SELECTION CRITERIA @ 150%"]
["INCOME GUIDELINE POINT SCHEDULE FOR ALASKA"]
[null,null,25,null,null,20,null,null,15,null,null,10,null,null,5,null,null,0,null,null,"Ineligible",{"$nulls":14},"Income","Family Size","Answer"]
[1,0,"TO",{"$f":"D17","v":{"v":3765,"d":"3,765"}},{"$f":"D4+1","v":{"v":3766,"d":"3,766"}},"TO",{"$f":"G17","v":{"v":7530,"d":"7,530"}},{"$f":"G4+1","v":{"v":7531,"d":"7,531"}},"TO",{"$f":"J17","v":{"v":11295,"d":"11,295"}},{"$f":"J4+1","v":{"v":11296,"d":"11,296"}},"TO",{"$f":"M17","v":{"v":15060,"d":"15,060"}},{"$f":"M4+1","v":{"v":15061,"d":"15,061"}},"TO",{"$f":"P17","v":{"v":18825,"d":"18,825"}},{"$f":"P4+1","v":{"v":18826,"d":"18,826"}},"TO",{"$f":"S17","v":{"v":22590,"d":"22,590"}},{"$f":"S4+1","v":{"v":22591,"d":"22,591"}},"& HIGHER",null,null,1,{"$f":"B4","v":0},{"$f":"E4","v":3766},{"$f":"H4","v":7531},{"$f":"K4","v":11296},{"$f":"N4","v":15061},{"$f":"Q4","v":18826},{"$f":"T4","v":22591},{"$f":"HLOOKUP($AJ5,Y4:AE5,2)","v":25},"hlookup if in this row"]
[2,0,"TO",{"$f":"(D4+D$16)","v":{"v":5072.5,"d":"5,073"}},{"v":5073.5,"d":"5,074"},"TO",{"$f":"G4+G$16","v":{"v":10145,"d":"10,145"}},{"v":10146,"d":"10,146"},"TO",{"$f":"J4+J$16","v":{"v":15217.5,"d":"15,218"}},{"v":15218.5,"d":"15,219"},"TO",{"$f":"M4+M$16","v":{"v":20290,"d":"20,290"}},{"v":20291,"d":"20,291"},"TO",{"$f":"P4+P$16","v":{"v":25362.5,"d":"25,363"}},{"v":25363.5,"d":"25,364"},"TO",{"$f":"S4+S$16","v":{"v":30435,"d":"30,435"}},{"v":30436,"d":"30,436"},"& HIGHER",null,1,null,25,20,15,10,5,0,"N/A",{"$nulls":4},{"$f":"Form!G12","v":0},{"$f":"Form!E12","v":0},{"$f":"VLOOKUP(AK5,Income_1,9)","v":{"$error":"#N/A"}}]
[3,0,"TO",{"$f":"D5+D$16","v":{"v":6380,"d":"6,380"}},{"v":6381,"d":"6,381"},"TO",{"v":12760,"d":"12,760"},{"v":12761,"d":"12,761"},"TO",{"v":19140,"d":"19,140"},{"v":19141,"d":"19,141"},"TO",{"v":25520,"d":"25,520"},{"v":25521,"d":"25,521"},"TO",{"v":31900,"d":"31,900"},{"v":31901,"d":"31,901"},"TO",{"v":38280,"d":"38,280"},{"v":38281,"d":"38,281"},"& HIGHER",null,null,2,{"$f":"B5","v":0},{"$f":"E5","v":{"v":5073.5,"d":"5074"}},{"$f":"H5","v":10146},{"$f":"K5","v":{"v":15218.5,"d":"15219"}},{"$f":"N5","v":20291},{"$f":"Q5","v":{"v":25363.5,"d":"25,364"}},{"$f":"T5","v":{"v":30436,"d":"30,436"}},{"$f":"HLOOKUP($AJ5,Y6:AD7,2)","v":25},"hlookup if in this row"]
{"$rows_left_out":22}
{"sheet":"TribePartI (2)","index":2,"n_rows":2158,"n_cols":14,"rows_kept":2158,"hidden":true,"merged":[[0,0,0,10],[1,1,1,3],[1,4,1,9],[1,11,1,13],[2,1,2,3],[2,4,2,9],[2,11,2,13],[3,1,3,3],[3,4,3,9],[3,11,3,13],[4,1,4,3],[4,4,4,9],[4,11,4,13],[5,1,5,10],[6,0,7,3],[6,4,8,4],[6,5,7,9],[6,10,8,10],[6,11,8,11],[6,12,8,12],[6,13,8,13]]}
["                   PART I - TRIBAL WORK PLAN ",{"$nulls":10},"Date:",null,{"$f":"IF(Profile!D17=0,\"\",Profile!D17)","v":""}]
[1,"Work Plan for Fiscal Year: ",null,null,{"$f":"IF(Profile!D9=0,\"\",Profile!D9)","v":""},{"$nulls":5},"Name:",{"$f":"IF(Profile!D10=0,\"\",Profile!D10)","v":""}]
[2,"Name of Tribe / Consortium:",null,null,{"$f":"IF(Profile!D6=0,\"\",Profile!D6)","v":""},{"$nulls":5},"Title:",{"$f":"IF(Profile!D11=0,\"\",Profile!D11)","v":""}]
[3,"Number of Eligible Applicants:",null,null,{"$f":"IF(M2052=0,\"\",M2052)","v":10},{"$nulls":5},"Phone:",{"$f":"IF(Profile!D12=0,\"\",Profile!D12)","v":""}]
[4,"Number of Applications Received:",null,null,{"$f":"IF(B2052=0,\"\",B2052)","v":"Pretty Weasel"},{"$nulls":5},"Fax:",{"$f":"IF(Profile!D13=0,\"\",Profile!D13)","v":""}]
[null,"See instructions for printing form            "]
{"$rows_left_out":2153}
{"sheet":"Instructions ","index":3,"n_rows":133,"n_cols":2,"rows_kept":133,"merged":[[1,1,1,6],[2,1,2,6],[3,1,3,6],[4,1,4,6],[5,1,5,6],[6,1,6,6],[7,1,7,6],[8,0,8,6],[9,1,9,5],[10,1,10,5],[11,1,11,6],[12,1,12,6],[13,1,13,6],[14,1,14,6],[15,1,15,6],[16,1,16,6],[17,1,17,6],[18,1,18,6],[19,1,19,6],[20,1,20,6],[21,1,21,6],[22,1,22,6],[23,1,23,6],[25,1,25,5],[26,1,26,6],[27,1,27,6],[28,1,28,6],[29,1,29,6],[30,1,30,6],[31,1,31,6],[32,1,32,6],[33,1,33,6],[35,1,35,2],[36,1,36,6],[37,1,37,6],[38,1,38,6],[39,1,39,6],[40,1,40,6],[41,1,41,6],[42,1,42,6],[43,1,43,2],[44,1,44,2],[45,1,45,6],[46,1,46,6],[47,1,47,6],[48,1,48,6],[49,1,49,6],[50,1,50,6],[51,1,51,6],[52,1,52,6],[54,1,54,6],[55,1,55,5],[56,1,56,6],[57,1,57,6],[58,1,58,6],[59,1,59,6],[60,1,60,6],[61,1,61,6],[62,1,62,6],[63,1,63,6],[64,1,64,6],[65,1,65,6],[66,1,66,6],[67,1,67,6],[68,1,68,6],[69,1,69,6],[70,1,70,6],[71,1,71,6],[72,1,72,6],[73,1,73,6],[74,1,74,6],[75,1,75,6],[76,1,76,6],[77,1,77,6],[78,1,78,6],[79,1,79,6],[80,1,80,6],[81,1,81,6],[82,1,82,6],[83,1,83,6],[84,1,84,5],[85,1,85,5],[86,1,86,6],[87,1,87,6],[88,1,88,6],[89,1,89,6],[90,1,90,6],[91,1,91,6],[92,1,92,6],[93,1,93,6],[94,1,94,6],[95,1,95,6],[96,1,96,6],[97,1,97,6],[98,1,98,6],[99,1,99,6],[100,1,100,6],[101,1,101,6],[102,1,102,6],[103,1,103,6],[104,1,104,6],[105,1,105,6],[106,1,106,6],[107,1,107,6],[108,1,108,6],[110,1,110,5],[111,1,111,6],[112,1,112,6],[113,1,113,6],[114,1,114,6],[115,1,115,6],[116,1,116,6],[117,1,117,6],[118,1,118,6],[119,1,119,6],[120,1,120,6],[121,1,121,6],[122,1,122,6],[123,1,123,6],[124,1,124,6],[125,1,125,6],[126,1,126,6],[127,1,127,6],[128,1,128,6],[129,1,129,6],[130,1,130,6],[131,1,131,6]]}
[]
[null,"This workbook was created using Windows 7, Office Suite Excel 10. There may be some compatibility issues when trying to use this workbook with an earlier version of Excel.May not work with Microsoft Excel 5.0/95 Workbook version. "]
[null,"You are using the Electronic VBA Version of the 2019 HIP Tribal Annual Performance Report. This version shall only be used for FY 2019."]
[null,"This workbook contains macros and formulas, to properly use this Excel Workbook, you must save as enabled Workbook or enable the security macros."]
[null,"To save for use with an older version of Excel,choose Office,then Save As and select one of these options from the Save As Type dropdown list:1)Excel 97-2003 Workbook;2)Save as type:Excel Enabled Workbook;3)Save by adding your tribe name to file;(e.g. 2019 HIP Tribal Annual Performance Report - Your Tribe name)"]
[null,"The 2019 HIP Tribal Annual Performance Report is due to your respective region by COB December 31, 2018."]
{"$rows_left_out":128}
{"sheet":"Profile","index":4,"n_rows":572,"n_cols":20,"rows_kept":572,"merged":[[0,1,0,4],[1,1,1,4],[2,1,2,4],[6,1,6,4],[14,2,14,4],[19,1,21,4],[28,1,28,4],[29,1,35,4],[36,1,36,4],[37,1,42,4]]}
[null,"Housing Improvement Program",{"$nulls":5},"ALASKA","EASTERN OKLAHOMA","EASTERN ","GREAT PLAINS","MIDWEST","NAVAJO","NORTHWEST","PACIFIC","ROCKY MOUNTAIN","SOUTHERN PLAINS","SOUTHWEST","WESTERN"]
[null,"Tribal Annual Performance Report",{"$nulls":4},"ALASKA","Arctic Slope Native Association","Chickasaw","Catawba","Crow Creek","Bay Mills","Navajo Nation","Chehalis","Agua Caliente","Crow","Alabama-Coushatta","Cochiti","Ak-Chin Community","Housing Officer"]
[null,"Profile",{"$nulls":4},"EASTERN ","Association of Village Council Presidents","Choctaw","Cherokee","Flandreau","Bois Forte",null,"Coeur D'alene","Alturas","Blackfeet","Apache Of Oklahoma","Isleta","Battle Mountain","Housing Executive Director"]
[{"$nulls":6},"EASTERNOKLAHOMA","Bristol Bay Native Association","Creek","Chitimacha","Fort Berthold","Fon Du Lac",null,"Colville","Auburn","Fort Belknap","Caddo","Jemez","Cocopah","Housing Director"]
[null,1,"Region",{"$nulls":3},"GREATPLAINS","Central Council Tlingit and Haida","Eastern Shawnee","Choctaw","Fort Totten","Forest County",null,"Coos Bay","Augustine","Fort Peck","Cheyenne & Arapaho","Jicarilla","Colorado River","Housing Coordinator"]
[null,2,"Tribe / Consortia",{"$nulls":3},"MIDWEST","Cook Inlet Tribal Council","Miami","Coushatta","Lower Brule","Grand Portage",null,"Coquille","Barona","Northern Cheyenne","Citizen Potawatomi","Laguna","Duck Valley","Other"]
{"$rows_left_out":567}
{"sheet":"Form","index":5,"n_rows":634,"n_cols":21,"rows_kept":634,"merged":[[0,2,0,6],[2,4,3,10],[4,1,4,2],[5,8,5,10],[6,1,6,2],[6,8,6,9],[27,1,27,3],[31,1,31,6],[33,1,33,6],[34,1,34,7],[35,1,35,6],[37,1,37,7],[39,1,39,5],[39,6,39,8],[41,1,41,5],[41,9,41,10],[42,1,42,4],[42,9,42,10],[44,6,44,9]]}
[null,"See Instructions","        PRIORITY CALCULATION FORM"]
[null,"Region"]
[1,"ALASKA",null,null,"Privacy Act Warning!  Information on this sheet may pertain to the Privacy Act, all persons handing records must protect integrity, security and confidentiality!"]
[null,"Tribe of Consortia"]
[2,"Sitka Tribe Of Alaska"]
[null,"District, Agency, Member Tribe of Consortia",{"$nulls":4},"Fiscal Year",null,"Date of Application"]
{"$rows_left_out":629}
{"sheet":"PriorityListForm","index":6,"n_rows":4108,"n_cols":23,"rows_kept":4108,"merged":[[1,1,1,3],[1,6,1,11],[1,14,1,18],[2,1,2,3],[2,6,2,11],[2,14,2,18],[3,1,3,2],[3,9,3,10],[3,15,3,20],[4,0,4,21]]}
[]
[null,"Regional Office:",null,null,{"$f":"IF(Profile!D5=\"\",\"\",Profile!D5)","v":""},null,"Number of Tribes Submitting Workplans:",{"$nulls":7},"Number of Eligible Applicants:",{"$nulls":5},{"$f":"IF(U4108=\"\",\"\",U4108)","v":""}]
[null,"Fiscal  Year:",null,null,{"$f":"IF(Profile!D9=\"\",\"\",Profile!D9)","v":""},null,"Number of Tribes In Region:",{"$nulls":7},"Number of Applications Considered:",{"$nulls":5},{"$f":"IF(V4108=\"\",\"\",V4108)","v":""}]
[]
["Privacy Act Warning!  Information on this sheet may pertain to the Privacy Act, must protect integrity, security and confidentiality!"]
[null,"LAST NAME","FIRST NAME","Suffix","Tribe/ District","Cat","Family size","Income    1040 Form","Income Pts","Aged","Disabled","Dependent Children","Homeless","Dilapidated","Overcrowded","Native Veteran","Veteran Loan","Down  Payment","Denial Letter","Prior Assistance","Eligibility Status","Total Points","Notes"]
{"$rows_left_out":4103}
{"sheet":"TribePartI","index":7,"n_rows":4110,"n_cols":14,"rows_kept":4110,"merged":[[0,0,0,10],[1,1,1,3],[1,4,1,9],[1,11,1,13],[2,1,2,3],[2,4,2,9],[2,11,2,13],[3,1,3,3],[3,4,3,9],[3,11,3,13],[4,1,4,3],[4,4,4,9],[4,11,4,13],[5,1,5,10],[6,0,7,3],[6,4,8,4],[6,5,7,9],[6,10,8,10],[6,11,8,11],[6,12,8,12],[6,13,8,13]]}
["                   PART I - TRIBAL WORK PLAN ",{"$nulls":10},"Date:",null,{"$f":"IF(Profile!D17=0,\"\",Profile!D17)","v":""}]
[1,"Work Plan for Fiscal Year: ",null,null,{"$f":"IF(Profile!D9=0,\"\",Profile!D9)","v":""},{"$nulls":5},"Name:",{"$f":"IF(Profile!D10=0,\"\",Profile!D10)","v":""}]
[2,"Name of Tribe / Consortium:",null,null,{"$f":"IF(Profile!D6=0,\"\",Profile!D6)","v":""},{"$nulls":5},"Title:",{"$f":"IF(Profile!D11=0,\"\",Profile!D11)","v":""}]
[3,"Number of Eligible Applicants:",null,null,{"$f":"IF(M4110=0,\"\",M4110)","v":""},{"$nulls":5},"Phone:",{"$f":"IF(Profile!D12=0,\"\",Profile!D12)","v":""}]
[4,"Number of Applications Received:",null,null,{"$f":"IF(B4110=0,\"\",B4110)","v":""},{"$nulls":5},"Fax:",{"$f":"IF(Profile!D13=0,\"\",Profile!D13)","v":""}]
[null,"See instructions for printing form            "]
{"$rows_left_out":4105}
{"sheet":"Tribe Part II ","index":8,"n_rows":65,"n_cols":14,"rows_kept":65,"merged":[[0,0,0,13],[1,0,2,0],[1,1,1,3],[1,5,1,8],[1,10,1,13],[2,1,2,4],[2,5,2,8],[2,10,2,13],[3,0,5,0],[3,1,3,4],[3,5,3,8],[3,10,3,11],[3,12,3,13],[4,1,4,4],[4,5,4,8],[4,10,4,11],[4,12,4,13],[5,1,5,4],[5,5,5,8],[5,10,5,11],[5,12,5,13],[6,1,6,2],[6,5,6,8],[6,10,6,11],[6,12,6,13],[7,1,7,2],[7,5,7,8],[8,0,10,0],[8,1,9,2],[8,3,10,3],[8,4,9,8],[8,9,9,10],[8,11,9,13]]}
["PART II - REPORT OF ACCOMPLISHMENTS"]
[1,"a. Number of Applicants Provided Service:",{"$nulls":3},{"$f":"IF(B64=0,\"\",B64)","v":""},{"$nulls":4},"   Name of Tribe / Consortium"]
[null,"b. Number of Projects Completed within Fiscal Year:",{"$nulls":3},{"$f":"IF(K64=0,\"\",K64)","v":""},{"$nulls":4},{"$f":"IF(Profile!D6=0,\"\",Profile!D6)","v":""}]
[2,"a. Amount of Total  Administration Funds to Report:",{"$nulls":3},{"$f":"IF(L64=0,\"\",L64)","v":""},{"$nulls":4}," REGION",null,{"$f":"IF(Profile!D5=0,\"\",Profile!D5)","v":""}]
[null,"b. Amount of Total  Constuction Funds to Report:",{"$nulls":3},{"$f":"IF(M64=0,\"\",M64)","v":""},{"$nulls":4},"AGENCY",null,{"$f":"IF(Profile!D8=\"\",\"\",Profile!D8)","v":""}]
[null,"c. Amount of Total HIP Funds to Report:",{"$nulls":3},{"$f":"IF(N64=0,\"\",N64)","v":""},{"$nulls":4}," FISCAL YEAR",null,{"$f":"IF(Profile!D9=0,\"\",Profile!D9)","v":""}]
{"$rows_left_out":60}
{"sheet":"150 Per Cent","index":9,"n_rows":43,"n_cols":21,"rows_kept":43,"merged":[[0,0,0,21],[1,0,1,21],[2,1,2,3],[2,4,2,6],[2,7,2,9],[2,10,2,12],[2,13,2,15],[2,16,2,18],[2,19,2,21],[4,20,4,21],[5,20,5,21],[6,20,6,21],[7,20,7,21],[8,20,8,21],[9,20,9,21],[10,20,10,21],[11,20,11,21],[12,20,12,21],[13,20,13,21],[14,20,14,21],[15,20,15,21],[16,20,16,21],[18,1,18,2],[18,4,18,5],[18,7,18,8],[18,10,18,11],[18,13,18,14],[18,16,18,17],[23,0,23,21],[24,0,24,21],[25,1,25,3],[25,4,25,6],[25,7,25,9],[25,10,25,12],[25,13,25,15],[25,16,25,18],[25,19,25,21],[27,20,27,21],[28,20,28,21],[29,20,29,21],[30,20,30,21],[31,20,31,21],[32,20,32,21],[33,20,33,21],[34,20,34,21],[35,20,35,21],[36,20,36,21],[37,20,37,21],[38,20,38,21],[39,20,39,21],[41,1,41,2],[41,4,41,5],[41,7,41,8],[41,10,41,11],[41,13,41,14],[41,16,41,17]]}
["FACTOR NO. 1 - HIP ELIGIBILITY/SELECTION CRITERIA @ 150%"]
["INCOME GUIDELINE POINT SCHEDULE FOR ALL STATES EXCEPT ALASKA & HAWAII"]
["FAMILY SIZE","0% to 25% of PG\n25 POINTS",null,null,"26% to 50% of PG\n20 POINTS",null,null,"51% to 75% of PG\n15 POINTS",null,null,"76% to 100 of PG\n10 POINTS",null,null,"101% to 125% of PG \n5 POINTS",null,null,"125% to 150% of PG\n0 POINTS",null,null,"OVER 150% of FPIG\nINELIGIBLE"]
[]
[1,0,"TO",{"$f":"D18","v":{"v":3035,"d":"3,035 "}},{"$f":"D5+1","v":{"v":3036,"d":"3,036"}},"TO",{"$f":"G18","v":{"v":6070,"d":"6,070 "}},{"$f":"G5+1","v":{"v":6071,"d":"6,071"}},"TO",{"$f":"J18","v":{"v":9105,"d":"9,105 "}},{"$f":"J5+1","v":{"v":9106,"d":"9,106"}},"TO",{"$f":"M18","v":{"v":12140,"d":"12,140"}},{"$f":"M5+1","v":{"v":12141,"d":"12,141"}},"TO",{"$f":"P18","v":{"v":15175,"d":"15,175"}},{"$f":"P5+1","v":{"v":15176,"d":"15,176"}},"TO",{"$f":"S18","v":{"v":18210,"d":"18,210"}},{"$f":"S5+1","v":{"v":18211,"d":"18,211"}},"& HIGHER"]
[2,0,"TO",{"$f":"D5+D$17","v":{"v":4115,"d":"4,115 "}},{"v":4116,"d":"4,116"},"TO",{"$f":"G5+G$17","v":{"v":8230,"d":"8,230 "}},{"v":8231,"d":"8,231"},"TO",{"$f":"J5+J$17","v":{"v":12345,"d":"12,345"}},{"v":12346,"d":"12,346"},"TO",{"$f":"M5+M$17","v":{"v":16460,"d":"16,460"}},{"v":16461,"d":"16,461"},"TO",{"$f":"P5+P$17","v":{"v":20575,"d":"20,575"}},{"v":20576,"d":"20,576"},"TO",{"$f":"S5+S$17","v":{"v":24690,"d":"24,690"}},{"v":24691,"d":"24,691"},"& HIGHER"]
{"$rows_left_out":38}
{"sheet":"FPIG13","index":10,"n_rows":42,"n_cols":18,"rows_kept":42,"hidden":true,"merged":[[0,0,0,18],[1,0,1,18],[2,1,2,3],[2,4,2,6],[2,7,2,9],[2,10,2,12],[2,13,2,15],[2,16,2,18],[4,17,4,18],[5,17,5,18],[6,17,6,18],[7,17,7,18],[8,17,8,18],[9,17,9,18],[10,17,10,18],[11,17,11,18],[12,17,12,18],[13,17,13,18],[14,17,14,18],[15,17,15,18],[16,1,16,3],[16,4,16,6],[16,7,16,9],[16,10,16,12],[16,13,16,15],[16,17,16,18],[18,1,18,2],[18,4,18,5],[18,7,18,8],[18,10,18,11],[18,13,18,14],[20,0,20,18],[21,0,21,18],[22,1,22,3],[22,4,22,6],[22,7,22,9],[22,10,22,12],[22,13,22,15],[22,16,22,18],[24,17,24,18],[25,17,25,18],[26,17,26,18],[27,17,27,18],[28,17,28,18],[29,17,29,18],[30,17,30,18],[31,17,31,18],[32,17,32,18],[33,17,33,18],[34,17,34,18],[35,17,35,18],[36,17,36,18],[38,1,38,2],[38,4,38,5],[38,7,38,8],[38,10,38,11],[38,13,38,14]]}
["FACTOR NO. 1 - HIP ELIGIBILITY/SELECTION CRITERIA @ 150%"]
["INCOME GUIDELINE POINT SCHEDULE FOR ALASKA "]
["FAMILY SIZE","0% to 25% of PG\n40 POINTS",null,null,"26% to 50% of PG\n30 POINTS",null,null,"51% to 75% of PG\n20 POINTS",null,null,"76% to 100% of PG\n10 POINTS",null,null,"101% to 125% of PG\n0 POINTS",null,null,"OVER 125% of FPIG\nINELIGIBLE"]
[]
[1,0,"TO",{"$f":"$D$18","v":{"v":3587.5,"d":"3,588 "}},{"$f":"D5+1","v":{"v":3588.5,"d":"3,589"}},"TO",{"$f":"G18","v":{"v":6985,"d":"6,985 "}},{"$f":"G5+1","v":{"v":6986,"d":"6,986"}},"TO",{"$f":"J18","v":{"v":10478,"d":"10,478"}},{"$f":"J5+1","v":{"v":10479,"d":"10,479"}},"TO",{"$f":"M18","v":{"v":14350,"d":"14,350"}},{"$f":"M5+1","v":{"v":14351,"d":"14,351"}},"TO",{"$f":"P18","v":{"v":17463,"d":"17,463"}},{"$f":"P5+1","v":{"v":17464,"d":"17,464"}},"& HIGHER"]
[2,0,"TO",{"$f":"D5+B$17","v":{"v":4845,"d":"4,845"}},{"v":4846,"d":"4,846"},"TO",{"$f":"G5+E$17","v":{"v":9500,"d":"9,500"}},{"v":9501,"d":"9,501"},"TO",{"v":14191,"d":"14,191"},{"v":14192,"d":"14,192"},"TO",{"$f":"M5+K$17","v":{"v":19380,"d":"19,380"}},{"v":19381,"d":"19,381"},"TO",{"v":23651,"d":"23,651"},{"v":23652,"d":"23,652"},"& HIGHER"]
{"$rows_left_out":37}
{"sheet":"FPIG 125%","index":11,"n_rows":40,"n_cols":18,"rows_kept":40,"hidden":true,"merged":[[0,0,0,18],[1,0,1,18],[2,1,2,3],[2,4,2,6],[2,7,2,9],[2,10,2,12],[2,13,2,15],[2,16,2,18],[4,17,4,18],[5,17,5,18],[6,17,6,18],[7,17,7,18],[8,17,8,18],[9,17,9,18],[10,17,10,18],[11,17,11,18],[12,17,12,18],[13,17,13,18],[14,17,14,18],[15,17,15,18],[16,1,16,3],[16,4,16,6],[16,7,16,9],[16,10,16,12],[16,13,16,15],[16,17,16,18],[18,1,18,2],[18,4,18,5],[18,7,18,8],[18,10,18,11],[18,13,18,14],[20,0,20,18],[21,0,21,18],[22,1,22,3],[22,4,22,6],[22,7,22,9],[22,10,22,12],[22,13,22,15],[22,16,22,18],[24,17,24,18],[25,17,25,18],[26,17,26,18],[27,17,27,18],[28,17,28,18],[29,17,29,18],[30,17,30,18],[31,17,31,18],[32,17,32,18],[33,17,33,18],[34,17,34,18],[35,17,35,18],[36,17,36,18],[38,1,38,2],[38,4,38,5],[38,7,38,8],[38,10,38,11],[38,13,38,14]]}
["FACTOR NO. 1 - HIP ELIGIBILITY/SELECTION CRITERIA @ 125%"]
["INCOME GUIDELINE POINT SCHEDULE FOR ALL STATES EXCEPT ALASKA "]
["FAMILY SIZE","0% to 25% of PG\n40 POINTS",null,null,"26% to 50% of PG\n30 POINTS",null,null,"51% to 75% of PG\n20 POINTS",null,null,"76% to 100% of PG\n10 POINTS",null,null,"101% to 125% of PG\n0 POINTS",null,null,"OVER 125% of FPIG\nINELIGIBLE"]
[]
[1,0,"TO",{"$f":"D18","v":{"v":2872.5,"d":"2,873 "}},{"$f":"D5+1","v":{"v":2873.5,"d":"2,874"}},"TO",{"$f":"G18","v":{"v":5745,"d":"5,745 "}},{"$f":"G5+1","v":{"v":5746,"d":"5,746"}},"TO",{"$f":"J18","v":{"v":8617.5,"d":"8,618"}},{"$f":"J5+1","v":{"v":8618.5,"d":"8,619"}},"TO",{"$f":"M18","v":{"v":11490,"d":"11,490"}},{"$f":"M5+1","v":{"v":11491,"d":"11,491"}},"TO",{"$f":"P18","v":{"v":14362.5,"d":"14,363"}},{"$f":"P5+1","v":{"v":14363.5,"d":"14,364"}},"& HIGHER"]
[2,0,"TO",{"$f":"D5+B$17","v":{"v":3877.5,"d":"3,878"}},{"v":3878.5,"d":"3,879"},"TO",{"$f":"G5+E$17","v":{"v":7755,"d":"7,755"}},{"v":7756,"d":"7,756"},"TO",{"$f":"J5+H$17","v":{"v":11632.5,"d":"11,633"}},{"v":11633.5,"d":"11,634"},"TO",{"$f":"M5+K$17","v":{"v":15510,"d":"15,510"}},{"v":15511,"d":"15,511"},"TO",{"$f":"P5+N$17","v":{"v":19387.5,"d":"19,388"}},{"v":19388.5,"d":"19,389"},"& HIGHER"]
{"$rows_left_out":35}
{"sheet":"Sheet1","index":12,"n_rows":7,"n_cols":4,"rows_kept":7,"hidden":true}
[]
[]
[null," formula shows total if all three cell are populated or than zero, other wise blank or zero"]
[]
[null,{"$f":"IF(OR(ISBLANK(B7),ISBLANK(C7),ISBLANK(D7)), \"no data\", IF(OR(B7=0, C7=0, D7=0),\"ZERO\", B7+C7+D7))","v":7}]
[]
{"$rows_left_out":2}
{"sheet":"HIP Home","index":13,"n_rows":0,"n_cols":0,"rows_kept":0}