{"text_format":"3","workbook":"xlsx","n_sheets":6,"sheets":["VETS-402","Export","Output","Pivot","Data","Lists"],"not_rendered":{"images":2,"macros":1,"defined_names":6,"pivot_tables":1},"read":"whole","date_system":"1900"}

{"sheet":"VETS-402","index":0,"n_rows":79,"n_cols":30,"rows_kept":79,"merged":[[0,1,0,2],[0,3,0,29],[1,0,9,0],[1,1,1,2],[1,3,1,9],[1,10,1,15],[1,16,4,20],[1,21,5,21],[1,22,4,27],[1,28,1,29],[2,1,2,2],[2,3,2,15],[2,28,2,29],[3,1,3,2],[3,3,3,4],[3,5,3,7],[3,8,3,9],[3,11,5,11],[3,12,4,15],[3,28,3,29],[4,1,4,2],[5,1,5,4],[5,5,5,7],[5,8,5,9],[5,14,5,15],[5,18,5,19],[5,24,5,25],[5,28,5,29],[6,1,8,2],[6,3,6,7],[6,8,6,9],[6,10,6,29],[7,4,7,5],[7,6,7,7],[7,8,7,9],[7,10,10,10],[7,11,10,11],[7,12,7,13],[7,14,7,15],[7,16,7,17],[7,18,7,19],[7,20,10,20],[7,21,10,21],[7,22,7,23],[7,24,7,25],[7,26,7,27],[7,28,7,29],[10,0,77,0],[10,1,11,1],[11,3,11,29],[12,1,12,29],[13,1,21,1],[13,3,13,29],[14,10,20,10],[15,20,20,20],[21,3,21,29],[22,1,22,29],[23,1,61,1],[23,2,23,29],[24,10,30,10],[24,20,30,20],[31,3,31,29],[32,2,32,29],[33,10,39,10],[33,20,39,20],[40,3,40,29],[41,2,41,29],[42,10,48,10],[42,20,48,20],[49,3,49,29],[50,2,50,29],[51,10,54,10],[51,20,54,20],[55,3,55,29],[56,2,56,29],[57,10,60,10],[57,20,60,20],[61,3,61,29],[62,1,62,29],[63,1,71,1],[63,3,63,29],[64,10,70,10],[64,20,70,20],[71,3,71,28],[72,8,72,27],[72,28,72,29],[73,1,77,1],[73,2,77,9],[73,10,77,29]]}
["Accessibility key: Unlocked (yellow) cells may be edited. A value followed by an exclamation point indicates an invalid entry.",0,null,0]
[0,"U.S. Department of Labor\n",null,0,{"$nulls":6},"Jobs for Veterans State Grants Expenditure Detail Report",{"$nulls":5},0,{"$nulls":4},0,0,{"$nulls":5},"OMB Control Number: 1293-0009"]
[null,"Veterans' Employment and Training Service",null,0,{"$nulls":24}," Expiration Date: 06/30/2025"]
[null,"Section A: Grantee & Quarter Information",null,0,null,"State/Territory ",{"$nulls":5},0,0,{"$nulls":15},0]
[null,0,{"$nulls":26},0,0]
[null,0,{"$nulls":3},"Grant Number (ex. 22A55DV123456-01-09)",{"$nulls":4},0,null,0,"Grant Number ",{"$f":"IF(ISBLANK(I6),\"\",I6)","v":""},null,0,"State ",{"$f":"IF(ISBLANK(I4),\"\",I4)","v":""},{"$nulls":3},0,"Grant Number ",{"$f":"IF(ISBLANK(I6),\"\",I6)","v":""},null,0,"State ",{"$f":"IF(ISBLANK(I4),\"\",I4)","v":""}]
[null,0,null,0,{"$nulls":4},{"$f":"IF(I6=\"\",\"\",(IF(ISERROR(Lists!P23),\"INCORRECT GRANT NUMBER\",\"\")))","v":""},null,0]
[{"$nulls":3},"Year 1 Quarter 1","Year 1 Quarter 2",null,"Year 1 Quarter 3",null,"Year 1 Quarter 4",null,0,0,"Year 2 Quarter 1",null,"Year 2 Quarter 2",null,"Year 2 Quarter 3",null,"Year 2 Quarter 4",null,0,0,"Year 3 Quarter 1",null,"Year 3 Quarter 2",null,"Year 3 Quarter 3",null,"Year 3 Quarter 4"]
[{"$nulls":3},"1st Quarter","2nd Quarter","Y1Q2 Cumulative","3rd Quarter","Y1Q3 Cumulative","4th Quarter","Y1Q4 Cumulative",null,null,"5th Quarter","Y2Q1 Cumulative","6th Quarter","Y2Q2 Cumulative","7th Quarter","Y2Q3 Cumulative","8th Quarter","Y2Q4 Cumulative",null,null,"9th Quarter","Y3Q1 Cumulative","10th Quarter","Y3Q2 Cumulative","11th Quarter","Y3Q3 Cumulative","12th Quarter","Y3Q4 Cumulative"]
[null,0,"Quarter Ending ",{"$f":"IF(ISERROR(VLOOKUP(Lists!$N$22,Lists!$Q$19:$AD$26,3)),\"\",VLOOKUP(Lists!$N$22,Lists!$Q$19:$AD$26,3))","v":""},{"$f":"\"Q\"&F10","v":"Q"},{"$f":"IF(ISERROR(VLOOKUP(Lists!$N$22,Lists!$Q$19:$AD$26,4)),\"\",VLOOKUP(Lists!$N$22,Lists!$Q$19:$AD$26,4))","v":""},{"$f":"\"Q\"&H10","v":"Q"},{"$f":"IF(ISERROR(VLOOKUP(Lists!$N$22,Lists!$Q$19:$AD$26,5)),\"\",VLOOKUP(Lists!$N$22,Lists!$Q$19:$AD$26,5))","v":""},{"$f":"\"Q\"&J10","v":"Q"},{"$f":"IF(ISERROR(VLOOKUP(Lists!$N$22,Lists!$Q$19:$AD$26,6)),\"\",VLOOKUP(Lists!$N$22,Lists!$Q$19:$AD$26,6))","v":""},null,null,{"$f":"\"Q\"&N10","v":"Q"},{"$f":"IF(ISERROR(VLOOKUP(Lists!$N$22,Lists!$Q$19:$AD$26,7)),\"\",VLOOKUP(Lists!$N$22,Lists!$Q$19:$AD$26,7))","v":""},{"$f":"\"Q\"&P10","v":"Q"},{"$f":"IF(ISERROR(VLOOKUP(Lists!$N$22,Lists!$Q$19:$AD$26,8)),\"\",VLOOKUP(Lists!$N$22,Lists!$Q$19:$AD$26,8))","v":""},{"$f":"\"Q\"&R10","v":"Q"},{"$f":"IF(ISERROR(VLOOKUP(Lists!$N$22,Lists!$Q$19:$AD$26,9)),\"\",VLOOKUP(Lists!$N$22,Lists!$Q$19:$AD$26,9))","v":""},{"$f":"\"Q\"&T10","v":"Q"},{"$f":"IF(ISERROR(VLOOKUP(Lists!$N$22,Lists!$Q$19:$AD$26,10)),\"\",VLOOKUP(Lists!$N$22,Lists!$Q$19:$AD$26,10))","v":""},null,null,{"$f":"\"Q\"&X10","v":"Q"},{"$f":"IF(ISERROR(VLOOKUP(Lists!$N$22,Lists!$Q$19:$AD$26,11)),\"\",VLOOKUP(Lists!$N$22,Lists!$Q$19:$AD$26,11))","v":""},{"$f":"\"Q\"&Z10","v":"Q"},{"$f":"IF(ISERROR(VLOOKUP(Lists!$N$22,Lists!$Q$19:$AD$26,12)),\"\",VLOOKUP(Lists!$N$22,Lists!$Q$19:$AD$26,12))","v":""},{"$f":"\"Q\"&AB10","v":"Q"},{"$f":"IF(ISERROR(VLOOKUP(Lists!$N$22,Lists!$Q$19:$AD$26,13)),\"\",VLOOKUP(Lists!$N$22,Lists!$Q$19:$AD$26,13))","v":""},{"$f":"\"Q\"&AD10","v":"Q"},{"$f":"IF(ISERROR(VLOOKUP(Lists!$N$22,Lists!$Q$19:$AD$26,14)),\"\",VLOOKUP(Lists!$N$22,Lists!$Q$19:$AD$26,14))","v":""}]
{"$rows_left_out":70}
{"sheet":"Export","index":1,"n_rows":42,"n_cols":14,"rows_kept":42}
["Section","Item Name","Year 1 Quarter 1","Year 1 Quarter 2","Year 1 Quarter 3","Year 1 Quarter 4","Year 2 Quarter 1","Year 2 Quarter 2","Year 2 Quarter 3","Year 2 Quarter 4","Year 3 Quarter 1","Year 3 Quarter 2","Year 3 Quarter 3","Year 3 Quarter 4"]
["Section A","Grant Number (ex. 22A55DV123456-01-09)",{"$f":"'VETS-402'!$I$6","v":0},{"$f":"'VETS-402'!$I$6","v":0},{"$f":"'VETS-402'!$I$6","v":0},{"$f":"'VETS-402'!$I$6","v":0},{"$f":"'VETS-402'!$I$6","v":0},{"$f":"'VETS-402'!$I$6","v":0},{"$f":"'VETS-402'!$I$6","v":0},{"$f":"'VETS-402'!$I$6","v":0},{"$f":"'VETS-402'!$I$6","v":0},{"$f":"'VETS-402'!$I$6","v":0},{"$f":"'VETS-402'!$I$6","v":0},{"$f":"'VETS-402'!$I$6","v":0}]
["Section A","State",{"$f":"'VETS-402'!$S$6","v":""},{"$f":"'VETS-402'!$S$6","v":""},{"$f":"'VETS-402'!$S$6","v":""},{"$f":"'VETS-402'!$S$6","v":""},{"$f":"'VETS-402'!$S$6","v":""},{"$f":"'VETS-402'!$S$6","v":""},{"$f":"'VETS-402'!$S$6","v":""},{"$f":"'VETS-402'!$S$6","v":""},{"$f":"'VETS-402'!$S$6","v":""},{"$f":"'VETS-402'!$S$6","v":""},{"$f":"'VETS-402'!$S$6","v":""},{"$f":"'VETS-402'!AC73","v":"Revised Mar 2024"}]
["Section A","Quarter Ending ",{"$f":"'VETS-402'!D10","v":""},{"$f":"'VETS-402'!F10","v":""},{"$f":"'VETS-402'!H10","v":""},{"$f":"'VETS-402'!J10","v":""},{"$f":"'VETS-402'!N10","v":""},{"$f":"'VETS-402'!P10","v":""},{"$f":"'VETS-402'!R10","v":""},{"$f":"'VETS-402'!T10","v":""},{"$f":"'VETS-402'!X10","v":""},{"$f":"'VETS-402'!Z10","v":""},{"$f":"'VETS-402'!AB10","v":""},{"$f":"'VETS-402'!AD10","v":""}]
["Section A","Date Prepared ",{"$f":"'VETS-402'!D11","v":"00:00:00"},{"$f":"'VETS-402'!F11","v":"00:00:00"},{"$f":"'VETS-402'!H11","v":"00:00:00"},{"$f":"'VETS-402'!J11","v":"00:00:00"},{"$f":"'VETS-402'!N11","v":"00:00:00"},{"$f":"'VETS-402'!P11","v":"00:00:00"},{"$f":"'VETS-402'!R11","v":"00:00:00"},{"$f":"'VETS-402'!T11","v":"00:00:00"},{"$f":"'VETS-402'!X11","v":"00:00:00"},{"$f":"'VETS-402'!Z11","v":"00:00:00"},{"$f":"'VETS-402'!AB11","v":"00:00:00"},{"$f":"'VETS-402'!AD11","v":"00:00:00"}]
["Section B","a. Disabled Veterans Outreach Program",{"$f":"ROUND('VETS-402'!D16,0)","v":0},{"$f":"ROUND('VETS-402'!F16,0)","v":0},{"$f":"ROUND('VETS-402'!H16,0)","v":0},{"$f":"ROUND('VETS-402'!J16,0)","v":0},{"$f":"ROUND('VETS-402'!N16,0)","v":0},{"$f":"ROUND('VETS-402'!P16,0)","v":0},{"$f":"ROUND('VETS-402'!R16,0)","v":0},{"$f":"ROUND('VETS-402'!T16,0)","v":0},{"$f":"ROUND('VETS-402'!X16,0)","v":0},{"$f":"ROUND('VETS-402'!Z16,0)","v":0},{"$f":"ROUND('VETS-402'!AB16,0)","v":0},{"$f":"ROUND('VETS-402'!AD16,0)","v":0}]
["Section B","b. Consolidated DVOP/LVER Positions",{"$f":"ROUND('VETS-402'!D17,0)","v":0},{"$f":"ROUND('VETS-402'!F17,0)","v":0},{"$f":"ROUND('VETS-402'!H17,0)","v":0},{"$f":"ROUND('VETS-402'!J17,0)","v":0},{"$f":"ROUND('VETS-402'!N17,0)","v":0},{"$f":"ROUND('VETS-402'!P17,0)","v":0},{"$f":"ROUND('VETS-402'!R17,0)","v":0},{"$f":"ROUND('VETS-402'!T17,0)","v":0},{"$f":"ROUND('VETS-402'!X17,0)","v":0},{"$f":"ROUND('VETS-402'!Z17,0)","v":0},{"$f":"ROUND('VETS-402'!AB17,0)","v":0},{"$f":"ROUND('VETS-402'!AD17,0)","v":0}]
["Section B","c. Local Veterans Employment Representatives",{"$f":"ROUND('VETS-402'!D18,0)","v":0},{"$f":"ROUND('VETS-402'!F18,0)","v":0},{"$f":"ROUND('VETS-402'!H18,0)","v":0},{"$f":"ROUND('VETS-402'!J18,0)","v":0},{"$f":"ROUND('VETS-402'!N18,0)","v":0},{"$f":"ROUND('VETS-402'!P18,0)","v":0},{"$f":"ROUND('VETS-402'!R18,0)","v":0},{"$f":"ROUND('VETS-402'!T18,0)","v":0},{"$f":"ROUND('VETS-402'!X18,0)","v":0},{"$f":"ROUND('VETS-402'!Z18,0)","v":0},{"$f":"ROUND('VETS-402'!AB18,0)","v":0},{"$f":"ROUND('VETS-402'!AD18,0)","v":0}]
["Section B","d. Incentive Awards",{"$f":"ROUND('VETS-402'!D19,0)","v":0},{"$f":"ROUND('VETS-402'!F19,0)","v":0},{"$f":"ROUND('VETS-402'!H19,0)","v":0},{"$f":"ROUND('VETS-402'!J19,0)","v":0},{"$f":"ROUND('VETS-402'!N19,0)","v":0},{"$f":"ROUND('VETS-402'!P19,0)","v":0},{"$f":"ROUND('VETS-402'!R19,0)","v":0},{"$f":"ROUND('VETS-402'!T19,0)","v":0},{"$f":"ROUND('VETS-402'!X19,0)","v":0},{"$f":"ROUND('VETS-402'!Z19,0)","v":0},{"$f":"ROUND('VETS-402'!AB19,0)","v":0},{"$f":"ROUND('VETS-402'!AD19,0)","v":0}]
["Section B","e. Mgmt & Admin Costs",{"$f":"ROUND('VETS-402'!D20,0)","v":0},{"$f":"ROUND('VETS-402'!F20,0)","v":0},{"$f":"ROUND('VETS-402'!H20,0)","v":0},{"$f":"ROUND('VETS-402'!J20,0)","v":0},{"$f":"ROUND('VETS-402'!N20,0)","v":0},{"$f":"ROUND('VETS-402'!P20,0)","v":0},{"$f":"ROUND('VETS-402'!R20,0)","v":0},{"$f":"ROUND('VETS-402'!T20,0)","v":0},{"$f":"ROUND('VETS-402'!X20,0)","v":0},{"$f":"ROUND('VETS-402'!Z20,0)","v":0},{"$f":"ROUND('VETS-402'!AB20,0)","v":0},{"$f":"ROUND('VETS-402'!AD20,0)","v":0}]
{"$rows_left_out":33}
{"sheet":"Output","index":2,"n_rows":62,"n_cols":14,"rows_kept":62,"merged":[[0,1,0,10],[1,0,1,10],[2,0,2,10],[3,0,3,10],[4,0,5,0],[4,4,5,4],[4,5,4,6],[4,8,5,10],[5,5,5,6],[6,0,6,10],[7,0,7,10],[8,0,8,6],[8,7,8,10],[9,0,11,0],[9,1,9,2],[9,4,11,4],[9,5,9,8],[9,10,11,10],[10,1,10,2],[10,5,10,8],[11,1,11,2],[11,5,11,8],[12,0,12,10],[13,0,13,10],[14,0,14,4],[15,0,15,4],[16,10,22,10],[17,0,22,0],[23,0,23,10],[24,0,24,10],[25,0,31,0],[25,10,31,10],[32,0,32,10],[33,0,33,10],[34,0,40,0],[34,10,40,10],[41,0,41,10],[42,0,42,10],[43,0,46,0],[43,10,46,10],[47,0,47,10],[48,0,48,10],[49,0,52,0],[49,10,52,10],[53,0,53,10],[54,0,54,10],[55,0,60,2],[55,3,55,7],[55,8,60,8],[55,10,60,10],[56,3,56,7],[57,3,57,7],[58,3,58,7],[59,3,59,7],[60,3,60,7],[61,0,61,10]]}
["Accessibility key: Unlocked (yellow) cells may be edited.",0]
["Jobs for Veterans State Grants Expenditure Detail Report",{"$nulls":11},{"$f":"CONCATENATE($D$5,$D$6)","v":"45291"}]
["Cumulative / Accrual Basis"]
["          SECTION A - GENERAL INFORMATION"]
[0,null,"1) State:",{"$f":"'VETS-402'!S6","v":""},0,"3) Grant Number:",null,{"$f":"'VETS-402'!I6","v":0},0,{"$nulls":3},"Previous Quarter End",{"$f":"EDATE(D6,-3)","v":"2023-09-30"}]
[null,null,"2) Quarter Ending:","2023-12-31",null,"4) Date Prepared:",null,{"$f":"HLOOKUP(Output!D6,Export!C4:N5,2,FALSE)","v":{"$error":"#N/A"}}]
[0]
["         SECTION B - FUNDING INFORMATION"]
["CUMULATIVE FUNDS APPROVED THROUGH THE END OF THIS REPORTING PERIOD FOR:",{"$nulls":6},0]
[0,"1) DVOP Total Funds:",null,{"$f":"HLOOKUP(D6,Export!C4:N6,3,FALSE)","v":{"$error":"#N/A"}},0,"4) Incentive Award Total Funds:",{"$nulls":3},{"$f":"HLOOKUP(D6,Export!C4:N9,6,FALSE)","v":{"$error":"#N/A"}},0]
{"$rows_left_out":53}
{"sheet":"Pivot","index":3,"n_rows":42,"n_cols":26,"rows_kept":42,"hidden":true}
[null,"Column Labels"]
[null,"",{"$nulls":22}," Total","Grand Total"]
["Values","1st Quarter","2nd Quarter","Y1Q2 Cumulative","3rd Quarter","Y1Q3 Cumulative","4th Quarter","Y1Q4 Cumulative","5th Quarter","Y2Q1 Cumulative","6th Quarter","Y2Q2 Cumulative","7th Quarter","Y2Q3 Cumulative","8th Quarter","Y2Q4 Cumulative","9th Quarter","Y3Q1 Cumulative","10th Quarter","Y3Q2 Cumulative","11th Quarter","Y3Q3 Cumulative","12th Quarter","Y3Q4 Cumulative"]
["Max of Quarter Ending","00:00:00","00:00:00","00:00:00","00:00:00","00:00:00","00:00:00","00:00:00","00:00:00","00:00:00","00:00:00","00:00:00","00:00:00","00:00:00","00:00:00","00:00:00","00:00:00","00:00:00","00:00:00","00:00:00","00:00:00","00:00:00","00:00:00","00:00:00","00:00:00","00:00:00"]
["Max of Grant Number",0,0,0,0,0,0,0,0,0,0,0,0,0,0,0,0,0,0,0,0,0,0,0,0,0]
["Max of Date Prepared ","00:00:00","00:00:00","00:00:00","00:00:00","00:00:00","00:00:00","00:00:00","00:00:00","00:00:00","00:00:00","00:00:00","00:00:00","00:00:00","00:00:00","00:00:00","00:00:00","00:00:00","00:00:00","00:00:00","00:00:00","00:00:00","00:00:00","00:00:00","00:00:00","00:00:00"]
["Sum of Disabled Veterans Outreach Program",0,0,0,0,0,0,0,0,0,0,0,0,0,0,0,0,0,0,0,0,0,0,0,0,0]
["Sum of Consolidated DVOP/LVER Positions",0,0,0,0,0,0,0,0,0,0,0,0,0,0,0,0,0,0,0,0,0,0,0,0,0]
["Sum of Local Veterans Employment Representatives",0,0,0,0,0,0,0,0,0,0,0,0,0,0,0,0,0,0,0,0,0,0,0,0,0]
["Sum of Incentive Awards",0,0,0,0,0,0,0,0,0,0,0,0,0,0,0,0,0,0,0,0,0,0,0,0,0]
{"$rows_left_out":33}
{"sheet":"Data","index":4,"n_rows":24,"n_cols":81,"rows_kept":24,"hidden":true}
["FY/Q","Quarter/Cumulative","Grant Number","State","Quarter Ending","Date Prepared ","Disabled Veterans Outreach Program","Consolidated DVOP/LVER Positions","Local Veterans Employment Representatives","Incentive Awards","Mgmt & Admin Costs","Total Approved Funds","Funded DVOP Positions","DVOP Salaries Paid","DVOP Benefits Paid","Total DVOP Outlays","DVOP Unliquidated Obligations","Total DVOP Outlays & Obligations","Funded Consolidated Positions","Consolidated Salaries Paid","Consolidated Benefits Paid","Total Consolidated Outlays","Consolidated Unliquidated Obligations","Total Consolidated Outlays & Obligations","Funded LVER Positions","LVER Salaries Paid","LVER Benefits Paid","Total LVER Outlays","LVER Unliquidated Obligations","Total LVER Outlays & Obligations","Incentive Award Outlays","Incentive Award Unliquidated Obligations","Total Incentive Outlays & Obligations","Mgmt & Admin Outlays","Mgmt & Admin Unliquidated Obligations","Total Mgmt & Admin Outlays & Obligations","DVOP Balance Remaining","Consolidated Balance Remaining","LVER Balance Remaining","Incentive Balance Remaining","Mgmt & Admin Balance Remaining","Total Balance Remaining",{"$nulls":38},"Code"]
["Y1Q1","1st Quarter",{"$f":"'VETS-402'!$I$6","v":0},{"$f":"'VETS-402'!$S$6","v":""},{"$f":"'VETS-402'!D$10","v":""},{"$f":"'VETS-402'!D$11","v":"00:00:00"},{"$f":"TRANSPOSE('VETS-402'!D16:J21)","v":{"v":0,"d":"$0.00"}},{"v":0,"d":"$0.00"},{"v":0,"d":"$0.00"},{"v":0,"d":"$0.00"},{"v":0,"d":"$0.00"},{"v":0,"d":"$0.00"},{"$f":"TRANSPOSE('VETS-402'!D26:J31)","v":0},{"v":0,"d":"$0.00"},{"v":0,"d":"$0.00"},{"v":0,"d":"$0.00"},{"v":0,"d":"$0.00"},{"v":0,"d":"$0.00"},{"$f":"TRANSPOSE('VETS-402'!D35:J40)","v":0},{"v":0,"d":"$0.00"},{"v":0,"d":"$0.00"},{"v":0,"d":"$0.00"},{"v":0,"d":"$0.00"},{"v":0,"d":"$0.00"},{"$f":"TRANSPOSE('VETS-402'!D44:J49)","v":0},{"v":0,"d":"$0.00"},{"v":0,"d":"$0.00"},{"v":0,"d":"$0.00"},{"v":0,"d":"$0.00"},{"v":0,"d":"$0.00"},{"$f":"TRANSPOSE('VETS-402'!D53:J55)","v":{"v":0,"d":"$0.00"}},{"v":0,"d":"$0.00"},{"v":0,"d":"$0.00"},{"$f":"TRANSPOSE('VETS-402'!D59:J61)","v":{"v":0,"d":"$0.00"}},{"v":0,"d":"$0.00"},{"v":0,"d":"$0.00"},{"$f":"TRANSPOSE('VETS-402'!D66:J71)","v":{"v":0,"d":"$0.00"}},{"v":0,"d":"$0.00"},{"v":0,"d":"$0.00"},{"v":0,"d":"$0.00"},{"v":0,"d":"$0.00"},{"v":0,"d":"$0.00"}]
["Y1Q2","2nd Quarter",{"$f":"'VETS-402'!$I$6","v":0},{"$f":"'VETS-402'!$S$6","v":""},{"$f":"'VETS-402'!F$10","v":""},{"$f":"'VETS-402'!F$11","v":"00:00:00"},{"v":0,"d":"$0.00"},{"v":0,"d":"$0.00"},{"v":0,"d":"$0.00"},{"v":0,"d":"$0.00"},{"v":0,"d":"$0.00"},{"v":0,"d":"$0.00"},"",{"v":0,"d":"$0.00"},{"v":0,"d":"$0.00"},{"v":0,"d":"$0.00"},{"v":0,"d":"$0.00"},{"v":0,"d":"$0.00"},"",{"v":0,"d":"$0.00"},{"v":0,"d":"$0.00"},{"v":0,"d":"$0.00"},{"v":0,"d":"$0.00"},{"v":0,"d":"$0.00"},"",{"v":0,"d":"$0.00"},{"v":0,"d":"$0.00"},{"v":0,"d":"$0.00"},{"v":0,"d":"$0.00"},{"v":0,"d":"$0.00"},{"v":0,"d":"$0.00"},{"v":0,"d":"$0.00"},{"v":0,"d":"$0.00"},{"v":0,"d":"$0.00"},{"v":0,"d":"$0.00"},{"v":0,"d":"$0.00"},"N/A","N/A","N/A","N/A","N/A","N/A"]
["Y1Q2","Y1Q2 Cumulative",{"$f":"'VETS-402'!$I$6","v":0},{"$f":"'VETS-402'!$S$6","v":""},{"$f":"'VETS-402'!F$10","v":""},{"$f":"'VETS-402'!F$11","v":"00:00:00"},{"v":0,"d":"$0.00"},{"v":0,"d":"$0.00"},{"v":0,"d":"$0.00"},{"v":0,"d":"$0.00"},{"v":0,"d":"$0.00"},{"v":0,"d":"$0.00"},0,{"v":0,"d":"$0.00"},{"v":0,"d":"$0.00"},{"v":0,"d":"$0.00"},{"v":0,"d":"$0.00"},{"v":0,"d":"$0.00"},0,{"v":0,"d":"$0.00"},{"v":0,"d":"$0.00"},{"v":0,"d":"$0.00"},{"v":0,"d":"$0.00"},{"v":0,"d":"$0.00"},0,{"v":0,"d":"$0.00"},{"v":0,"d":"$0.00"},{"v":0,"d":"$0.00"},{"v":0,"d":"$0.00"},{"v":0,"d":"$0.00"},{"v":0,"d":"$0.00"},{"v":0,"d":"$0.00"},{"v":0,"d":"$0.00"},{"v":0,"d":"$0.00"},{"v":0,"d":"$0.00"},{"v":0,"d":"$0.00"},{"v":0,"d":"$0.00"},{"v":0,"d":"$0.00"},{"v":0,"d":"$0.00"},{"v":0,"d":"$0.00"},{"v":0,"d":"$0.00"},{"v":0,"d":"$0.00"}]
["Y1Q3","3rd Quarter",{"$f":"'VETS-402'!$I$6","v":0},{"$f":"'VETS-402'!$S$6","v":""},{"$f":"'VETS-402'!H$10","v":""},{"$f":"'VETS-402'!H$11","v":"00:00:00"},{"v":0,"d":"$0.00"},{"v":0,"d":"$0.00"},{"v":0,"d":"$0.00"},{"v":0,"d":"$0.00"},{"v":0,"d":"$0.00"},{"v":0,"d":"$0.00"},"",{"v":0,"d":"$0.00"},{"v":0,"d":"$0.00"},{"v":0,"d":"$0.00"},{"v":0,"d":"$0.00"},{"v":0,"d":"$0.00"},"",{"v":0,"d":"$0.00"},{"v":0,"d":"$0.00"},{"v":0,"d":"$0.00"},{"v":0,"d":"$0.00"},{"v":0,"d":"$0.00"},"",{"v":0,"d":"$0.00"},{"v":0,"d":"$0.00"},{"v":0,"d":"$0.00"},{"v":0,"d":"$0.00"},{"v":0,"d":"$0.00"},{"v":0,"d":"$0.00"},{"v":0,"d":"$0.00"},{"v":0,"d":"$0.00"},{"v":0,"d":"$0.00"},{"v":0,"d":"$0.00"},{"v":0,"d":"$0.00"},"N/A","N/A","N/A","N/A","N/A","N/A"]
["Y1Q3","Y1Q3 Cumulative",{"$f":"'VETS-402'!$I$6","v":0},{"$f":"'VETS-402'!$S$6","v":""},{"$f":"'VETS-402'!H$10","v":""},{"$f":"'VETS-402'!H$11","v":"00:00:00"},{"v":0,"d":"$0.00"},{"v":0,"d":"$0.00"},{"v":0,"d":"$0.00"},{"v":0,"d":"$0.00"},{"v":0,"d":"$0.00"},{"v":0,"d":"$0.00"},0,{"v":0,"d":"$0.00"},{"v":0,"d":"$0.00"},{"v":0,"d":"$0.00"},{"v":0,"d":"$0.00"},{"v":0,"d":"$0.00"},0,{"v":0,"d":"$0.00"},{"v":0,"d":"$0.00"},{"v":0,"d":"$0.00"},{"v":0,"d":"$0.00"},{"v":0,"d":"$0.00"},0,{"v":0,"d":"$0.00"},{"v":0,"d":"$0.00"},{"v":0,"d":"$0.00"},{"v":0,"d":"$0.00"},{"v":0,"d":"$0.00"},{"v":0,"d":"$0.00"},{"v":0,"d":"$0.00"},{"v":0,"d":"$0.00"},{"v":0,"d":"$0.00"},{"v":0,"d":"$0.00"},{"v":0,"d":"$0.00"},{"v":0,"d":"$0.00"},{"v":0,"d":"$0.00"},{"v":0,"d":"$0.00"},{"v":0,"d":"$0.00"},{"v":0,"d":"$0.00"},{"v":0,"d":"$0.00"}]
["Y1Q4","4th Quarter",{"$f":"'VETS-402'!$I$6","v":0},{"$f":"'VETS-402'!$S$6","v":""},{"$f":"'VETS-402'!J$10","v":""},{"$f":"'VETS-402'!J$11","v":"00:00:00"},{"v":0,"d":"$0.00"},{"v":0,"d":"$0.00"},{"v":0,"d":"$0.00"},{"v":0,"d":"$0.00"},{"v":0,"d":"$0.00"},{"v":0,"d":"$0.00"},"",{"v":0,"d":"$0.00"},{"v":0,"d":"$0.00"},{"v":0,"d":"$0.00"},{"v":0,"d":"$0.00"},{"v":0,"d":"$0.00"},"",{"v":0,"d":"$0.00"},{"v":0,"d":"$0.00"},{"v":0,"d":"$0.00"},{"v":0,"d":"$0.00"},{"v":0,"d":"$0.00"},"",{"v":0,"d":"$0.00"},{"v":0,"d":"$0.00"},{"v":0,"d":"$0.00"},{"v":0,"d":"$0.00"},{"v":0,"d":"$0.00"},{"v":0,"d":"$0.00"},{"v":0,"d":"$0.00"},{"v":0,"d":"$0.00"},{"v":0,"d":"$0.00"},{"v":0,"d":"$0.00"},{"v":0,"d":"$0.00"},"N/A","N/A","N/A","N/A","N/A","N/A"]
["Y1Q4","Y1Q4 Cumulative",{"$f":"'VETS-402'!$I$6","v":0},{"$f":"'VETS-402'!$S$6","v":""},{"$f":"'VETS-402'!J$10","v":""},{"$f":"'VETS-402'!J$11","v":"00:00:00"},{"v":0,"d":"$0.00"},{"v":0,"d":"$0.00"},{"v":0,"d":"$0.00"},{"v":0,"d":"$0.00"},{"v":0,"d":"$0.00"},{"v":0,"d":"$0.00"},0,{"v":0,"d":"$0.00"},{"v":0,"d":"$0.00"},{"v":0,"d":"$0.00"},{"v":0,"d":"$0.00"},{"v":0,"d":"$0.00"},0,{"v":0,"d":"$0.00"},{"v":0,"d":"$0.00"},{"v":0,"d":"$0.00"},{"v":0,"d":"$0.00"},{"v":0,"d":"$0.00"},0,{"v":0,"d":"$0.00"},{"v":0,"d":"$0.00"},{"v":0,"d":"$0.00"},{"v":0,"d":"$0.00"},{"v":0,"d":"$0.00"},{"v":0,"d":"$0.00"},{"v":0,"d":"$0.00"},{"v":0,"d":"$0.00"},{"v":0,"d":"$0.00"},{"v":0,"d":"$0.00"},{"v":0,"d":"$0.00"},{"v":0,"d":"$0.00"},{"v":0,"d":"$0.00"},{"v":0,"d":"$0.00"},{"v":0,"d":"$0.00"},{"v":0,"d":"$0.00"},{"v":0,"d":"$0.00"}]
["Y2Q1","5th Quarter",{"$f":"'VETS-402'!$I$6","v":0},{"$f":"'VETS-402'!$S$6","v":""},{"$f":"'VETS-402'!N$10","v":""},{"$f":"'VETS-402'!N$11","v":"00:00:00"},{"$f":"TRANSPOSE('VETS-402'!M16:T21)","v":{"v":0,"d":"$0.00"}},{"v":0,"d":"$0.00"},{"v":0,"d":"$0.00"},{"v":0,"d":"$0.00"},{"v":0,"d":"$0.00"},{"v":0,"d":"$0.00"},{"$f":"TRANSPOSE('VETS-402'!M26:T31)","v":"N/A"},{"v":0,"d":"$0.00"},{"v":0,"d":"$0.00"},{"v":0,"d":"$0.00"},{"v":0,"d":"$0.00"},{"v":0,"d":"$0.00"},{"$f":"TRANSPOSE('VETS-402'!M35:T40)","v":"N/A"},{"v":0,"d":"$0.00"},{"v":0,"d":"$0.00"},{"v":0,"d":"$0.00"},{"v":0,"d":"$0.00"},{"v":0,"d":"$0.00"},{"$f":"TRANSPOSE('VETS-402'!M44:T49)","v":"N/A"},{"v":0,"d":"$0.00"},{"v":0,"d":"$0.00"},{"v":0,"d":"$0.00"},{"v":0,"d":"$0.00"},{"v":0,"d":"$0.00"},{"$f":"TRANSPOSE('VETS-402'!M53:T55)","v":{"v":0,"d":"$0.00"}},{"v":0,"d":"$0.00"},{"v":0,"d":"$0.00"},{"$f":"TRANSPOSE('VETS-402'!M59:T61)","v":{"v":0,"d":"$0.00"}},{"v":0,"d":"$0.00"},{"v":0,"d":"$0.00"},{"$f":"TRANSPOSE('VETS-402'!M66:T71)","v":"N/A"},"N/A","N/A","N/A","N/A","N/A"]
["Y2Q1","Y2Q1 Cumulative",{"$f":"'VETS-402'!$I$6","v":0},{"$f":"'VETS-402'!$S$6","v":""},{"$f":"'VETS-402'!N$10","v":""},{"$f":"'VETS-402'!N$11","v":"00:00:00"},{"v":0,"d":"$0.00"},{"v":0,"d":"$0.00"},{"v":0,"d":"$0.00"},{"v":0,"d":"$0.00"},{"v":0,"d":"$0.00"},{"v":0,"d":"$0.00"},"N/A",{"v":0,"d":"$0.00"},{"v":0,"d":"$0.00"},{"v":0,"d":"$0.00"},{"v":0,"d":"$0.00"},{"v":0,"d":"$0.00"},"N/A",{"v":0,"d":"$0.00"},{"v":0,"d":"$0.00"},{"v":0,"d":"$0.00"},{"v":0,"d":"$0.00"},{"v":0,"d":"$0.00"},"N/A",{"v":0,"d":"$0.00"},{"v":0,"d":"$0.00"},{"v":0,"d":"$0.00"},{"v":0,"d":"$0.00"},{"v":0,"d":"$0.00"},{"v":0,"d":"$0.00"},{"v":0,"d":"$0.00"},{"v":0,"d":"$0.00"},{"v":0,"d":"$0.00"},{"v":0,"d":"$0.00"},{"v":0,"d":"$0.00"},{"v":0,"d":"$0.00"},{"v":0,"d":"$0.00"},{"v":0,"d":"$0.00"},{"v":0,"d":"$0.00"},{"v":0,"d":"$0.00"},{"v":0,"d":"$0.00"}]
{"$rows_left_out":15}
{"sheet":"Lists","index":5,"n_rows":95,"n_cols":30,"rows_kept":95,"hidden":true}
["State Number","State","ST",{"$nulls":8},"Quarter End","FYQ"]
[1,"ALABAMA","AL",{"$nulls":8},"2022-12-31","2020Q1","2019Q4",1,4,"Y1Q1","1st Quarter","1st Quarter","1st Quarter"]
[2,"ALASKA","AK",{"$nulls":8},"2023-03-31","2020Q2","2020Q1",2,1,"Y1Q2","2nd Quarter","Y1Q2 Cumulative","1st Quarter"]
[4,"ARIZONA","AZ",{"$nulls":8},"2023-06-30","2020Q3","2020Q2",3,2,"Y1Q3","3rd Quarter","Y1Q3 Cumulative","Y1Q2 Cumulative"]
[5,"ARKANSAS","AR",{"$nulls":8},"2023-09-30","2020Q4","2020Q3",4,3,"Y1Q4","4th Quarter","Y1Q4 Cumulative","Y1Q3 Cumulative"]
[6,"CALIFORNIA","CA",{"$nulls":8},"2023-12-31","2021Q1","2020Q4",1,4,"Y2Q1","5th Quarter","Y2Q1 Cumulative","Y1Q4 Cumulative"]
[8,"COLORADO","CO",{"$nulls":8},"2024-03-31","2021Q2","2021Q1",2,4,"Y2Q2","6th Quarter","Y2Q2 Cumulative","Y2Q1 Cumulative"]
[9,"CONNECTICUT","CT",{"$nulls":8},"2024-06-30","2021Q3","2021Q2",3,1,"Y2Q3","7th Quarter","Y2Q3 Cumulative","Y2Q2 Cumulative"]
[10,"DELAWARE","DE",{"$nulls":8},"2024-09-30","2021Q4","2021Q3",4,2,"Y2Q4","8th Quarter","Y2Q4 Cumulative","Y2Q3 Cumulative"]
[11,"DISTRICT OF COLUMBIA","DC",{"$nulls":8},"2024-12-31","2022Q1","2021Q4",1,3,"Y3Q1","9th Quarter","Y3Q1 Cumulative","Y2Q4 Cumulative"]
{"$rows_left_out":85}