{"text_format":"3","workbook":"xlsx","n_sheets":6,"sheets":["Instructions","Section 1","Section 2","Section 3","Reference List","Lists"],"not_rendered":{"macros":1},"read":"whole","date_system":"1900"}

{"sheet":"Instructions","index":0,"n_rows":21,"n_cols":3,"rows_kept":21}
[]
[null,null,"OMB Control Number: xxxx-xxxx"]
[null,null,"Expiration Date: xx/xx/xxxx"]
[null,null,"U.S. Environmental Protection Agency "]
[null,null,"Stratospheric Ozone Protection Program"]
[]
[null,null,"Class I Process Agent Annual Report (Sec 82.13)"]
[null,null,"Version 1.0"]
[null,null,"Last Updated: September 2024"]
[]
[null,null,"Instructions"]
[null,null,"Complete and submit a Class I ODS Process Agent Annual Report if your company uses regulated Class I ODS as process agents regularly. Please provide information for only one facility per reporting form. "]
[null,null,"Complete this form by filling in the data fields that are highlighted in blue.  Guidance on how to complete individual data fields are provided in comment bubbles. Use the arrows to navigate between the tabs. Once completed, use the 'prepare submission' button in Section 3 to generate your CSV file.  "]
[null,null,"Copying and Pasting Data: If data are pasted into this reporting form from another spreadsheet, the formatting of specific cells must be consistent with the requirements of the form in order to be "]
[null,null,"accepted into EPA’s ODS Tracking System. Refer to the Reference List to identify the valid naming scheme for specific data fields. Additionally, select \"Paste As Values\" when pasting data into the form."]
[null,null,"Report Submission: This Excel file, the generated CSV file, and all supporting attachments should be submitted to EPA through the Central Data Exchange (CDX). Refer to EPA's website for additional information on form submission:"]
[null,null,"https://www.epa.gov/ods-phaseout/ods-recordkeeping-and-reporting"]
[]
[null,null,"This collection of information is approved by OMB under the Paperwork Reduction Act, 44 U.S.C. 3501 et seq. (OMB Control No. XXXX-XXXX). Responses to this collection of information are mandatory (40 CFR 82.13). An agency may not conduct or sponsor, and a person is not required to respond to, a collection of information unless it displays a currently valid OMB control number. The number and expiration date are displayed in the upper right corner of the form. The public reporting and recordkeeping burden for this collection of information is estimated to be X hours per response. Send comments on the Agency’s need this formation, the accuracy of the provided burden estimates and any suggested methods for minimizing respondent burden including through the use of automated collection techniques to the Director, Regulatory Support Division, U.S. Environmental Protection Agency (2821T), 1200 Pennsylvania Ave., NW, Washington, D.C. 20460.  Include the OMB control number in any correspondence.  Do not send the completed form to this address."]
[]
[null,null,"EPA Form #5900-655"]

{"sheet":"Section 1","index":1,"n_rows":15,"n_cols":4,"rows_kept":15,"merged":[[7,2,7,3],[8,3,8,8],[9,3,9,8],[10,3,10,8],[11,3,11,8],[12,3,12,8],[13,3,13,8],[14,3,14,8]]}
[]
[null,null,"U.S. Environmental Protection Agency"]
[null,null,"Class I Process Agent Annual Report"]
[]
[null,null,"   Date Prepared:",{"$f":"TODAY()","v":"2024-10-25"}]
[]
[null,null,"Section 1: Report Identification Information "]
[null,null,"Complete all fields below for each facility in which the process agent was used.  No fields may be left blank."]
[null,null,"Company Name:"]
[null,null,"Submission Type:"]
[null,null,"Reporting Year:"]
[null,null,"Facility Name: "]
[null,null,"Facility Address:"]
[null,null,"Facility Start Up Date: "]
[null,null,"Plant Start Up Date(s): "]

{"sheet":"Section 2","index":2,"n_rows":20,"n_cols":21,"rows_kept":20,"merged":[[0,19,0,20],[0,21,0,22],[0,23,0,24],[1,10,1,11],[1,19,1,20],[1,21,1,22],[1,23,1,24],[2,10,2,11],[2,19,2,20],[2,21,2,22],[2,23,2,24],[3,10,3,11],[3,19,3,20],[3,21,3,22],[3,23,3,24],[4,10,4,11],[4,19,4,20],[4,21,4,22],[4,23,4,24],[5,10,5,11],[5,19,5,20],[5,21,5,22],[5,23,5,24],[6,10,6,11],[6,19,6,20],[6,21,6,22],[6,23,6,24],[7,10,7,11],[7,19,7,20],[7,21,7,22],[7,23,7,24],[8,10,8,11],[8,19,8,20],[8,21,8,22],[8,23,8,24],[9,3,9,9],[9,10,9,11],[9,19,9,20],[9,21,9,22],[9,23,9,24],[10,3,10,9],[10,10,10,11],[10,19,10,20],[10,21,10,22],[10,23,10,24],[11,21,11,22],[11,23,11,24],[12,21,12,22],[12,23,12,24],[13,21,13,22],[13,23,13,24],[14,21,14,22],[14,23,14,24],[15,10,15,11],[15,19,15,20],[15,21,15,22],[15,23,15,24],[16,21,16,22],[16,23,16,24],[17,21,17,22],[17,23,17,24],[19,21,19,22],[19,23,19,24],[20,3,20,4],[20,7,20,8],[20,9,20,10],[20,19,20,20],[20,21,20,22],[20,23,20,24]]}
[]
[{"$nulls":3},"U.S. Environmental Protection Agency"]
[{"$nulls":3},"Class I Process Agent Annual Report"]
[]
[{"$nulls":3},"Facility Name:",{"$f":"IF('Section 1'!$D$12=0,\"\",'Section 1'!$D$12)","v":""}]
[{"$nulls":3},"Reporting Period:",{"$f":"IF('Section 1'!$D$11=0,\"\",'Section 1'!$D$11)","v":""}]
[]
[{"$nulls":3},"Section 2: Class II Substance Use Information "]
[]
[{"$nulls":3},"Complete all fields below for each process agent use of a Class I controlled substance.  No fields may be left blank."]
[{"$nulls":3},"If copying and pasting data into the table, please refer to the Reference List and the accompanying instructions."]
[{"$nulls":4},"Name","Purpose ","Final Products Manufactured","Obtained ","Amount Used (kg)","Recycled for continued use in same process agent application in the same facility?","If not recycled, substance was ultimately: ","Total Air Emissions (kg)",{"$nulls":7},"Fugitive Air Emissions (kg) ","Stack Point Air Emissions (kg) "]
[{"$nulls":3},"ODS Substance (1)"]
[{"$nulls":3},"ODS Substance (2)"]
[{"$nulls":3},"ODS Substance (3)"]
[]
[{"$nulls":4},"Name","Amount Used","Final Product Manufactured (1)","Amount of Final Product (1) Produced ","Final Product Manufactured (2)","Amount of Final Product (2) Produced ","Name of Byproduct (1)","Amount of Byproduct (1) Produced",{"$nulls":7},"Name of Byproduct (2)","Amount of Byproduct (2) Produced"]
[{"$nulls":3},"ODS Substance (1)"]
[{"$nulls":3},"ODS Substance (2)"]
[{"$nulls":3},"ODS Substance (3)"]

{"sheet":"Section 3","index":3,"n_rows":35,"n_cols":7,"rows_kept":35,"merged":[[8,3,8,4],[8,5,8,6],[9,3,9,6],[10,3,10,6]]}
[]
[{"$nulls":3},"U.S. Environmental Protection Agency"]
[{"$nulls":3},"Class I Process Agent Annual Report"]
[]
[{"$nulls":3},"Facility Name:",{"$f":"IF('Section 1'!$D$12=0,\"\",'Section 1'!$D$12)","v":""}]
[{"$nulls":3},"Reporting Period:",{"$f":"IF('Section 1'!$D$11=0,\"\",'Section 1'!$D$11)","v":""}]
[]
[{"$nulls":3},"Section 3: Substance Use Mitigation"]
[{"$nulls":3},"Complete all fields below for each process agent use of a Class I controlled substance."]
[{"$nulls":3},"Description of technologies used or actions taken to minimized use or emissions of Class I controlled substances, including estimated emissions reductions: "]
[]
[{"$nulls":3},"x",null,null,"x"]
{"$rows_empty":20}
[{"$nulls":3},{"$f":"#REF!","v":{"$error":"#REF!"}}]
[{"$nulls":3},{"$f":"#REF!","v":{"$error":"#REF!"}}]
[{"$nulls":3},{"$f":"#REF!","v":{"$error":"#REF!"}}]

{"sheet":"Reference List","index":4,"n_rows":14,"n_cols":7,"rows_kept":14,"merged":[[5,2,5,6],[6,2,6,6],[8,2,8,6]]}
[]
[null,null,"U.S. Environmental Protection Agency"]
[null,null,"Class I Process Agent Annual Report"]
[null,null,"Reference List"]
[]
[null,null,"Copying and Pasting Data: If data are pasted into this reporting form from another spreadsheet, the formatting of specific cells must be consistent with the requirements of the form in order to be accepted into EPA’s ODS tracking system.  When copying and pasting data into the form, please ensure consistency with the formatting of the list below."]
[null,null,"Chemical Name List: The table below lists the valid chemical names that may be used when entering data into Section 2 and Section 3 of this form. "]
[]
[null,null,"Chemical Name"]
[null,null,"CFC-12","CFC-114","CFC-214","Halon 1211","CH3CCL3"]
[null,null,"CFC-13","CFC-115","CFC-215","Halon 1301","HBFCs"]
[null,null,"CFC-111","CFC-211","CFC-216","Halon 2402"]
[null,null,"CFC-112","CFC-212","CFC-217","CBM"]
[null,null,"CFC-113","CFC-213","Halon 1202","CCL4"]

{"sheet":"Lists","index":5,"n_rows":24,"n_cols":8,"rows_kept":24}
[]
[null,"Chemical Name","Submission Type","Reporting Year","Current Year","ODS obtained by ","ODS recycled? ","ODS disposal "]
[null,"CFC-12","Original Submission",2024,{"$f":"YEAR(TODAY())","v":2024},"obtained as virgin","yes","transformed "]
[null,"CFC-13","Re-Submittal",2025,null,"obtained as used","no","reused or recylced for use in a different process agent application "]
[null,"CFC-111",null,2026,null,"produced by the entity",null,"destroyed by approved destruction technologies "]
[null,"CFC-112",null,2027,null,"purchased from a  US producer"]
[null,"CFC-113",null,2028,null,"imported"]
[null,"CFC-114",null,2029,null,"reclaimed by the entity from a different use"]
[null,"CFC-115",null,2030,null,"reclaimed by another entity "]
[null,"CFC-211",null,2031]
[null,"CFC-212",null,2032]
[null,"CFC-213",null,2033]
[null,"CFC-214",null,2034]
[null,"CFC-215",null,2035]
[null,"CFC-216"]
[null,"CFC-217"]
[null,"Halon 1202"]
[null,"Halon 1211"]
[null,"Halon 1301"]
[null,"Halon 2402"]
[null,"CBM"]
[null,"CCL4"]
[null,"CH3CCL3"]
[null,"HBFCs"]