{"text_format":"3","workbook":"xlsx","n_sheets":6,"sheets":["Instructions","Section 1","Section 2","Section 3","Reference List","Lists"],"not_rendered":{"macros":1,"defined_names":3},"read":"whole","date_system":"1900"}

{"sheet":"Instructions","index":0,"n_rows":21,"n_cols":3,"rows_kept":21}
[]
[null,null,"OMB Control Number: xxxx-xxxx"]
[null,null,"Expiration Date: xx/xx/xxxx"]
[null,null,"U.S. Environmental Protection Agency "]
[null,null,"Stratospheric Ozone Protection Program"]
[]
[null,null,"Class II Process Agent One-Time Report (Sec 82.24)"]
[null,null,"Version 1.0"]
[null,null,"Last Updated: September 2024"]
[]
[null,null,"Instructions"]
[null,null,"Complete and submit a Class II ODS Process Agent One-Time Report if your company uses regulated Class II ODS as process agents. Please provide information for only one facility per reporting form. "]
[null,null,"Complete this form by filling in the data fields that are highlighted in blue.  Guidance on how to complete individual data fields are provided in comment bubbles. Use the arrows to navigate between the tabs. Once completed, use the 'prepare submission' button in Section 3 to generate your CSV file.  "]
[null,null,"Copying and Pasting Data: If data are pasted into this reporting form from another spreadsheet, the formatting of specific cells must be consistent with the requirements of the form in order to be "]
[null,null,"accepted into EPA’s ODS Tracking System. Refer to the Reference List to identify the valid naming scheme for specific data fields. Additionally, select \"Paste As Values\" when pasting data into the form."]
[null,null,"Report Submission: This Excel file, the generated CSV file, and all supporting attachments should be submitted to EPA through the Central Data Exchange (CDX). Refer to EPA's website for additional information on form submission:"]
[null,null,"https://www.epa.gov/ods-phaseout/ods-recordkeeping-and-reporting"]
[]
[null,null,"This collection of information is approved by OMB under the Paperwork Reduction Act, 44 U.S.C. 3501 et seq. (OMB Control No. XXXX-XXXX). Responses to this collection of information are mandatory (40 CFR 82.24). An agency may not conduct or sponsor, and a person is not required to respond to, a collection of information unless it displays a currently valid OMB control number. The number and expiration date are displayed in the upper right corner of the form. The public reporting and recordkeeping burden for this collection of information is estimated to be X hours per response. Send comments on the Agency’s need this formation, the accuracy of the provided burden estimates and any suggested methods for minimizing respondent burden including through the use of automated collection techniques to the Director, Regulatory Support Division, U.S. Environmental Protection Agency (2821T), 1200 Pennsylvania Ave., NW, Washington, D.C. 20460.  Include the OMB control number in any correspondence.  Do not send the completed form to this address."]
[]
[null,null,"EPA Form #5900-658"]

{"sheet":"Section 1","index":1,"n_rows":17,"n_cols":4,"rows_kept":17,"merged":[[7,2,7,3],[8,3,8,8],[9,3,9,8],[10,3,10,8],[11,3,11,8],[12,3,12,8],[13,3,13,8],[14,3,14,8],[15,3,15,8],[16,3,16,8]]}
[]
[null,null,"U.S. Environmental Protection Agency"]
[null,null,"Class II Process Agent One-Time Report"]
[]
[null,null,"   Date Prepared:",{"$f":"TODAY()","v":"2024-10-25"}]
[]
[null,null,"Section 1: Report Identification Information "]
[null,null,"Complete all fields below for each facility in which the process agent was used.  No fields may be left blank."]
[null,null,"Company Name:"]
[null,null,"Submission Type:"]
[null,null,"Reporting Year:"]
[null,null,"Facility Name: "]
[null,null,"Facility Address:"]
[null,null,"Facility Start Up Date: "]
[null,null,"Plants Name(s): "]
[null,null,"Plant Address(es):"]
[null,null,"Plant Start Up Date(s): "]

{"sheet":"Section 2","index":2,"n_rows":21,"n_cols":20,"rows_kept":21,"merged":[[9,3,9,10],[10,3,10,10]]}
[]
[{"$nulls":3},"U.S. Environmental Protection Agency"]
[{"$nulls":3},"Class II Process Agent One-Time Report"]
[]
[{"$nulls":3},"Facility Name:",{"$f":"IF('Section 1'!$D$12=0,\"\",'Section 1'!$D$12)","v":""}]
[{"$nulls":3},"Reporting Period:",{"$f":"IF('Section 1'!$D$11=0,\"\",'Section 1'!$D$11)","v":""}]
[]
[{"$nulls":3},"Section 2: Class II Substance Use Information "]
[]
[{"$nulls":3},"Complete all fields below for each process agent use of a Class II controlled substance.  No fields may be left blank."]
[{"$nulls":3},"If copying and pasting data into the table, please refer to the Reference List and the accompanying instructions."]
[{"$nulls":4},"Name","Purpose","Final Product Manufactured","Amount Used ","Total Air Emissions (kg)","Fugitive Air Emissions (kg) ","Stack Point Air Emissions (kg) "]
[{"$nulls":3},"ODS Substance (1)"]
[{"$nulls":3},"ODS Substance (2)"]
[{"$nulls":3},"ODS Substance (3)"]
[]
[]
[{"$nulls":4},"Name","Amount Used","Final Product Manufactured (1)","Amount of Final Product (1) Produced ","Final Product Manufactured (2)","Amount of Final Product (2) Produced ","Name of Byproduct (1) ","Amount of Byproduct (1) Produced","Name of Byproduct (2) ","Amount of Byproduct (2) Produced",{"$nulls":5},"Name of Byproduct (2) §84.31(g)(1)(iii)"]
[{"$nulls":3},"ODS Substance (1)"]
[{"$nulls":3},"ODS Substance (2)"]
[{"$nulls":3},"ODS Substance (3)"]

{"sheet":"Section 3","index":3,"n_rows":38,"n_cols":7,"rows_kept":38,"merged":[[8,3,8,4],[8,5,8,6],[9,3,9,6],[10,3,10,6],[12,3,12,6],[13,3,13,6]]}
[]
[{"$nulls":3},"U.S. Environmental Protection Agency"]
[{"$nulls":3},"Class II Process Agent One-Time Report"]
[]
[{"$nulls":3},"Facility Name:",{"$f":"IF('Section 1'!$D$12=0,\"\",'Section 1'!$D$12)","v":""}]
[{"$nulls":3},"Reporting Period:",{"$f":"IF('Section 1'!D11=0,\"\",'Section 1'!$D$11)","v":""}]
[]
[{"$nulls":3},"Section 3: Substance Use Mitigation"]
[{"$nulls":3},"Complete all fields below for each process agent use of a Class II controlled substance."]
[{"$nulls":3},"Description of technologies used or actions taken to minimized use or emissions of Class II controlled substances, including estimated emissions reductions: "]
[]
[]
[{"$nulls":3},"Description of Class II substance lifecycle (including percentages used as process agent and (1) retained within the process agent application, (2) consumed in the process agent application, (3) recovered after the process agent application, (4) emitted, and (5) entrained in the final product): "]
[]
[{"$nulls":3},"x",null,null,"x"]
{"$rows_empty":19}
[{"$nulls":3},{"$f":"#REF!","v":{"$error":"#REF!"}}]
[{"$nulls":3},{"$f":"#REF!","v":{"$error":"#REF!"}}]
[{"$nulls":3},{"$f":"#REF!","v":{"$error":"#REF!"}}]
[{"$nulls":3},{"$f":"#REF!","v":{"$error":"#REF!"}}]

{"sheet":"Reference List","index":4,"n_rows":14,"n_cols":11,"rows_kept":14,"merged":[[5,2,5,6],[6,2,6,6],[8,2,8,10]]}
[]
[null,null,"U.S. Environmental Protection Agency"]
[null,null,"Class II Process Agent One Time Report"]
[null,null,"Reference List"]
[]
[null,null,"Copying and Pasting Data: If data are pasted into this reporting form from another spreadsheet, the formatting of specific cells must be consistent with the requirements of the form in order to be accepted into EPA’s ODS tracking system.  When copying and pasting data into the form, please ensure consistency with the formatting of the list below."]
[null,null,"Chemical Name List: The table below lists the valid chemical names that may be used when entering data into Section 2 and Section 3 of this form. "]
[]
[null,null,"Chemical Name"]
[null,null,"HCFC-21","HCFC-123","HCFC-131","HCFC-141b","HCFC-221","HCFC-225cb","HCFC-234","HCFC-244","HCFC-262"]
[null,null,"HCFC-22","HCFC-123a","HCFC-132b","HCFC-142","HCFC-222","HCFC-226","HCFC-235","HCFC-251","HCFC-271"]
[null,null,"HCFC-31","HCFC-123b","HCFC-133a","HCFC-142a","HCFC-223","HCFC-231","HCFC-241","HCFC-252"," "]
[null,null,"HCFC-121","HCFC-124","HCFC-141","HCFC-142b","HCFC-224","HCFC-232","HCFC-242","HCFC-253"," "]
[null,null,"HCFC-122","HCFC-124a","HCFC-141a","HCFC-151","HCFC-225ca","HCFC-233","HCFC-243","HCFC-261"," "]

{"sheet":"Lists","index":5,"n_rows":44,"n_cols":5,"rows_kept":44}
[]
[null,"Chemical Name","Submission Type","Reporting Year","Current Year"]
[null,"HCFC-21","Original Submission",2024,{"$f":"YEAR(TODAY())","v":2024}]
[null,"HCFC-22","Re-Submittal",2025]
[null,"HCFC-31",null,2026]
[null,"HCFC-121",null,2027]
[null,"HCFC-122",null,2028]
[null,"HCFC-123",null,2029]
[null,"HCFC-123a",null,2030]
[null,"HCFC-123b",null,2031]
[null,"HCFC-124",null,2032]
[null,"HCFC-124a",null,2033]
[null,"HCFC-131",null,2034]
[null,"HCFC-132b",null,2035]
[null,"HCFC-133a"]
[null,"HCFC-141"]
[null,"HCFC-141a"]
[null,"HCFC-141b"]
[null,"HCFC-142"]
[null,"HCFC-142a"]
[null,"HCFC-142b"]
[null,"HCFC-151"]
[null,"HCFC-221"]
[null,"HCFC-222"]
[null,"HCFC-223"]
[null,"HCFC-224"]
[null,"HCFC-225ca"]
[null,"HCFC-225cb"]
[null,"HCFC-226"]
[null,"HCFC-231"]
[null,"HCFC-232"]
[null,"HCFC-233"]
[null,"HCFC-234"]
[null,"HCFC-235"]
[null,"HCFC-241"]
[null,"HCFC-242"]
[null,"HCFC-243"]
[null,"HCFC-244"]
[null,"HCFC-251"]
[null,"HCFC-252"]
[null,"HCFC-253"]
[null,"HCFC-261"]
[null,"HCFC-262"]
[null,"HCFC-271"]