{"text_format":"3","workbook":"xlsx","n_sheets":6,"sheets":["Instructions","Section 1","Section 2","Section 3","Reference List","Lists"],"not_rendered":{"macros":1},"read":"whole","date_system":"1900"}

{"sheet":"Instructions","index":0,"n_rows":21,"n_cols":3,"rows_kept":21}
[]
[null,null,"OMB Control Number: xxxx-xxxx"]
[null,null,"Expiration Date: xx/xx/xxxx"]
[null,null,"U.S. Environmental Protection Agency "]
[null,null,"Stratospheric Ozone Protection Program"]
[]
[null,null,"ODS One-Time Emissions Report (Sec 82.25)"]
[null,null,"Version 1.0"]
[null,null,"Last Updated: September 2024"]
[]
[null,null,"Instructions"]
[null,null,"Complete and submit an ODS One-Time Emissions Report if your company performs an activity listed under 40 CFR 82.25(a) and destroys regulated ODS. Please provide information for only one facility per reporting form. "]
[null,null,"Complete this form by filling in the data fields that are highlighted in blue.  Guidance on how to complete individual data fields are provided in comment bubbles. Use the arrows to navigate between the tabs. Once completed, use the 'prepare submission' button in Section 3 to generate your CSV file.  "]
[null,null,"Copying and Pasting Data: If data are pasted into this reporting form from another spreadsheet, the formatting of specific cells must be consistent with the requirements of the form in order to be "]
[null,null,"accepted into EPA’s ODS Tracking System. Refer to the Reference List to identify the valid naming scheme for specific data fields. Additionally, select \"Paste As Values\" when pasting data into the form."]
[null,null,"Report Submission: This Excel file, the generated CSV file, and all supporting attachments should be submitted to EPA through the Central Data Exchange (CDX). Refer to EPA's website for additional information on form submission:"]
[null,null,"https://www.epa.gov/ods-phaseout/ods-recordkeeping-and-reporting"]
[]
[null,null,"This collection of information is approved by OMB under the Paperwork Reduction Act, 44 U.S.C. 3501 et seq. (OMB Control No. XXXX-XXXX). Responses to this collection of information are mandatory (40 CFR 82.25). An agency may not conduct or sponsor, and a person is not required to respond to, a collection of information unless it displays a currently valid OMB control number. The number and expiration date are displayed in the upper right corner of the form. The public reporting and recordkeeping burden for this collection of information is estimated to be X hours per response. Send comments on the Agency’s need this formation, the accuracy of the provided burden estimates and any suggested methods for minimizing respondent burden including through the use of automated collection techniques to the Director, Regulatory Support Division, U.S. Environmental Protection Agency (2821T), 1200 Pennsylvania Ave., NW, Washington, D.C. 20460.  Include the OMB control number in any correspondence.  Do not send the completed form to this address."]
[]
[null,null,"EPA Form #xxxx-xxx"]

{"sheet":"Section 1","index":1,"n_rows":13,"n_cols":4,"rows_kept":13,"merged":[[7,2,7,8],[8,3,8,8],[9,3,9,8],[10,3,10,8],[11,3,11,8],[12,3,12,8]]}
[]
[null,null,"U.S. Environmental Protection Agency"]
[null,null,"ODS One-Time Emissions Report"]
[]
[null,null,"   Date Prepared:",{"$f":"TODAY()","v":"2024-10-22"}]
[]
[null,null,"Section 1: Report Identification Information "]
[null,null,"Complete all fields below for each facility in which the process agent was used.  No fields may be left blank."]
[null,null,"Company Name:"]
[null,null,"Submission Type:"]
[null,null,"Reporting Year:"]
[null,null,"Facility Name: "]
[null,null,"Facility Address:"]

{"sheet":"Section 2","index":2,"n_rows":25,"n_cols":8,"rows_kept":25,"merged":[[0,8,0,9],[0,10,0,11],[1,8,1,9],[1,10,1,11],[2,8,2,9],[2,10,2,11],[3,8,3,9],[3,10,3,11],[4,8,4,9],[4,10,4,11],[5,8,5,9],[5,10,5,11],[6,8,6,9],[6,10,6,11],[7,8,7,9],[7,10,7,11],[8,8,8,9],[8,10,8,11],[9,3,9,6],[9,8,9,9],[9,10,9,11],[10,3,10,7],[10,8,10,9],[10,10,10,11],[11,3,13,3],[11,4,13,4],[11,5,13,5],[11,6,13,6],[11,7,13,7],[11,8,11,9],[11,10,11,11],[14,8,14,9],[14,10,14,11],[15,8,15,9],[15,10,15,11],[16,8,16,9],[16,10,16,11],[17,8,17,9],[17,10,17,11],[18,3,19,6],[18,8,18,9],[18,10,18,11],[20,3,22,6],[20,8,20,9],[20,10,20,11],[22,8,22,9],[22,10,22,11],[24,3,24,6],[25,3,27,6],[28,3,28,5],[28,8,28,9],[28,10,28,11]]}
[]
[{"$nulls":3},"U.S. Environmental Protection Agency"]
[{"$nulls":3},{"$f":"'Section 1'!C3","v":"ODS One-Time Emissions Report"}]
[]
[{"$nulls":3},"Facility Name:",null,{"$f":"IF('Section 1'!$D$12=0,\"\",'Section 1'!$D$12)","v":""}]
[{"$nulls":3},"Reporting Period:",null,{"$f":"IF('Section 1'!$D$11=0,\"\",'Section 1'!$D$11)","v":""}]
[]
[{"$nulls":3},"Section 2: Destruction Unit Testing"]
[]
[{"$nulls":3},"Complete all fields below for each destruction unit. No fields may be left blank."]
[{"$nulls":3},"If copying and pasting data into the table, please refer to the Reference List and the accompanying instructions."]
[{"$nulls":4},"Controlled Substance (1) Used in Destruction Efficiency Performance Test\n82.25(e)(4)(i)","Controlled Substance (2) Used in Destruction Efficiency Performance Test\n82.25(e)(4)(i)","Surrogate Used in Destruction Efficiency Performance Test, if applicable\n82.25(e)(4)(i)","Date of Most Recent Destruction Unit Test\n82.25(e)(4)(ii)"]
[]
[]
[{"$nulls":3},"Destruction Unit (1)"]
[{"$nulls":3},"Destruction Unit (2)"]
[{"$nulls":3},"Destruction Unit (3)"]
[]
[{"$nulls":3},"If surrogates were used in the performance test conducted to determine destruction efficiency, provide information on why the surrogate is sufficient to demonstrate the destruction efficiency for each controlled substance, consistent with requirements in 82.25(d)(6)(i). 82.25(e)(4)(i)"]
[]
[]
[]
[]
[]
[{"$nulls":3},"Provide the names of all applicable Federal or State regulations that may apply to the destruction process. 82.25(e)(4)(iii)"]

{"sheet":"Section 3","index":3,"n_rows":18,"n_cols":7,"rows_kept":18,"merged":[[0,13,0,14],[0,15,0,16],[1,13,1,14],[1,15,1,16],[2,13,2,14],[2,15,2,16],[3,13,3,14],[3,15,3,16],[4,13,4,14],[4,15,4,16],[5,13,5,14],[5,15,5,16],[6,13,6,14],[6,15,6,16],[7,13,7,14],[7,15,7,16],[8,13,8,14],[8,15,8,16],[9,3,10,12],[9,13,9,14],[9,15,9,16],[11,3,11,11],[11,13,11,14],[11,15,11,16],[12,3,14,3],[12,4,14,4],[12,5,14,5],[12,6,14,12],[12,13,12,14],[12,15,12,16],[15,6,15,12],[15,13,15,14],[15,15,15,16],[16,6,16,12],[16,13,16,14],[16,15,16,16],[17,6,17,12],[17,13,17,14],[17,15,17,16],[18,3,18,5],[18,8,18,11],[18,13,18,14],[18,15,18,16]]}
[]
[{"$nulls":3},"U.S. Environmental Protection Agency"]
[{"$nulls":3},{"$f":"'Section 1'!C3","v":"ODS One-Time Emissions Report"}]
[]
[{"$nulls":3},"Facility Name:",null,{"$f":"IF('Section 1'!$D$12=0,\"\",'Section 1'!$D$12)","v":""}]
[{"$nulls":3},"Reporting Period:",null,{"$f":"IF('Section 1'!$D$11=0,\"\",'Section 1'!$D$11)","v":""}]
[]
[{"$nulls":3},"Section 3: Products of Incomplete Combustion of Controlled Substances"]
[]
[{"$nulls":3},"Complete all fields below for each controlled substance product of incomplete combustion (PIC). No fields may be left blank. As part of your submission, please also provide the methods and results of any measurement or modeling studies, including the PICs for which the exhaust stream was analyzed, as well as copies of relevant scientific papers, if available, or citations of the papers, if they are not."]
[]
[{"$nulls":3},"If copying and pasting data into the table, please refer to the Reference List and the accompanying instructions."]
[{"$nulls":4},"Controlled Substance Destroyed","Controlled Substance PIC","Describe any measurements, research, or analysis performed or obtained that relate to the formation of products of incomplete combustion that are controlled substances during the destruction of controlled substances.\n82.25(e)(6)"]
[]
[]
[{"$nulls":3},"PIC (1)"]
[{"$nulls":3},"PIC (2)"]
[{"$nulls":3},"PIC (3)"]

{"sheet":"Reference List","index":4,"n_rows":25,"n_cols":7,"rows_kept":25,"merged":[[5,2,5,6],[6,2,6,6],[8,2,8,6],[9,2,9,6],[15,2,15,6]]}
[]
[null,null,"U.S. Environmental Protection Agency"]
[null,null,{"$f":"'Section 1'!C3","v":"ODS One-Time Emissions Report"}]
[null,null,"Reference List"]
[]
[null,null,"Copying and Pasting Data: If data are pasted into this reporting form from another spreadsheet, the formatting of specific cells must be consistent with the requirements of the form in order to be accepted into EPA’s ODS tracking system.  When copying and pasting data into the form, please ensure consistency with the formatting of the list below."]
[null,null,"Chemical Name List: The table below lists the valid chemical names that may be used when entering data into Section 2, Section 3, and Section 4 of this form. "]
[]
[null,null,"Chemical Name"]
[null,null,"Class I ODS"]
[null,null,"CFC-12","CFC-114","CFC-214","Halon 1211","CH3CCL3"]
[null,null,"CFC-13","CFC-115","CFC-215","Halon 1301","HBFCs"]
[null,null,"CFC-111","CFC-211","CFC-216","Halon 2402"]
[null,null,"CFC-112","CFC-212","CFC-217","CBM"]
[null,null,"CFC-113","CFC-213","Halon 1202","CCL4"]
[null,null,"Class II ODS"]
[null,null,"HCFC-21","HCFC-124a","HCFC-142b","HCFC-231","HCFC-251"]
[null,null,"HCFC-22","HCFC-131","HCFC-151","HCFC-232","HCFC-252"]
[null,null,"HCFC-31","HCFC-132b","HCFC-221","HCFC-233","HCFC-253"]
[null,null,"HCFC-121","HCFC-133a","HCFC-222","HCFC-234","HCFC-261"]
[null,null,"HCFC-122","HCFC-141","HCFC-223","HCFC-235","HCFC-262"]
[null,null,"HCFC-123","HCFC-141a","HCFC-224","HCFC-241","HCFC-271"]
[null,null,"HCFC-123a","HCFC-141b","HCFC-225ca","HCFC-242"]
[null,null,"HCFC-123b","HCFC-142","HCFC-225cb","HCFC-243"]
[null,null,"HCFC-124","HCFC-142a","HCFC-226","HCFC-244"]

{"sheet":"Lists","index":5,"n_rows":66,"n_cols":5,"rows_kept":66}
[]
[null,"Chemical Name","Submission Type","Reporting Year","Current Year"]
[null,"CFC-12","Original Submission",2024,{"$f":"YEAR(TODAY())","v":2024}]
[null,"CFC-13","Re-Submittal",2025]
[null,"CFC-111",null,2026]
[null,"CFC-112",null,2027]
[null,"CFC-113",null,2028]
[null,"CFC-114",null,2029]
[null,"CFC-115",null,2030]
[null,"CFC-211",null,2031]
[null,"CFC-212",null,2032]
[null,"CFC-213",null,2033]
[null,"CFC-214",null,2034]
[null,"CFC-215",null,2035]
[null,"CFC-216"]
[null,"CFC-217"]
[null,"Halon 1202"]
[null,"Halon 1211"]
[null,"Halon 1301"]
[null,"Halon 2402"]
[null,"CBM"]
[null,"CCL4"]
[null,"CH3CCL3"]
[null,"HBFCs"]
[null,"HCFC-21"]
[null,"HCFC-22"]
[null,"HCFC-31"]
[null,"HCFC-121"]
[null,"HCFC-122"]
[null,"HCFC-123"]
[null,"HCFC-123a"]
[null,"HCFC-123b"]
[null,"HCFC-124"]
[null,"HCFC-124a"]
[null,"HCFC-131"]
[null,"HCFC-132b"]
[null,"HCFC-133a"]
[null,"HCFC-141"]
[null,"HCFC-141a"]
[null,"HCFC-141b"]
[null,"HCFC-142"]
[null,"HCFC-142a"]
[null,"HCFC-142b"]
[null,"HCFC-151"]
[null,"HCFC-221"]
[null,"HCFC-222"]
[null,"HCFC-223"]
[null,"HCFC-224"]
[null,"HCFC-225ca"]
[null,"HCFC-225cb"]
[null,"HCFC-226"]
[null,"HCFC-231"]
[null,"HCFC-232"]
[null,"HCFC-233"]
[null,"HCFC-234"]
[null,"HCFC-235"]
[null,"HCFC-241"]
[null,"HCFC-242"]
[null,"HCFC-243"]
[null,"HCFC-244"]
[null,"HCFC-251"]
[null,"HCFC-252"]
[null,"HCFC-253"]
[null,"HCFC-261"]
[null,"HCFC-262"]
[null,"HCFC-271"]