{"text_format":"3","workbook":"xlsx","n_sheets":18,"sheets":["Instructions","Enter Data Msg","Edit Narrative","Select STRs","Select NPIs","Status Form Print","Status Form","CNPIs Employment","CNPIs Education","CNPIs Infrastructure Asset","CNPIs Housing","CNPIs Health and Social","CNPIs G2 Civic Engagement","CNPIs G3 Civic Engagement","CNPIs List","Strategies List","XML Export Map","Lookups"],"not_rendered":{"images":1,"macros":1,"defined_names":884},"read":"whole","date_system":"1900"}

{"sheet":"Instructions","index":0,"n_rows":17,"n_cols":3,"rows_kept":17,"merged":[[4,1,4,3],[6,1,6,3],[8,1,8,3],[10,1,10,3],[11,1,11,3],[12,1,12,3],[14,1,14,3],[16,1,16,3]]}
[]
[null,null,"Instructional Notes"]
[null,null,"Module 3 - Community Level"]
[]
[null,"Module 3, Section A: Community Initiative Status Form"]
[]
[null,"Section A: Community Initiatve Status Form is where CSBG Eligible Entities identify initiatives intended to achieve community level outcomes. This form provides a central place to report valuable information about a single community initiative that started, continued, or ended during the current reporting period. The information reported on the status form will be selected via a dropdown menu or written as a narrative."]
[]
[null,"Module 3, Section B: Community National Performance Indicators (NPIs) - Data Entry Form"]
[]
{"$rows_left_out":8}
{"sheet":"Enter Data Msg","index":1,"n_rows":0,"n_cols":0,"rows_kept":0,"hidden":true}

{"sheet":"Edit Narrative","index":2,"n_rows":6,"n_cols":25,"rows_kept":6,"hidden":true,"merged":[[1,1,1,16],[2,1,59,19]]}
[null,{"$f":"Y4","v":"13. Impact of Outcomes"}]
[null,{"$f":"Y5","v":"Impact of Outcomes provides background, detail, and/or context to the numbers being reporting under Outcomes/Indicators that are reported in Item A.14. "}]
[null,"Provide a narrative on the outcomes’ scope of impact if interim or final outcomes are reported.",{"$nulls":20},"EditText_WsName","Status Form"]
[{"$nulls":22},"EditText_FieldName","M3A13Impact",{"$f":"_xlfn.XLOOKUP(EditText_FieldName,'Status Form'!Z:Z,'Status Form'!B:B,\"Edit Text\")","v":"13. Impact of Outcomes"}]
[{"$nulls":22},"EditText_Status","Cancel",{"$f":"_xlfn.XLOOKUP(EditText_FieldName,'Status Form'!Z:Z,'Status Form'!AC:AC,\"\")","v":"Impact of Outcomes provides background, detail, and/or context to the numbers being reporting under Outcomes/Indicators that are reported in Item A.14. "}]
[{"$nulls":22},"EditText_MaxLength",5000]

{"sheet":"Select STRs","index":3,"n_rows":135,"n_cols":35,"rows_kept":135,"hidden":true,"merged":[[16,3,16,18],[32,3,32,18],[55,3,55,18],[69,3,69,18],[87,3,87,18],[102,3,102,18],[113,3,113,18],[123,3,123,18],[133,3,133,18]]}
[null,"Module 3, Section C: Community Strategies List",{"$nulls":23},"hideShow","Domain","checkBoxValues","Orig Val","Is Other Text",null,null,"cmdTable","cmdSetting","cmdDisabled"]
[{"$nulls":25},true,{"$nulls":6},"EMP","Off",{"$f":"NOT(cbEMP)","v":true}]
[{"$nulls":25},true,{"$nulls":6},"EDU","Off",{"$f":"NOT(cbEDU)","v":true}]
[{"$nulls":25},true,{"$nulls":6},"INF","Off",{"$f":"NOT(cbINF)","v":true}]
[{"$nulls":25},true,{"$nulls":6},"HOU","Off",{"$f":"NOT(cbHOU)","v":true}]
[null,"Employment Strategies (STR 1)",{"$nulls":23},{"$f":"AND(_xlfn.XLOOKUP(AA6,cmdTable,cmdSetting,\"Off\")=\"On\",NOT(_xlfn.XLOOKUP(AA6,cmdTable,cmdDisabled,FALSE)))","v":false},"EMP",{"$nulls":5},"HLTH","Off",{"$f":"NOT(cbHLTH)","v":true}]
[{"$nulls":25},{"$f":"AND(_xlfn.XLOOKUP(AA7,cmdTable,cmdSetting,\"Off\")=\"On\",NOT(_xlfn.XLOOKUP(AA7,cmdTable,cmdDisabled,FALSE)))","v":false},"EMP",{"$nulls":5},"CIVG","Off",{"$f":"NOT(cbCIVG)","v":true}]
[null,null,"STR 1a Minimum/Living Wage Campaign ",{"$nulls":22},{"$f":"AND(_xlfn.XLOOKUP(AA8,cmdTable,cmdSetting,\"Off\")=\"On\",NOT(_xlfn.XLOOKUP(AA8,cmdTable,cmdDisabled,FALSE)))","v":false},"EMP","M3A111aMinWage",false,false,null,null,"COM","On",false]
[null,null,"STR 1b Job Creation/Employment Generation ",{"$nulls":22},{"$f":"AND(_xlfn.XLOOKUP(AA9,cmdTable,cmdSetting,\"Off\")=\"On\",NOT(_xlfn.XLOOKUP(AA9,cmdTable,cmdDisabled,FALSE)))","v":false},"EMP","M3A111bJobCreation",false,false,null,null,"EM","On",false]
[null,null,"STR 1c Job Fairs",{"$nulls":22},false,"EMP","M3A111cJobFairs",false,false]
{"$rows_left_out":126}
{"sheet":"Select NPIs","index":4,"n_rows":120,"n_cols":35,"rows_kept":120,"hidden":true,"merged":[[105,2,105,20]]}
[null,"Module 3, Section B: Community National Performance Indicators (CNPIs) - Data Entry Form",{"$nulls":23},"hideShow","Domain","checkBoxValues","Orig Val",{"$nulls":3},"cmdTable","cmdSetting","cmdDisabled"]
[{"$nulls":25},true,{"$nulls":6},"EMP","Off",{"$f":"NOT(cbEMP)","v":true}]
[{"$nulls":25},true,{"$nulls":6},"EDU","Off",{"$f":"NOT(cbEDU)","v":true}]
[{"$nulls":25},true,{"$nulls":6},"INF","Off",{"$f":"NOT(cbINF)","v":true}]
[{"$nulls":25},true,{"$nulls":6},"HOU","Off",{"$f":"NOT(cbHOU)","v":true}]
[null,"Employment",{"$nulls":23},{"$f":"AND(_xlfn.XLOOKUP(AA6,cmdTable,cmdSetting,\"Off\")=\"On\",NOT(_xlfn.XLOOKUP(AA6,cmdTable,cmdDisabled,FALSE)))","v":false},"EMP",{"$nulls":5},"HLTH","Off",{"$f":"NOT(cbHLTH)","v":true}]
[{"$nulls":25},false,"EMP",{"$nulls":5},"CIVG","Off",{"$f":"NOT(cbCIVG)","v":true}]
[null,null,"CNPI 1a Number of jobs created to increase opportunities for people with low incomes in the identified community. ",{"$nulls":22},false,"EMP","M3A61aJobIncrOpp",true]
[null,null,"CNPI 1b Number of job opportunities maintained in the identified community.            ",{"$nulls":22},false,"EMP","M3A61bJobOppMain",true]
[null,null,"CNPI 1c Number of “living wage” jobs created in the identified community.",{"$nulls":22},false,"EMP","M3A61cLivWageCreate",false]
{"$rows_left_out":111}
{"sheet":"Status Form Print","index":5,"n_rows":37,"n_cols":10,"rows_kept":37,"hidden":true,"merged":[[0,1,0,4],[2,2,2,4],[5,2,5,4],[6,2,6,4],[7,2,7,4],[8,2,8,4],[9,2,9,4],[10,2,10,4],[11,2,11,4],[12,2,12,4],[13,2,13,4],[14,2,14,4],[15,2,15,4],[16,2,16,4],[17,2,17,4],[18,2,18,4],[19,3,19,4],[20,2,20,4],[21,2,21,4],[22,2,22,4],[23,2,23,4],[24,2,24,4],[25,2,25,4],[26,2,26,4],[27,2,27,4],[28,2,28,4],[29,2,29,4],[30,2,30,4],[31,2,31,4],[32,2,32,4],[33,2,33,4],[34,2,34,4],[35,2,35,4],[36,2,36,4]]}
[null,"Module 3, Section A: Community Initiative Status Form",{"$nulls":6},"Min Height","Hide if Empty"]
[{"$nulls":8},6,true]
[null,"Name of CSBG Eligible Entity: ",{"$f":"M3AgencyName","v":"Alabama Council on Human Relations, Inc."},{"$nulls":5},31.5]
[null,"State:",{"$f":"M3StateName","v":"Alabama"},"UEI:",{"$f":"M3UEI","v":"183860386"},{"$nulls":3},18]
[{"$nulls":8},6,true]
[null,"Reporting Status:",{"$f":"M3ReportingStatus","v":"Select the Reporting Status"},{"$nulls":3},{"$f":"C6","v":"Select the Reporting Status"},null,31.5]
[null,"1. Initiative Name",{"$f":"M3A1InitiativeName","v":"Enter initiative name."},{"$nulls":3},{"$f":"C7","v":"Enter initiative name."},null,31.5]
[null,"2. Initiative Year\n",{"$f":"M3A2InitiativeYear","v":"Select the Initiative Year"},{"$nulls":5},31.5]
[null,"3. Problem Identification\n",{"$f":"M3A3ProblemID","v":0},{"$nulls":3},{"$f":"C9","v":0},null,31.5]
[null,"4. Goal/Agenda ",{"$f":"M3A4Goal","v":"Provide a narrative of the initiative’s overall goal."},{"$nulls":3},"Provide a narrative of the initiative’s overall goal.",null,31.5]
{"$rows_left_out":28}
{"sheet":"Status Form","index":6,"n_rows":26,"n_cols":29,"rows_kept":26,"merged":[[0,1,0,4],[2,2,2,4],[2,6,3,16],[6,8,7,16],[7,2,7,4],[8,2,8,4],[8,6,25,19],[9,2,9,4],[10,2,10,4],[11,2,11,4],[12,2,12,4],[13,2,13,4],[14,2,14,4],[15,2,15,4],[16,3,16,4],[17,2,17,4],[18,2,18,4],[19,2,19,4],[20,2,20,4],[21,2,21,4],[22,2,22,4],[23,2,23,4],[24,2,24,4],[25,2,25,4]]}
[null,"Module 3, Section A: Community Initiative Status Form"]
[{"$nulls":19},"M3A13Impact"]
[null,"Name of CSBG Eligible Entity: ","Alabama Council on Human Relations, Inc.",{"$nulls":3},"To enter data into text fields on the left-hand side of the screen  (Items 3, 4, 10, 13, and 16), select the field (e.g. cell C8) and then click the \"Edit\" button, below. A text box will pop-up. Enter your narrative data into the pop-up."]
[null,"State:","Alabama","UEI:","183860386"]
[]
[]
[{"$nulls":8},"13. Impact of Outcomes"]
[null,"Reporting Status:","Select the Reporting Status",{"$nulls":22},"fieldNameCol"]
[null,null,"Use the dropdown menu to select the response where appropriate.",{"$nulls":3},"Provide a narrative on the outcomes’ scope of impact if interim or final outcomes are reported.",{"$nulls":18},{"$f":"COLUMN(Z8)","v":26},"Type","Max length (memos)","Displayed Hint"]
[null,"1. Initiative Name","Enter initiative name.",{"$nulls":22},"M3A1InitiativeName",{"$f":"_xlfn.XLOOKUP(Z10,'XML Export Map'!B:B,'XML Export Map'!E:E,\"\")","v":"Memo"},{"$f":"_xlfn.XLOOKUP(Z10,'XML Export Map'!B:B,'XML Export Map'!G:G,\"\")","v":500}," Initiative Name should be unique and concise."]
{"$rows_left_out":17}
{"sheet":"CNPIs Employment","index":7,"n_rows":31,"n_cols":12,"rows_kept":31,"hidden":true,"merged":[[1,1,1,11],[2,1,2,11],[3,1,3,11],[4,1,4,3],[4,4,4,9],[5,1,5,3],[5,4,5,7],[7,1,12,1],[7,2,7,7],[8,2,8,7],[9,2,9,7],[10,2,10,7],[11,2,11,7],[12,2,12,7],[13,1,13,11],[15,1,18,1],[15,2,15,7],[16,2,16,7],[17,2,17,7],[18,2,18,7],[20,1,23,1],[20,2,20,4],[21,2,21,4],[22,2,22,4],[23,2,23,4],[25,1,28,1],[25,2,25,4],[26,2,26,4],[27,2,27,4],[28,2,28,4],[31,1,31,11]]}
[]
[null,"Module 3, Section B: Community National Performance Indicators (CNPIs) - Data Entry Form"]
[null,"Goal 2: Communities where people with low incomes live are healthy and offer economic opportunity."]
[null,"Employment Indicators"]
[null,"Name of CSBG Eligible Entity: ",null,null,{"$f":"IF(M3AgencyName=\"\",\"\",M3AgencyName)","v":"Alabama Council on Human Relations, Inc."}]
[null,"State:",null,null,{"$f":"IF(M3StateName=\"\",\"\",M3StateName)","v":"Alabama"},{"$nulls":3},"UEI:",{"$f":"IF(M3UEI=\"\",\"\",M3UEI)","v":"183860386"}]
[]
[null,"Counts\n of Change","Counts of Change for Employment Indicators (CNPI 1)",{"$nulls":5},"I.)  Identified Community\n(auto-populated)","II.)  Target \n(#)","III.)  Actual Results\n(#)","IV.) Performance target accuracy \n(% auto calculated)"]
[null,null,"CNPI 1a Number of jobs created to increase opportunities for people with low incomes in the identified community. ",{"$nulls":8},{"$f":"IFERROR(ROUND(K9/J9,2),\"\")","v":""}]
[null,null,"CNPI 1b Number of job opportunities maintained in the identified community.            ",{"$nulls":8},{"$f":"IFERROR(ROUND(K10/J10,2),\"\")","v":""}]
{"$rows_left_out":22}
{"sheet":"CNPIs Education","index":8,"n_rows":36,"n_cols":12,"rows_kept":36,"hidden":true,"merged":[[1,1,1,11],[2,1,2,11],[3,1,3,11],[4,1,4,3],[4,4,4,9],[5,1,5,3],[5,4,5,7],[7,1,13,1],[7,2,7,7],[8,2,8,7],[9,2,9,7],[10,2,10,7],[11,2,11,7],[12,2,12,7],[13,2,13,7],[15,1,18,1],[15,2,15,7],[16,2,16,7],[17,2,17,7],[18,2,18,7],[20,1,29,1],[20,2,20,4],[21,2,21,4],[22,2,22,4],[23,2,23,4],[24,2,24,4],[25,2,25,4],[26,2,26,4],[27,2,27,4],[28,2,28,4],[29,2,29,4],[31,1,34,1],[31,2,31,4],[32,2,32,4],[33,2,33,4],[34,2,34,4],[36,1,36,11]]}
[]
[null,"Module 3, Section B: Community National Performance Indicators (CNPIs) - Data Entry Form"]
[null,"Goal 2: Communities where people with low incomes live are healthy and offer economic opportunity."]
[null,"Education and Cognitive Development Indicators"]
[null,"Name of CSBG Eligible Entity: ",null,null,{"$f":"IF(M3AgencyName=\"\",\"\",M3AgencyName)","v":"Alabama Council on Human Relations, Inc."}]
[null,"State:",null,null,{"$f":"IF(M3StateName=\"\",\"\",M3StateName)","v":"Alabama"},{"$nulls":3},"UEI:",{"$f":"IF(M3UEI=\"\",\"\",M3UEI)","v":"183860386"}]
[]
[null,"Counts\n of Change","Counts of Change for Education and Cognitive Development Indicators (CNPI 2)",{"$nulls":5},"I.)  Identified Community\n(auto-populated)","II.)  Target \n(#)","III.)  Actual Results\n(#)","IV.) Performance target accuracy \n(% auto calculated)"]
[null,null,"CNPI 2a Number of accessible and affordable early childhood or pre-school education assets or resources added to the identified community. ",{"$nulls":8},{"$f":"IFERROR(ROUND(K9/J9,2),\"\")","v":""}]
[null,null,"CNPI 2b Number of accredited or licensed affordable child care facilities added in the identified community. ",{"$nulls":8},""]
{"$rows_left_out":27}
{"sheet":"CNPIs Infrastructure Asset","index":9,"n_rows":41,"n_cols":13,"rows_kept":41,"hidden":true,"merged":[[1,0,1,12],[2,0,2,12],[3,0,3,12],[4,1,4,3],[4,4,4,9],[5,1,5,3],[5,4,5,7],[7,1,21,1],[7,2,7,5],[8,2,8,9],[9,2,9,5],[10,2,10,5],[11,2,11,5],[12,2,12,5],[13,2,13,5],[14,2,14,5],[15,2,15,9],[16,2,16,5],[17,2,17,5],[18,2,18,5],[19,2,19,5],[20,2,20,5],[21,2,21,5],[22,1,22,6],[23,1,26,1],[23,2,23,5],[24,2,24,5],[25,2,25,5],[26,2,26,5],[28,1,33,1],[28,2,28,5],[29,2,29,5],[30,2,30,5],[31,2,31,5],[32,2,32,5],[33,2,33,5],[35,1,38,1],[35,2,35,5],[36,2,36,5],[37,2,37,5],[38,2,38,5],[41,1,41,12]]}
[]
["Module 3, Section B: Community National Performance Indicators (CNPIs) - Data Entry Form"]
["Goal 2: Communities where people with low incomes live are healthy and offer economic opportunity."]
["Infrastructure and Asset Building Indicators"]
[null,"Name of CSBG Eligible Entity: ",null,null,{"$f":"IF(M3AgencyName=\"\",\"\",M3AgencyName)","v":"Alabama Council on Human Relations, Inc."}]
[null,"State:",null,null,{"$f":"IF(M3StateName=\"\",\"\",M3StateName)","v":"Alabama"},{"$nulls":3},"UEI:",{"$f":"IF(M3UEI=\"\",\"\",M3UEI)","v":"183860386"}]
[]
[null,"Counts\n of Change","Counts of Change for Infrastructure and Asset Building Indicators (CNPI 3)",{"$nulls":3},"I.)  Identified Community\n(auto-populated)","II.)  Target \n(#)","III.)  Actual Results\n(#)","IV.) Performance target accuracy \n(% auto calculated)"]
[null,null,"CNPI 3a Number of new accessible assets/resources created in the identified community:"]
[null,null,"CNPI 3a.1 Commercial",{"$nulls":6},{"$f":"IFERROR(ROUND(I10/H10,2),\"\")","v":""}]
{"$rows_left_out":32}
{"sheet":"CNPIs Housing","index":10,"n_rows":31,"n_cols":12,"rows_kept":31,"hidden":true,"merged":[[1,1,1,11],[2,1,2,11],[3,1,3,11],[4,1,4,3],[4,4,4,9],[5,1,5,3],[5,4,5,7],[7,1,11,1],[7,2,7,7],[8,2,8,7],[9,2,9,7],[10,2,10,7],[11,2,11,7],[13,1,16,1],[13,2,13,7],[14,2,14,7],[15,2,15,7],[16,2,16,7],[18,1,23,1],[18,2,18,4],[19,2,19,4],[20,2,20,4],[21,2,21,4],[22,2,22,4],[23,2,23,4],[25,1,28,1],[25,2,25,4],[26,2,26,4],[27,2,27,4],[28,2,28,4],[31,1,31,11]]}
[]
[null,"Module 3, Section B: Community National Performance Indicators (CNPIs) - Data Entry Form"]
[null,"Goal 2: Communities where people with low incomes live are healthy and offer economic opportunity."]
[null,"Housing Indicators"]
[null,"Name of CSBG Eligible Entity: ",null,null,{"$f":"IF(M3AgencyName=\"\",\"\",M3AgencyName)","v":"Alabama Council on Human Relations, Inc."}]
[null,"State:",null,null,{"$f":"IF(M3StateName=\"\",\"\",M3StateName)","v":"Alabama"},{"$nulls":3},"UEI:",{"$f":"IF(M3UEI=\"\",\"\",M3UEI)","v":"183860386"}]
[]
[null,"Counts\n of Change","Counts of Change for Housing Indicators (CNPI 4)",{"$nulls":5},"I.)  Identified Community\n(auto-populated)","II.)  Target \n(#)","III.)  Actual Results\n(#)","IV.) Performance target accuracy \n(% auto calculated)"]
[null,null,"CNPI 4a Number of safe and affordable housing units developed in the identified community (e.g. built or set aside units for people with low incomes).",{"$nulls":8},{"$f":"IFERROR(ROUND(K9/J9,2),\"\")","v":""}]
[null,null,"CNPI 4b Number of safe and affordable housing units maintained  and/or improved through WAP or other rehabilitation efforts in the identified community. ",{"$nulls":8},{"$f":"IFERROR(ROUND(K10/J10,2),\"\")","v":""}]
{"$rows_left_out":22}
{"sheet":"CNPIs Health and Social","index":11,"n_rows":47,"n_cols":12,"rows_kept":47,"hidden":true,"merged":[[1,1,1,11],[2,1,2,11],[3,1,3,11],[4,1,4,3],[4,4,4,9],[5,1,5,3],[5,4,5,7],[7,1,12,1],[7,2,7,7],[8,2,8,7],[9,2,9,7],[10,2,10,7],[11,2,11,7],[12,2,12,7],[14,1,17,1],[14,2,14,7],[15,2,15,7],[16,2,16,7],[17,2,17,7],[19,1,24,1],[19,2,19,4],[20,2,20,4],[21,2,21,4],[22,2,22,4],[23,2,23,4],[24,2,24,4],[25,1,33,1],[25,2,25,4],[26,2,26,4],[27,2,27,4],[28,2,28,4],[29,2,29,4],[30,2,30,4],[31,2,31,4],[32,2,32,4],[33,2,33,4],[35,1,39,1],[35,2,35,4],[36,2,36,4],[37,2,37,4],[38,2,38,4],[39,2,39,4],[41,1,44,1],[41,2,41,4],[42,2,42,4],[43,2,43,4],[44,2,44,4],[47,1,47,11]]}
[]
[null,"Module 3, Section B: Community National Performance Indicators (CNPIs) - Data Entry Form"]
[null,"Goal 2: Communities where people with low incomes live are healthy and offer economic opportunity."]
[null,"Health and Social/Behavioral Indicators"]
[null,"Name of CSBG Eligible Entity: ",null,null,{"$f":"IF(M3AgencyName=\"\",\"\",M3AgencyName)","v":"Alabama Council on Human Relations, Inc."}]
[null,"State:",null,null,{"$f":"IF(M3StateName=\"\",\"\",M3StateName)","v":"Alabama"},{"$nulls":3},"UEI:",{"$f":"IF(M3UEI=\"\",\"\",M3UEI)","v":"183860386"}]
[]
[null,"Counts\n of Change","Counts of Change for Health and Social/Behavioral Indicators (CNPI 5)",{"$nulls":5},"I.)  Identified Community\n(auto-populated)","II.)  Target \n(#)","III.)  Actual Results\n(#)","IV.) Performance target accuracy \n(% auto calculated)"]
[null,null,"CNPI 5a Number of accessible and affordable physical health assets or resources created in the identified community. ",{"$nulls":8},{"$f":"IFERROR(ROUND(K9/J9,2),\"\")","v":""}]
[null,null,"CNPI 5b Number of accessible and affordable behavioral and mental health assets or resources created in the identified community.     ",{"$nulls":8},{"$f":"IFERROR(ROUND(K10/J10,2),\"\")","v":""}]
{"$rows_left_out":38}
{"sheet":"CNPIs G2 Civic Engagement","index":12,"n_rows":23,"n_cols":12,"rows_kept":23,"hidden":true,"merged":[[1,1,1,11],[2,1,2,11],[3,1,3,11],[4,1,4,3],[4,4,4,9],[5,1,5,3],[5,4,5,7],[8,1,11,1],[8,2,8,4],[9,2,9,4],[10,2,10,4],[11,2,11,4],[13,1,16,1],[13,2,13,4],[14,2,14,4],[15,2,15,4],[16,2,16,4],[18,1,21,1],[18,2,18,7],[19,2,19,7],[20,2,20,7],[21,2,21,7],[23,1,23,11]]}
[]
[null,"Module 3, Section B: Community National Performance Indicators (CNPIs) - Data Entry Form"]
[null,"Goal 2: Communities where people with low incomes live are healthy and offer economic opportunity."]
[null,"Civic Engagement and Community Involvement Indicators"]
[null,"Name of CSBG Eligible Entity: ",null,null,{"$f":"IF(M3AgencyName=\"\",\"\",M3AgencyName)","v":"Alabama Council on Human Relations, Inc."}]
[null,"State:",null,null,{"$f":"IF(M3StateName=\"\",\"\",M3StateName)","v":"Alabama"},{"$nulls":3},"UEI:",{"$f":"IF(M3UEI=\"\",\"\",M3UEI)","v":"183860386"}]
[]
[]
[null,"Rates of Change","Rates of Change for Civic Engagement and Community Involvement Indicators - Goal 2 (CNPI 6)",null,null,"I.)  Identified Community\n(auto-populated)","II.) Baseline existing starting point used for comparisons \n(%)","III.)  Target \n(%)","IV.)  Expected % change from baseline \n(Target %  auto calculated) ","V.)  Actual Results\n(%)","VI.)  Actual % change from baseline \n(% auto calculated) ","VII.) Performance target accuracy\n(% auto calculated)"]
[null,null,"CNPI 6 G2a Percent increase of donated time to support the CSBG Eligible Entity's delivery of services and/or implementation of strategies to address conditions of poverty in the identified community. ",{"$nulls":5},{"$f":"IFERROR(ROUND((H10-G10)/G10,2),\"\")","v":""},null,{"$f":"IFERROR(ROUND((J10-G10)/G10,2),\"\")","v":""},{"$f":"IFERROR(ROUND((J10-G10)/(H10-G10),2),\"\")","v":""}]
{"$rows_left_out":14}
{"sheet":"CNPIs G3 Civic Engagement","index":13,"n_rows":22,"n_cols":12,"rows_kept":22,"hidden":true,"merged":[[1,1,1,11],[2,1,2,11],[3,1,3,11],[4,1,4,3],[4,4,4,9],[5,1,5,3],[5,4,5,7],[8,1,10,1],[8,2,8,4],[9,2,9,4],[10,2,10,4],[12,1,15,1],[12,2,12,4],[13,2,13,4],[14,2,14,4],[15,2,15,4],[17,1,20,1],[17,2,17,7],[18,2,18,7],[19,2,19,7],[20,2,20,7],[22,1,22,11]]}
[]
[null,"Module 3, Section B: Community National Performance Indicators (CNPIs) - Data Entry Form"]
[null,"Goal 3: People with low-incomes are engaged and active in building opportunities in communities."]
[null,"Civic Engagement and Community Involvement Indicators"]
[null,"Name of CSBG Eligible Entity: ",null,null,{"$f":"IF(M3AgencyName=\"\",\"\",M3AgencyName)","v":"Alabama Council on Human Relations, Inc."}]
[null,"State:",null,null,{"$f":"IF(M3StateName=\"\",\"\",M3StateName)","v":"Alabama"},{"$nulls":3},"UEI:",{"$f":"IF(M3UEI=\"\",\"\",M3UEI)","v":"183860386"}]
[]
[]
[null,"Rates of Change","Rates of Change for Civic Engagement and Community Involvement Indicators - Goal 3 (CNPI 6)",null,null,"I.)  Identified Community\n(auto-populated)","II.) Baseline existing starting point used for comparisons \n(%)","III.)  Target \n(%)","IV.)  Expected % change from baseline \n(Target %  auto calculated) ","V.)  Actual Results\n(%)","VI.)  Actual % change from baseline \n(% auto calculated) ","VII.) Performance target accuracy\n(% auto calculated)"]
[null,null,"CNPI 6 G3a Percent increase of people with low incomes who support the CSBG Eligible Entity's delivery of service and/or implementation of strategies to address conditions of poverty in the identified community. ",{"$nulls":5},{"$f":"IFERROR(ROUND((H10-G10)/G10,2),\"\")","v":""},null,{"$f":"IFERROR(ROUND((J10-G10)/G10,2),\"\")","v":""},{"$f":"IFERROR(ROUND((J10-G10)/(H10-G10),2),\"\")","v":""}]
{"$rows_left_out":13}
{"sheet":"CNPIs List","index":14,"n_rows":156,"n_cols":2,"rows_kept":156}
[]
[null,"Module 3, Section B. Community National Performance Indicators (Indicators)"]
[]
[null,"Employment Indicators (CNPI 1)"]
["CNPI 1"," Counts of Change for Employment Indicators"]
["CNPI 1a","Number of jobs created to increase opportunities for people with low incomes in the identified community."]
["CNPI 1b","Number of job opportunities maintained in the identified community.            "]
["CNPI 1c","Number of “living wage ” jobs created in the identified community."]
["CNPI 1d","Number of “living wage”  jobs maintained in the  identified community. "]
["CNPI 1e","Number of jobs created in the identified community with a benefit package. "]
{"$rows_left_out":147}
{"sheet":"Strategies List","index":15,"n_rows":112,"n_cols":2,"rows_kept":112}
[]
[null,"Module 3, Section C: Community Strategies List"]
[]
[null,"Employment Strategies (STR 1)"]
["STR 1a","Minimum/Living Wage Campaign "]
["STR 1b","Job Creation/Employment Generation "]
["STR 1c","Job Fairs"]
["STR 1d","Earned Income Tax Credit (EITC) Promotion"]
["STR 1e","Commercial Space Development"]
["STR 1f","Employer Education "]
{"$rows_left_out":103}
{"sheet":"XML Export Map","index":16,"n_rows":850,"n_cols":21,"rows_kept":850,"hidden":true}
[{"$nulls":8},"Field is set by code",{"$nulls":10},"M3B1",{"$f":"_xlfn.XLOOKUP(T1&\"TRUE\",I:I,I:I,\"\")<>\"\"","v":false}]
["Question/Reference","Smartform Range Name","Address","Value","Type","XML Export Name for DB","Max Length","Other","Form Control Name",null,{"$f":"FIND(\"]\",L2)","v":36},{"$f":"CELL(\"address\",INDIRECT(B5))","v":"'[Module 3 SmartForm - 2024-25.xlsm]Status Form'!$C$4"},{"$nulls":7},"M3B2",false]
[{"$nulls":8},"Field can be changed by NASCSP",{"$nulls":10},"M3B3",false]
["leadAgency","M3LeadAgency","=\"XML Export Map\"!$D$4",null,"Text","M3LeadAgency",100,{"$nulls":12},"M3B4",false]
["State Name","M3StateName",{"$f":"\"'='\" & MID(CELL(\"address\",INDIRECT(B5)),$K$2+1,100)","v":"'='Status Form'!$C$4"},{"$f":"M3StateName","v":"Alabama"},"Text","M3StateName",{"$nulls":13},"M3B5",false]
["Agency Name","M3AgencyName",{"$f":"\"'='\" & MID(CELL(\"address\",INDIRECT(B6)),$K$2+1,100)","v":"'='Status Form'!$C$3"},{"$f":"M3AgencyName","v":"Alabama Council on Human Relations, Inc."},"Text","M3AgencyName",{"$nulls":13},"M3B6",false]
["orgAbbrev","M3OrgAbbrev","=\"XML Export Map\"!$D$7","ACF","Text","M3OrgAbbrev"]
["programAcronym","M3ProgramAcronym","=\"XML Export Map\"!$D$8","CSBG","Text","M3ProgramAcronym"]
["UEI Number","M3UEI",{"$f":"\"'='\" & MID(CELL(\"address\",INDIRECT(B9)),$K$2+1,100)","v":"'='Status Form'!$E$4"},{"$f":"M3UEI","v":"183860386"},"Text","M3UEI"]
["reportPeriodStartDate","M3ReportPeriodStartDate","=\"XML Export Map\"!$D$10",null,"Date","M3ReportPeriodStartDate",null,"(Format:YYYY-MM-DD)"]
{"$rows_left_out":841}
{"sheet":"Lookups","index":17,"n_rows":35,"n_cols":13,"rows_kept":35,"hidden":true}
[]
[]
["Project_Year",null,"Expected_Duration",null,null,"Domains",null,"Community",null,"Partnership_Type",null,"Memo_Err_Title","Exceeds Maximum Length"]
["Select the Initiative Year",null,"0 years","0 years",null,"Employment",null,"Select the Identified Community",null,"Select the Partnership Type",null,"Memo_Err_Message",{"$f":"\"This field can have a maximum of \" & EditText_MaxLength & \" characters.  It currently has 999999 characters.  Please adjust your entry to be less than the maximum allowed length.\"","v":"This field can have a maximum of 5000 characters.  It currently has 999999 characters.  Please adjust your entry to be less than the maximum allowed length."}]
[1,null,"1 year","2 years",null,"Education and Cognitive Development",null,"Neighborhood",null,"Independent CAA Initiative"]
[2,null,"2 years","3 years",null,"Infrastructure Asset",null,"City",null,"CAA is the core organizer of multi-partner Initiative",null,"OtherText","Enter other description…"]
[3,null,"3 years","4 years",null,"Housing",null,"School District",null,"CAA is one of multiple active investors and partners"]
[4,null,"4 years","5 years",null,"Health and Social/Behavioral Development",null,"Service Area"]
[5,null,"5 years","6 years",null,"Civic Engagement and Community Involvement",null,"County",null,"Reporting_Status"]
[6,null,"6 years","7 years",{"$nulls":3},"State",null,"Select the Reporting Status"]
{"$rows_left_out":25}